Diagnosed failure

Parameters/TestRpc.TestCallWithChainCertAndChainCA/SSL_UnixSocket: /data0/somelongdirectorytoavoidrpathissues/src/kudu/src/kudu/rpc/rpc-test.cc:270: Failure
Failed
Bad status: Runtime error: could not verify certificate chain (error with cert: subject=CN = localhost, ST = sadfjas, C = AS, emailAddress = sdflkdsajf, O = lskdfjlsad, OU = sldfkja, issuer=C = AS, ST = ASDfkjdhf, L = lskdjf, O = saldfja, OU = skdjf, CN = localhost, emailAddress = sadjflkadsj): : certificate has expired
Google Test trace:
/data0/somelongdirectorytoavoidrpathissues/src/kudu/src/kudu/rpc/rpc-test.cc:267: Connecting to unix:/tmp/dist-test-taskGoubtK/test-tmp/rpc-test-d058dca6e9ae4552b98c03fd69ed9610.sock
I20260926 06:59:03.441557  5770 test_util.cc:175] -----------------------------------------------
I20260926 06:59:03.441604  5770 test_util.cc:176] Had fatal failures, leaving test files at /tmp/dist-test-taskGoubtK/test-tmp/rpc-test.6.Parameters_TestRpc.TestCallWithChainCertAndChainCA_SSL_UnixSocket.1790405943375361-5770-0

Full log

Note: This is test shard 7 of 8.
[==========] Running 21 tests from 2 test suites.
[----------] Global test environment set-up.
[----------] 20 tests from Parameters/TestRpc
[ RUN      ] Parameters/TestRpc.TestMessengerCreateDestroy/SSL_UnixSocket
WARNING: Logging before InitGoogleLogging() is written to STDERR
I20260926 06:59:03.397549  5770 rpc-test.cc:169] started messenger TestCreateDestroy
[       OK ] Parameters/TestRpc.TestMessengerCreateDestroy/SSL_UnixSocket (20 ms)
[ RUN      ] Parameters/TestRpc.TestNegotiationDeadlock/SSL_UnixSocket
I20260926 06:59:03.423337  5790 acceptor_pool.cc:254] collecting diagnostics on the listening RPC socket unix:/tmp/dist-test-taskGoubtK/test-tmp/rpc-test-37652af237e24aa390dcc4f45f2f0542.sock every 8 connection(s)
I20260926 06:59:03.423337  5791 acceptor_pool.cc:254] collecting diagnostics on the listening RPC socket unix:/tmp/dist-test-taskGoubtK/test-tmp/rpc-test-37652af237e24aa390dcc4f45f2f0542.sock every 8 connection(s)
[       OK ] Parameters/TestRpc.TestNegotiationDeadlock/SSL_UnixSocket (30 ms)
[ RUN      ] Parameters/TestRpc.TestCallWithChainCertAndChainCA/SSL_UnixSocket
I20260926 06:59:03.437832  5806 acceptor_pool.cc:254] collecting diagnostics on the listening RPC socket unix:/tmp/dist-test-taskGoubtK/test-tmp/rpc-test-d058dca6e9ae4552b98c03fd69ed9610.sock every 8 connection(s)
I20260926 06:59:03.437896  5807 acceptor_pool.cc:254] collecting diagnostics on the listening RPC socket unix:/tmp/dist-test-taskGoubtK/test-tmp/rpc-test-d058dca6e9ae4552b98c03fd69ed9610.sock every 8 connection(s)
/data0/somelongdirectorytoavoidrpathissues/src/kudu/src/kudu/rpc/rpc-test.cc:270: Failure
Failed
Bad status: Runtime error: could not verify certificate chain (error with cert: subject=CN = localhost, ST = sadfjas, C = AS, emailAddress = sdflkdsajf, O = lskdfjlsad, OU = sldfkja, issuer=C = AS, ST = ASDfkjdhf, L = lskdjf, O = saldfja, OU = skdjf, CN = localhost, emailAddress = sadjflkadsj): : certificate has expired
Google Test trace:
/data0/somelongdirectorytoavoidrpathissues/src/kudu/src/kudu/rpc/rpc-test.cc:267: Connecting to unix:/tmp/dist-test-taskGoubtK/test-tmp/rpc-test-d058dca6e9ae4552b98c03fd69ed9610.sock
I20260926 06:59:03.441557  5770 test_util.cc:175] -----------------------------------------------
I20260926 06:59:03.441604  5770 test_util.cc:176] Had fatal failures, leaving test files at /tmp/dist-test-taskGoubtK/test-tmp/rpc-test.6.Parameters_TestRpc.TestCallWithChainCertAndChainCA_SSL_UnixSocket.1790405943375361-5770-0
[  FAILED  ] Parameters/TestRpc.TestCallWithChainCertAndChainCA/SSL_UnixSocket, where GetParam() = (true, true) (12 ms)
[ RUN      ] Parameters/TestRpc.TestCallWithPasswordProtectedKey/SSL_UnixSocket
I20260926 06:59:03.459291  5831 acceptor_pool.cc:254] collecting diagnostics on the listening RPC socket unix:/tmp/dist-test-taskGoubtK/test-tmp/rpc-test-061af93a9e514a4b938780d3604ea05d.sock every 8 connection(s)
I20260926 06:59:03.459293  5832 acceptor_pool.cc:254] collecting diagnostics on the listening RPC socket unix:/tmp/dist-test-taskGoubtK/test-tmp/rpc-test-061af93a9e514a4b938780d3604ea05d.sock every 8 connection(s)
W20260926 06:59:03.470085  5828 connection.cc:196] Error closing socket: Network error: TlsSocket::Close: Broken pipe
[       OK ] Parameters/TestRpc.TestCallWithPasswordProtectedKey/SSL_UnixSocket (29 ms)
[ RUN      ] Parameters/TestRpc.TestCallToBadServer/SSL_UnixSocket
I20260926 06:59:03.477299  5770 rpc-test.cc:394] Status: Network error: Client connection negotiation failed: client connection to 0.0.0.0:0: connect: Connection refused (error 111)
I20260926 06:59:03.477550  5770 rpc-test.cc:394] Status: Network error: Client connection negotiation failed: client connection to 0.0.0.0:0: connect: Connection refused (error 111)
I20260926 06:59:03.477742  5770 rpc-test.cc:394] Status: Network error: Client connection negotiation failed: client connection to 0.0.0.0:0: connect: Connection refused (error 111)
I20260926 06:59:03.477958  5770 rpc-test.cc:394] Status: Network error: Client connection negotiation failed: client connection to 0.0.0.0:0: connect: Connection refused (error 111)
I20260926 06:59:03.478147  5770 rpc-test.cc:394] Status: Network error: Client connection negotiation failed: client connection to 0.0.0.0:0: connect: Connection refused (error 111)
[       OK ] Parameters/TestRpc.TestCallToBadServer/SSL_UnixSocket (7 ms)
[ RUN      ] Parameters/TestRpc.TestWrongService/SSL_UnixSocket
I20260926 06:59:03.484836  5866 acceptor_pool.cc:254] collecting diagnostics on the listening RPC socket unix:/tmp/dist-test-taskGoubtK/test-tmp/rpc-test-62e6c55c0cb44c6985a2f103b91f8783.sock every 8 connection(s)
I20260926 06:59:03.484824  5867 acceptor_pool.cc:254] collecting diagnostics on the listening RPC socket unix:/tmp/dist-test-taskGoubtK/test-tmp/rpc-test-62e6c55c0cb44c6985a2f103b91f8783.sock every 8 connection(s)
I20260926 06:59:03.493244  5863 messenger.cc:345] service WrongServiceName not registered on TestServer
[       OK ] Parameters/TestRpc.TestWrongService/SSL_UnixSocket (16 ms)
[ RUN      ] Parameters/TestRpc.TestConnectionKeepalive/SSL_UnixSocket
I20260926 06:59:03.508824  5889 acceptor_pool.cc:254] collecting diagnostics on the listening RPC socket unix:/tmp/dist-test-taskGoubtK/test-tmp/rpc-test-415db74c752c4df7b398fcc16255afc0.sock every 8 connection(s)
I20260926 06:59:03.508874  5890 acceptor_pool.cc:254] collecting diagnostics on the listening RPC socket unix:/tmp/dist-test-taskGoubtK/test-tmp/rpc-test-415db74c752c4df7b398fcc16255afc0.sock every 8 connection(s)
I20260926 06:59:03.509070  5770 rpc-test.cc:488] Connecting to unix:/tmp/dist-test-taskGoubtK/test-tmp/rpc-test-415db74c752c4df7b398fcc16255afc0.sock
W20260926 06:59:03.995818  5902 connection.cc:196] Error closing socket: Network error: TlsSocket::Close: Broken pipe
[       OK ] Parameters/TestRpc.TestConnectionKeepalive/SSL_UnixSocket (1057 ms)
[ RUN      ] Parameters/TestRpc.TestClientConnectionMetrics/SSL_UnixSocket
I20260926 06:59:04.557729  5914 acceptor_pool.cc:254] collecting diagnostics on the listening RPC socket unix:/tmp/dist-test-taskGoubtK/test-tmp/rpc-test-f8d96ba42f854ab29e8842cc52c9f3e4.sock every 8 connection(s)
I20260926 06:59:04.557822  5915 acceptor_pool.cc:254] collecting diagnostics on the listening RPC socket unix:/tmp/dist-test-taskGoubtK/test-tmp/rpc-test-f8d96ba42f854ab29e8842cc52c9f3e4.sock every 8 connection(s)
I20260926 06:59:04.557964  5770 rpc-test.cc:569] Connecting to unix:/tmp/dist-test-taskGoubtK/test-tmp/rpc-test-f8d96ba42f854ab29e8842cc52c9f3e4.sock
W20260926 06:59:13.035204  5911 connection.cc:196] Error closing socket: Network error: TlsSocket::Close: Broken pipe
[       OK ] Parameters/TestRpc.TestClientConnectionMetrics/SSL_UnixSocket (8484 ms)
[ RUN      ] Parameters/TestRpc.TestCredentialsPolicy/SSL_UnixSocket
I20260926 06:59:13.053709  5937 acceptor_pool.cc:254] collecting diagnostics on the listening RPC socket unix:/tmp/dist-test-taskGoubtK/test-tmp/rpc-test-e0bfbd7a64cd4e53b1196912d2598816.sock every 8 connection(s)
I20260926 06:59:13.053869  5938 acceptor_pool.cc:254] collecting diagnostics on the listening RPC socket unix:/tmp/dist-test-taskGoubtK/test-tmp/rpc-test-e0bfbd7a64cd4e53b1196912d2598816.sock every 8 connection(s)
I20260926 06:59:13.054019  5770 rpc-test.cc:700] Connecting to unix:/tmp/dist-test-taskGoubtK/test-tmp/rpc-test-e0bfbd7a64cd4e53b1196912d2598816.sock
W20260926 06:59:13.081806  5936 connection.cc:196] Error closing socket: Network error: TlsSocket::Close: Broken pipe
[       OK ] Parameters/TestRpc.TestCredentialsPolicy/SSL_UnixSocket (49 ms)
[ RUN      ] Parameters/TestRpc.TestCallLongerThanKeepalive/SSL_UnixSocket
I20260926 06:59:13.097316  5962 acceptor_pool.cc:254] collecting diagnostics on the listening RPC socket unix:/tmp/dist-test-taskGoubtK/test-tmp/rpc-test-6793647247494485bb8c2fb2b14cb52b.sock every 8 connection(s)
I20260926 06:59:13.097359  5963 acceptor_pool.cc:254] collecting diagnostics on the listening RPC socket unix:/tmp/dist-test-taskGoubtK/test-tmp/rpc-test-6793647247494485bb8c2fb2b14cb52b.sock every 8 connection(s)
I20260926 06:59:13.104916  5966 rpc-test-base.h:222] got call: sleep_micros: 3000000 deferred: true
I20260926 06:59:16.105696  5966 rpcz_store.cc:275] Call kudu.rpc.GenericCalculatorService.Sleep from unix:<unnamed> (request call id 0) took 3000 ms. Trace:
I20260926 06:59:16.105794  5966 rpcz_store.cc:276] 0926 06:59:13.104879 (+     0us) service_pool.cc:170] Inserting onto call queue
0926 06:59:13.104900 (+    21us) service_pool.cc:227] Handling call
0926 06:59:16.105682 (+3000782us) inbound_call.cc:173] Queueing success response
Metrics: {}
W20260926 06:59:16.106827  5959 connection.cc:196] Error closing socket: Network error: TlsSocket::Close: Broken pipe
[       OK ] Parameters/TestRpc.TestCallLongerThanKeepalive/SSL_UnixSocket (3021 ms)
[ RUN      ] Parameters/TestRpc.TestRpcSidecar/SSL_UnixSocket
I20260926 06:59:16.130874  5987 acceptor_pool.cc:254] collecting diagnostics on the listening RPC socket unix:/tmp/dist-test-taskGoubtK/test-tmp/rpc-test-76aed3c4dbd34e71b2c52b3196d9a80a.sock every 8 connection(s)
I20260926 06:59:16.130918  5988 acceptor_pool.cc:254] collecting diagnostics on the listening RPC socket unix:/tmp/dist-test-taskGoubtK/test-tmp/rpc-test-76aed3c4dbd34e71b2c52b3196d9a80a.sock every 8 connection(s)
W20260926 06:59:16.173805  5984 connection.cc:196] Error closing socket: Network error: TlsSocket::Close: Broken pipe
[       OK ] Parameters/TestRpc.TestRpcSidecar/SSL_UnixSocket (67 ms)
[ RUN      ] Parameters/TestRpc.TestRpcSidecarLimits/SSL_UnixSocket
I20260926 06:59:17.878157  6012 acceptor_pool.cc:254] collecting diagnostics on the listening RPC socket unix:/tmp/dist-test-taskGoubtK/test-tmp/rpc-test-20cdb1945a7a40779d5ffaa801535baa.sock every 8 connection(s)
I20260926 06:59:17.878201  6013 acceptor_pool.cc:254] collecting diagnostics on the listening RPC socket unix:/tmp/dist-test-taskGoubtK/test-tmp/rpc-test-20cdb1945a7a40779d5ffaa801535baa.sock every 8 connection(s)
W20260926 06:59:17.887794  5770 serialization.cc:72] Serialized kudu.rpc_test.PushStringsRequestPB (2147483654 bytes) is larger than the maximum configured RPC message size (52428800 bytes). Sending anyway, but peer may reject the data.
W20260926 06:59:17.890625  6009 connection.cc:535] server connection from unix:<unnamed> recv error: Network error: RPC frame had a length of 2147483714, but we only support messages up to 52428800 bytes long.
W20260926 06:59:17.890671  6009 connection.cc:158] shutting down server connection from unix:<unnamed> with pending inbound data: 4/2147483714 bytes received; last active 0 ns ago: status Network error: RPC frame had a length of 2147483714, but we only support messages up to 52428800 bytes long.
W20260926 06:59:17.890793  6025 connection.cc:698] client connection to unix:/tmp/dist-test-taskGoubtK/test-tmp/rpc-test-20cdb1945a7a40779d5ffaa801535baa.sock send error: Network error: failed to write to TLS socket: Broken pipe
W20260926 06:59:17.890916  6025 connection.cc:196] Error closing socket: Network error: TlsSocket::Close: Success
I20260926 06:59:17.899166  6038 acceptor_pool.cc:254] collecting diagnostics on the listening RPC socket unix:/tmp/dist-test-taskGoubtK/test-tmp/rpc-test-20cdb1945a7a40779d5ffaa801535baa.sock every 8 connection(s)
I20260926 06:59:17.899153  6037 acceptor_pool.cc:254] collecting diagnostics on the listening RPC socket unix:/tmp/dist-test-taskGoubtK/test-tmp/rpc-test-20cdb1945a7a40779d5ffaa801535baa.sock every 8 connection(s)
W20260926 06:59:22.150995  6034 connection.cc:577] server connection from unix:<unnamed>: received bad data: 'Corruption: Invalid packet: message had a length of 2147483710, but we only support messages up to 2147483647 bytes
'
W20260926 06:59:22.151320  6050 connection.cc:196] Error closing socket: Network error: TlsSocket::Close: Broken pipe
[       OK ] Parameters/TestRpc.TestRpcSidecarLimits/SSL_UnixSocket (5978 ms)
[ RUN      ] Parameters/TestRpc.TestCallTimeoutDoesntAffectNegotiation/SSL_UnixSocket
I20260926 06:59:22.165503  6062 acceptor_pool.cc:254] collecting diagnostics on the listening RPC socket unix:/tmp/dist-test-taskGoubtK/test-tmp/rpc-test-1b3ee51af770447bba2b4e807ec3501c.sock every 8 connection(s)
I20260926 06:59:22.165547  6063 acceptor_pool.cc:254] collecting diagnostics on the listening RPC socket unix:/tmp/dist-test-taskGoubtK/test-tmp/rpc-test-1b3ee51af770447bba2b4e807ec3501c.sock every 8 connection(s)
W20260926 06:59:22.172971  6058 negotiation.cc:266] Injecting 500ms delay in negotiation
I20260926 06:59:22.223270  5770 rpc-test-base.h:595] status: Timed out: connection negotiation to unix:/tmp/dist-test-taskGoubtK/test-tmp/rpc-test-1b3ee51af770447bba2b4e807ec3501c.sock for RPC Sleep timed out after 0.050s (ON_OUTBOUND_QUEUE), seconds elapsed: 0.050565
[       OK ] Parameters/TestRpc.TestCallTimeoutDoesntAffectNegotiation/SSL_UnixSocket (524 ms)
[ RUN      ] Parameters/TestRpc.TestRpcHandlerLatencyMetric/SSL_UnixSocket
I20260926 06:59:22.685070  6087 acceptor_pool.cc:254] collecting diagnostics on the listening RPC socket unix:/tmp/dist-test-taskGoubtK/test-tmp/rpc-test-e3a40daa3e624400abee109824676b3b.sock every 8 connection(s)
I20260926 06:59:22.685230  6088 acceptor_pool.cc:254] collecting diagnostics on the listening RPC socket unix:/tmp/dist-test-taskGoubtK/test-tmp/rpc-test-e3a40daa3e624400abee109824676b3b.sock every 8 connection(s)
I20260926 06:59:22.733358  5770 rpc-test.cc:1236] Sleep() min lat: 20263
I20260926 06:59:22.733422  5770 rpc-test.cc:1237] Sleep() mean lat: 20263
I20260926 06:59:22.733448  5770 rpc-test.cc:1238] Sleep() max lat: 20263
I20260926 06:59:22.733461  5770 rpc-test.cc:1239] Sleep() #calls: 1
[       OK ] Parameters/TestRpc.TestRpcHandlerLatencyMetric/SSL_UnixSocket (56 ms)
[ RUN      ] Parameters/TestRpc.TimedOutOnResponseMetricServiceQueue/SSL_UnixSocket
I20260926 06:59:22.755038  6113 acceptor_pool.cc:254] collecting diagnostics on the listening RPC socket unix:/tmp/dist-test-taskGoubtK/test-tmp/rpc-test-6ae18b43d3ab45729c3e661476aa5d86.sock every 8 connection(s)
I20260926 06:59:22.755081  6114 acceptor_pool.cc:254] collecting diagnostics on the listening RPC socket unix:/tmp/dist-test-taskGoubtK/test-tmp/rpc-test-6ae18b43d3ab45729c3e661476aa5d86.sock every 8 connection(s)
W20260926 06:59:22.825912  6115 rpcz_store.cc:267] Call kudu.rpc_test.CalculatorService.Sleep from unix:<unnamed> (request call id 2) took 20 ms (client timeout 20 ms). Trace:
W20260926 06:59:22.826042  6115 rpcz_store.cc:269] 0926 06:59:22.805671 (+     0us) service_pool.cc:170] Inserting onto call queue
0926 06:59:22.825872 (+ 20201us) service_pool.cc:214] Skipping call since client already timed out
0926 06:59:22.825883 (+    11us) inbound_call.cc:173] Queueing failure response
Metrics: {}
[       OK ] Parameters/TestRpc.TimedOutOnResponseMetricServiceQueue/SSL_UnixSocket (92 ms)
[ RUN      ] Parameters/TestRpc.RpcPendingConnectionsMetric/SSL_UnixSocket
I20260926 06:59:22.829078  6136 acceptor_pool.cc:254] collecting diagnostics on the listening RPC socket 0.0.0.0:34703 every 8 connection(s)
I20260926 06:59:22.829154  6137 acceptor_pool.cc:254] collecting diagnostics on the listening RPC socket 0.0.0.0:34703 every 8 connection(s)
W20260926 06:59:22.829720  6132 negotiation.cc:337] Failed RPC negotiation. Trace:
0926 06:59:22.829541 (+     0us) reactor.cc:625] Submitting negotiation task for server connection from 127.0.0.1:56754 (local address 127.0.0.1:34703)
0926 06:59:22.829590 (+    49us) server_negotiation.cc:206] Beginning negotiation
0926 06:59:22.829591 (+     1us) server_negotiation.cc:399] Waiting for connection header
0926 06:59:22.829674 (+    83us) negotiation.cc:327] Negotiation complete: Network error: Server connection negotiation failed: server connection from 127.0.0.1:56754: BlockingRecv error: recv got EOF from 127.0.0.1:56754 (error 108)
Metrics: {"server-negotiator.queue_time_us":14}
[       OK ] Parameters/TestRpc.RpcPendingConnectionsMetric/SSL_UnixSocket (13 ms)
[ RUN      ] Parameters/TestRpc.TestRpcContextClientDeadline/SSL_UnixSocket
I20260926 06:59:22.847972  6152 acceptor_pool.cc:254] collecting diagnostics on the listening RPC socket unix:/tmp/dist-test-taskGoubtK/test-tmp/rpc-test-0742b4cf24fd4268b7fd6cd4461c203a.sock every 8 connection(s)
I20260926 06:59:22.848023  6153 acceptor_pool.cc:254] collecting diagnostics on the listening RPC socket unix:/tmp/dist-test-taskGoubtK/test-tmp/rpc-test-0742b4cf24fd4268b7fd6cd4461c203a.sock every 8 connection(s)
[       OK ] Parameters/TestRpc.TestRpcContextClientDeadline/SSL_UnixSocket (39 ms)
[ RUN      ] Parameters/TestRpc.TestApplicationFeatureFlagUnsupportedServer/SSL_UnixSocket
I20260926 06:59:22.894042  6177 acceptor_pool.cc:254] collecting diagnostics on the listening RPC socket unix:/tmp/dist-test-taskGoubtK/test-tmp/rpc-test-88624bc6c4834fef93e111beba3209de.sock every 8 connection(s)
I20260926 06:59:22.894091  6178 acceptor_pool.cc:254] collecting diagnostics on the listening RPC socket unix:/tmp/dist-test-taskGoubtK/test-tmp/rpc-test-88624bc6c4834fef93e111beba3209de.sock every 8 connection(s)
[       OK ] Parameters/TestRpc.TestApplicationFeatureFlagUnsupportedServer/SSL_UnixSocket (32 ms)
[ RUN      ] Parameters/TestRpc.TestCancellationAsync/SSL_UnixSocket
I20260926 06:59:22.921516  6202 acceptor_pool.cc:254] collecting diagnostics on the listening RPC socket unix:/tmp/dist-test-taskGoubtK/test-tmp/rpc-test-474553112fc94f68b45b5cce1da5b13f.sock every 8 connection(s)
I20260926 06:59:22.921581  6203 acceptor_pool.cc:254] collecting diagnostics on the listening RPC socket unix:/tmp/dist-test-taskGoubtK/test-tmp/rpc-test-474553112fc94f68b45b5cce1da5b13f.sock every 8 connection(s)
I20260926 06:59:22.921753  5770 rpc-test.cc:1716] Connecting to unix:/tmp/dist-test-taskGoubtK/test-tmp/rpc-test-474553112fc94f68b45b5cce1da5b13f.sock
I20260926 06:59:22.933121  5770 test_util.cc:268] Using random seed: 1600955262
I20260926 06:59:22.946520  6206 rpc-test-base.h:240] got call: sleep_micros: 500 pattern: 4294967295 num_repetitions: 2097152 sidecar_idx: 0
I20260926 06:59:22.956683  6206 rpc-test-base.h:240] got call: sleep_micros: 500 pattern: 4294967295 num_repetitions: 2097152 sidecar_idx: 0
I20260926 06:59:22.966845  6206 rpc-test-base.h:240] got call: sleep_micros: 500 pattern: 4294967295 num_repetitions: 2097152 sidecar_idx: 0
I20260926 06:59:22.976992  6206 rpc-test-base.h:240] got call: sleep_micros: 500 pattern: 4294967295 num_repetitions: 2097152 sidecar_idx: 0
I20260926 06:59:22.987319  6206 rpc-test-base.h:240] got call: sleep_micros: 500 pattern: 4294967295 num_repetitions: 2097152 sidecar_idx: 0
I20260926 06:59:22.997529  6206 rpc-test-base.h:240] got call: sleep_micros: 500 pattern: 4294967295 num_repetitions: 2097152 sidecar_idx: 0
I20260926 06:59:23.007606  6206 rpc-test-base.h:240] got call: sleep_micros: 500 pattern: 4294967295 num_repetitions: 2097152 sidecar_idx: 0
I20260926 06:59:23.017756  6206 rpc-test-base.h:240] got call: sleep_micros: 500 pattern: 4294967295 num_repetitions: 2097152 sidecar_idx: 0
W20260926 06:59:23.020911  6199 connection.cc:441] server connection from unix:<unnamed> torn down before Call kudu.rpc.GenericCalculatorService.SleepWithSidecar from unix:<unnamed> (request call id 9) could send its response
[       OK ] Parameters/TestRpc.TestCancellationAsync/SSL_UnixSocket (108 ms)
[ RUN      ] Parameters/TestRpc.TestPerformanceBySocketType/SSL_UnixSocket
I20260926 06:59:23.053750  6227 acceptor_pool.cc:254] collecting diagnostics on the listening RPC socket unix:/tmp/dist-test-taskGoubtK/test-tmp/rpc-test-515179e7c6ed43b583389e604a4c6fe6.sock every 8 connection(s)
I20260926 06:59:23.053797  6228 acceptor_pool.cc:254] collecting diagnostics on the listening RPC socket unix:/tmp/dist-test-taskGoubtK/test-tmp/rpc-test-515179e7c6ed43b583389e604a4c6fe6.sock every 8 connection(s)
I20260926 06:59:23.054001  5770 rpc-test.cc:1846] Connecting to unix:/tmp/dist-test-taskGoubtK/test-tmp/rpc-test-515179e7c6ed43b583389e604a4c6fe6.sock
I20260926 06:59:24.314411  5770 rpc-test.cc:1859] Sending 1024MB via ssl-enabled unix socket: real 1.249s	user 1.336s	sys 0.924s
I20260926 06:59:25.549357  5770 rpc-test.cc:1859] Sending 1024MB via ssl-enabled unix socket: real 1.235s	user 1.495s	sys 0.741s
I20260926 06:59:26.746874  5770 rpc-test.cc:1859] Sending 1024MB via ssl-enabled unix socket: real 1.197s	user 1.251s	sys 0.921s
I20260926 06:59:27.952427  5770 rpc-test.cc:1859] Sending 1024MB via ssl-enabled unix socket: real 1.205s	user 1.366s	sys 0.819s
I20260926 06:59:29.154877  5770 rpc-test.cc:1859] Sending 1024MB via ssl-enabled unix socket: real 1.202s	user 1.276s	sys 0.887s
W20260926 06:59:29.155503  6224 connection.cc:196] Error closing socket: Network error: TlsSocket::Close: Broken pipe
[       OK ] Parameters/TestRpc.TestPerformanceBySocketType/SSL_UnixSocket (6134 ms)
[----------] 20 tests from Parameters/TestRpc (25779 ms total)

[----------] 1 test from Parameters/TestRpcSocketTxRxQueue
[ RUN      ] Parameters/TestRpcSocketTxRxQueue.AcceptorRxQueueSizeMetric/0
I20260926 06:59:29.158485  6252 acceptor_pool.cc:254] collecting diagnostics on the listening RPC socket 0.0.0.0:36229 every 1 connection(s)
I20260926 06:59:29.158566  6253 acceptor_pool.cc:254] collecting diagnostics on the listening RPC socket 0.0.0.0:36229 every 1 connection(s)
W20260926 06:59:29.159080  6248 negotiation.cc:337] Failed RPC negotiation. Trace:
0926 06:59:29.158946 (+     0us) reactor.cc:625] Submitting negotiation task for server connection from 127.0.0.1:38236 (local address 127.0.0.1:36229)
0926 06:59:29.158989 (+    43us) server_negotiation.cc:206] Beginning negotiation
0926 06:59:29.158991 (+     2us) server_negotiation.cc:399] Waiting for connection header
0926 06:59:29.159056 (+    65us) negotiation.cc:327] Negotiation complete: Network error: Server connection negotiation failed: server connection from 127.0.0.1:38236: BlockingRecv error: recv got EOF from 127.0.0.1:38236 (error 108)
Metrics: {"server-negotiator.queue_time_us":15}
[       OK ] Parameters/TestRpcSocketTxRxQueue.AcceptorRxQueueSizeMetric/0 (4 ms)
[----------] 1 test from Parameters/TestRpcSocketTxRxQueue (4 ms total)

[----------] Global test environment tear-down
[==========] 21 tests from 2 test suites ran. (25783 ms total)
[  PASSED  ] 20 tests.
[  FAILED  ] 1 test, listed below:
[  FAILED  ] Parameters/TestRpc.TestCallWithChainCertAndChainCA/SSL_UnixSocket, where GetParam() = (true, true)

 1 FAILED TEST