Diagnosed failure

Parameters/TestRpc.TestCallWithChainCertAndRootCA/SSL_UnixSocket: /data0/somelongdirectorytoavoidrpathissues/src/kudu/src/kudu/rpc/rpc-test.cc:303: Failure
Failed
Bad status: Runtime error: could not verify certificate chain (error with cert: subject=CN = localhost, ST = sadfjas, C = AS, emailAddress = sdflkdsajf, O = lskdfjlsad, OU = sldfkja, issuer=C = AS, ST = ASDfkjdhf, L = lskdjf, O = saldfja, OU = skdjf, CN = localhost, emailAddress = sadjflkadsj): : certificate has expired
Google Test trace:
/data0/somelongdirectorytoavoidrpathissues/src/kudu/src/kudu/rpc/rpc-test.cc:300: Connecting to unix:/tmp/dist-test-taskhaUp3y/test-tmp/rpc-test-d37c2d33727140889b39580449e0cfe7.sock
I20260929 21:42:53.809222  4470 test_util.cc:175] -----------------------------------------------
I20260929 21:42:53.809384  4470 test_util.cc:176] Had fatal failures, leaving test files at /tmp/dist-test-taskhaUp3y/test-tmp/rpc-test.2.Parameters_TestRpc.TestCallWithChainCertAndRootCA_SSL_UnixSocket.1790718170176807-4470-0

Full log

Note: This is test shard 3 of 8.
[==========] Running 21 tests from 2 test suites.
[----------] Global test environment set-up.
[----------] 1 test from TestRpc
[ RUN      ] TestRpc.TestNegotiationTimeout
WARNING: Logging before InitGoogleLogging() is written to STDERR
I20260929 21:42:50.359513  4470 rpc-test-base.h:595] status: Timed out: connection negotiation to 0.0.0.0:39543 for RPC Sleep timed out after 0.100s (ON_OUTBOUND_QUEUE), seconds elapsed: 0.101505
W20260929 21:42:53.509610  4480 negotiation.cc:337] Failed RPC negotiation. Trace:
0929 21:42:50.258836 (+     0us) reactor.cc:625] Submitting negotiation task for client connection to 0.0.0.0:39543 (local address 127.0.0.1:47776)
0929 21:42:50.259442 (+   606us) negotiation.cc:107] Waiting for socket to connect
0929 21:42:50.259486 (+    44us) client_negotiation.cc:174] Beginning negotiation
0929 21:42:50.283783 (+ 24297us) client_negotiation.cc:252] Sending NEGOTIATE NegotiatePB request
0929 21:42:53.508465 (+3224682us) negotiation.cc:327] Negotiation complete: Timed out: Client connection negotiation failed: client connection to 0.0.0.0:39543: received 0 of 4 requested bytes
Metrics: {"client-negotiator.queue_time_us":194}
[       OK ] TestRpc.TestNegotiationTimeout (3287 ms)
[----------] 1 test from TestRpc (3287 ms total)

[----------] 20 tests from Parameters/TestRpc
[ RUN      ] Parameters/TestRpc.TestAcceptorPoolStartStop/SSL_UnixSocket
I20260929 21:42:53.538012  4496 acceptor_pool.cc:254] collecting diagnostics on the listening RPC socket unix:/tmp/dist-test-taskhaUp3y/test-tmp/rpc-test-adf8b45e6711438989ab54f27c3a99d1.sock every 8 connection(s)
I20260929 21:42:53.539649  4497 acceptor_pool.cc:254] collecting diagnostics on the listening RPC socket unix:/tmp/dist-test-taskhaUp3y/test-tmp/rpc-test-adf8b45e6711438989ab54f27c3a99d1.sock every 8 connection(s)
I20260929 21:42:53.587082  4507 acceptor_pool.cc:254] collecting diagnostics on the listening RPC socket unix:/tmp/dist-test-taskhaUp3y/test-tmp/rpc-test-adf8b45e6711438989ab54f27c3a99d1.sock every 8 connection(s)
I20260929 21:42:53.588511  4508 acceptor_pool.cc:254] collecting diagnostics on the listening RPC socket unix:/tmp/dist-test-taskhaUp3y/test-tmp/rpc-test-adf8b45e6711438989ab54f27c3a99d1.sock every 8 connection(s)
I20260929 21:42:53.608376  4518 acceptor_pool.cc:254] collecting diagnostics on the listening RPC socket unix:/tmp/dist-test-taskhaUp3y/test-tmp/rpc-test-adf8b45e6711438989ab54f27c3a99d1.sock every 8 connection(s)
I20260929 21:42:53.609045  4519 acceptor_pool.cc:254] collecting diagnostics on the listening RPC socket unix:/tmp/dist-test-taskhaUp3y/test-tmp/rpc-test-adf8b45e6711438989ab54f27c3a99d1.sock every 8 connection(s)
I20260929 21:42:53.639345  4529 acceptor_pool.cc:254] collecting diagnostics on the listening RPC socket unix:/tmp/dist-test-taskhaUp3y/test-tmp/rpc-test-adf8b45e6711438989ab54f27c3a99d1.sock every 8 connection(s)
I20260929 21:42:53.640015  4530 acceptor_pool.cc:254] collecting diagnostics on the listening RPC socket unix:/tmp/dist-test-taskhaUp3y/test-tmp/rpc-test-adf8b45e6711438989ab54f27c3a99d1.sock every 8 connection(s)
I20260929 21:42:53.679853  4540 acceptor_pool.cc:254] collecting diagnostics on the listening RPC socket unix:/tmp/dist-test-taskhaUp3y/test-tmp/rpc-test-adf8b45e6711438989ab54f27c3a99d1.sock every 8 connection(s)
I20260929 21:42:53.680476  4541 acceptor_pool.cc:254] collecting diagnostics on the listening RPC socket unix:/tmp/dist-test-taskhaUp3y/test-tmp/rpc-test-adf8b45e6711438989ab54f27c3a99d1.sock every 8 connection(s)
[       OK ] Parameters/TestRpc.TestAcceptorPoolStartStop/SSL_UnixSocket (170 ms)
[ RUN      ] Parameters/TestRpc.TestCall/SSL_UnixSocket
I20260929 21:42:53.707891  4553 acceptor_pool.cc:254] collecting diagnostics on the listening RPC socket unix:/tmp/dist-test-taskhaUp3y/test-tmp/rpc-test-e9e5b29dcd2f41399c08fbfd7e1ccb08.sock every 8 connection(s)
I20260929 21:42:53.709993  4554 acceptor_pool.cc:254] collecting diagnostics on the listening RPC socket unix:/tmp/dist-test-taskhaUp3y/test-tmp/rpc-test-e9e5b29dcd2f41399c08fbfd7e1ccb08.sock every 8 connection(s)
I20260929 21:42:53.714600  4470 rpc-test.cc:234] Connecting to unix:/tmp/dist-test-taskhaUp3y/test-tmp/rpc-test-e9e5b29dcd2f41399c08fbfd7e1ccb08.sock
W20260929 21:42:53.765223  4550 connection.cc:196] Error closing socket: Network error: TlsSocket::Close: Broken pipe
[       OK ] Parameters/TestRpc.TestCall/SSL_UnixSocket (86 ms)
[ RUN      ] Parameters/TestRpc.TestCallWithChainCertAndRootCA/SSL_UnixSocket
I20260929 21:42:53.790848  4578 acceptor_pool.cc:254] collecting diagnostics on the listening RPC socket unix:/tmp/dist-test-taskhaUp3y/test-tmp/rpc-test-d37c2d33727140889b39580449e0cfe7.sock every 8 connection(s)
I20260929 21:42:53.791599  4579 acceptor_pool.cc:254] collecting diagnostics on the listening RPC socket unix:/tmp/dist-test-taskhaUp3y/test-tmp/rpc-test-d37c2d33727140889b39580449e0cfe7.sock every 8 connection(s)
/data0/somelongdirectorytoavoidrpathissues/src/kudu/src/kudu/rpc/rpc-test.cc:303: Failure
Failed
Bad status: Runtime error: could not verify certificate chain (error with cert: subject=CN = localhost, ST = sadfjas, C = AS, emailAddress = sdflkdsajf, O = lskdfjlsad, OU = sldfkja, issuer=C = AS, ST = ASDfkjdhf, L = lskdjf, O = saldfja, OU = skdjf, CN = localhost, emailAddress = sadjflkadsj): : certificate has expired
Google Test trace:
/data0/somelongdirectorytoavoidrpathissues/src/kudu/src/kudu/rpc/rpc-test.cc:300: Connecting to unix:/tmp/dist-test-taskhaUp3y/test-tmp/rpc-test-d37c2d33727140889b39580449e0cfe7.sock
I20260929 21:42:53.809222  4470 test_util.cc:175] -----------------------------------------------
I20260929 21:42:53.809384  4470 test_util.cc:176] Had fatal failures, leaving test files at /tmp/dist-test-taskhaUp3y/test-tmp/rpc-test.2.Parameters_TestRpc.TestCallWithChainCertAndRootCA_SSL_UnixSocket.1790718170176807-4470-0
[  FAILED  ] Parameters/TestRpc.TestCallWithChainCertAndRootCA/SSL_UnixSocket, where GetParam() = (true, true) (39 ms)
[ RUN      ] Parameters/TestRpc.TestCallWithBadPasswordProtectedKey/SSL_UnixSocket
[       OK ] Parameters/TestRpc.TestCallWithBadPasswordProtectedKey/SSL_UnixSocket (29 ms)
[ RUN      ] Parameters/TestRpc.TestInvalidMethodCall/SSL_UnixSocket
I20260929 21:42:53.862867  4615 acceptor_pool.cc:254] collecting diagnostics on the listening RPC socket unix:/tmp/dist-test-taskhaUp3y/test-tmp/rpc-test-52ec132245834e8181450e1d72f761ee.sock every 8 connection(s)
I20260929 21:42:53.863602  4616 acceptor_pool.cc:254] collecting diagnostics on the listening RPC socket unix:/tmp/dist-test-taskhaUp3y/test-tmp/rpc-test-52ec132245834e8181450e1d72f761ee.sock every 8 connection(s)
I20260929 21:42:53.866884  4470 rpc-test.cc:406] Connecting to unix:/tmp/dist-test-taskhaUp3y/test-tmp/rpc-test-52ec132245834e8181450e1d72f761ee.sock
[       OK ] Parameters/TestRpc.TestInvalidMethodCall/SSL_UnixSocket (61 ms)
[ RUN      ] Parameters/TestRpc.TestHighFDs/SSL_UnixSocket
I20260929 21:42:54.103856  4640 acceptor_pool.cc:254] collecting diagnostics on the listening RPC socket unix:/tmp/dist-test-taskhaUp3y/test-tmp/rpc-test-577a43fb70464633a98b52a912454528.sock every 8 connection(s)
I20260929 21:42:54.104607  4641 acceptor_pool.cc:254] collecting diagnostics on the listening RPC socket unix:/tmp/dist-test-taskhaUp3y/test-tmp/rpc-test-577a43fb70464633a98b52a912454528.sock every 8 connection(s)
W20260929 21:42:54.136030  4637 connection.cc:196] Error closing socket: Network error: TlsSocket::Close: Broken pipe
[       OK ] Parameters/TestRpc.TestHighFDs/SSL_UnixSocket (248 ms)
[ RUN      ] Parameters/TestRpc.TestConnectionAlwaysKeepalive/SSL_UnixSocket
I20260929 21:42:54.163071  4663 acceptor_pool.cc:254] collecting diagnostics on the listening RPC socket unix:/tmp/dist-test-taskhaUp3y/test-tmp/rpc-test-f1c099a3118d4bacabb5744fb01a8ff8.sock every 8 connection(s)
I20260929 21:42:54.163852  4664 acceptor_pool.cc:254] collecting diagnostics on the listening RPC socket unix:/tmp/dist-test-taskhaUp3y/test-tmp/rpc-test-f1c099a3118d4bacabb5744fb01a8ff8.sock every 8 connection(s)
I20260929 21:42:54.166883  4470 rpc-test.cc:532] Connecting to unix:/tmp/dist-test-taskhaUp3y/test-tmp/rpc-test-f1c099a3118d4bacabb5744fb01a8ff8.sock
[       OK ] Parameters/TestRpc.TestConnectionAlwaysKeepalive/SSL_UnixSocket (3051 ms)
[ RUN      ] Parameters/TestRpc.TestReopenOutboundConnections/SSL_UnixSocket
I20260929 21:42:57.222954  4686 acceptor_pool.cc:254] collecting diagnostics on the listening RPC socket unix:/tmp/dist-test-taskhaUp3y/test-tmp/rpc-test-e8a0fb380607407ea78f729b8ec4880f.sock every 8 connection(s)
I20260929 21:42:57.223687  4687 acceptor_pool.cc:254] collecting diagnostics on the listening RPC socket unix:/tmp/dist-test-taskhaUp3y/test-tmp/rpc-test-e8a0fb380607407ea78f729b8ec4880f.sock every 8 connection(s)
I20260929 21:42:57.226593  4470 rpc-test.cc:658] Connecting to unix:/tmp/dist-test-taskhaUp3y/test-tmp/rpc-test-e8a0fb380607407ea78f729b8ec4880f.sock
W20260929 21:42:57.270505  4685 connection.cc:196] Error closing socket: Network error: TlsSocket::Close: Broken pipe
W20260929 21:42:57.278923  4685 connection.cc:196] Error closing socket: Network error: TlsSocket::Close: Broken pipe
W20260929 21:42:57.287135  4685 connection.cc:196] Error closing socket: Network error: TlsSocket::Close: Broken pipe
W20260929 21:42:57.295687  4685 connection.cc:196] Error closing socket: Network error: TlsSocket::Close: Broken pipe
W20260929 21:42:57.304173  4685 connection.cc:196] Error closing socket: Network error: TlsSocket::Close: Broken pipe
W20260929 21:42:57.312139  4685 connection.cc:196] Error closing socket: Network error: TlsSocket::Close: Broken pipe
W20260929 21:42:57.320133  4685 connection.cc:196] Error closing socket: Network error: TlsSocket::Close: Broken pipe
W20260929 21:42:57.327755  4685 connection.cc:196] Error closing socket: Network error: TlsSocket::Close: Broken pipe
W20260929 21:42:57.336720  4685 connection.cc:196] Error closing socket: Network error: TlsSocket::Close: Broken pipe
W20260929 21:42:57.344779  4685 connection.cc:196] Error closing socket: Network error: TlsSocket::Close: Broken pipe
W20260929 21:42:57.353633  4685 connection.cc:196] Error closing socket: Network error: TlsSocket::Close: Broken pipe
W20260929 21:42:57.361629  4685 connection.cc:196] Error closing socket: Network error: TlsSocket::Close: Broken pipe
W20260929 21:42:57.370158  4685 connection.cc:196] Error closing socket: Network error: TlsSocket::Close: Broken pipe
W20260929 21:42:57.378948  4685 connection.cc:196] Error closing socket: Network error: TlsSocket::Close: Broken pipe
W20260929 21:42:57.378990  4686 acceptor_pool.cc:285] unable to collect diagnostics on RPC socket unix:/tmp/dist-test-taskhaUp3y/test-tmp/rpc-test-e8a0fb380607407ea78f729b8ec4880f.sock: Not implemented: netlink diagnostics is currently supported only on IPv4 TCP sockets
W20260929 21:42:57.387292  4685 connection.cc:196] Error closing socket: Network error: TlsSocket::Close: Broken pipe
W20260929 21:42:57.395481  4685 connection.cc:196] Error closing socket: Network error: TlsSocket::Close: Broken pipe
W20260929 21:42:57.403575  4685 connection.cc:196] Error closing socket: Network error: TlsSocket::Close: Broken pipe
W20260929 21:42:57.412050  4685 connection.cc:196] Error closing socket: Network error: TlsSocket::Close: Broken pipe
W20260929 21:42:57.420477  4685 connection.cc:196] Error closing socket: Network error: TlsSocket::Close: Broken pipe
W20260929 21:42:57.429986  4685 connection.cc:196] Error closing socket: Network error: TlsSocket::Close: Broken pipe
W20260929 21:42:57.438688  4685 connection.cc:196] Error closing socket: Network error: TlsSocket::Close: Broken pipe
W20260929 21:42:57.446632  4685 connection.cc:196] Error closing socket: Network error: TlsSocket::Close: Broken pipe
W20260929 21:42:57.456079  4685 connection.cc:196] Error closing socket: Network error: TlsSocket::Close: Broken pipe
W20260929 21:42:57.465458  4685 connection.cc:196] Error closing socket: Network error: TlsSocket::Close: Broken pipe
W20260929 21:42:57.474787  4685 connection.cc:196] Error closing socket: Network error: TlsSocket::Close: Broken pipe
W20260929 21:42:57.482429  4685 connection.cc:196] Error closing socket: Network error: TlsSocket::Close: Broken pipe
W20260929 21:42:57.490087  4685 connection.cc:196] Error closing socket: Network error: TlsSocket::Close: Broken pipe
W20260929 21:42:57.498769  4685 connection.cc:196] Error closing socket: Network error: TlsSocket::Close: Broken pipe
W20260929 21:42:57.507313  4685 connection.cc:196] Error closing socket: Network error: TlsSocket::Close: Broken pipe
W20260929 21:42:57.516094  4685 connection.cc:196] Error closing socket: Network error: TlsSocket::Close: Broken pipe
W20260929 21:42:57.524619  4685 connection.cc:196] Error closing socket: Network error: TlsSocket::Close: Broken pipe
W20260929 21:42:57.534787  4685 connection.cc:196] Error closing socket: Network error: TlsSocket::Close: Broken pipe
[       OK ] Parameters/TestRpc.TestReopenOutboundConnections/SSL_UnixSocket (338 ms)
[ RUN      ] Parameters/TestRpc.TestConnectionNetworkPlane/SSL_UnixSocket
I20260929 21:42:57.570307  4709 acceptor_pool.cc:254] collecting diagnostics on the listening RPC socket unix:/tmp/dist-test-taskhaUp3y/test-tmp/rpc-test-5738e4a657064168bacb37161c0328b1.sock every 8 connection(s)
I20260929 21:42:57.571100  4710 acceptor_pool.cc:254] collecting diagnostics on the listening RPC socket unix:/tmp/dist-test-taskhaUp3y/test-tmp/rpc-test-5738e4a657064168bacb37161c0328b1.sock every 8 connection(s)
I20260929 21:42:57.574129  4470 rpc-test.cc:772] Connecting to unix:/tmp/dist-test-taskhaUp3y/test-tmp/rpc-test-5738e4a657064168bacb37161c0328b1.sock
W20260929 21:42:57.637766  4708 connection.cc:196] Error closing socket: Network error: TlsSocket::Close: Broken pipe
W20260929 21:42:57.638617  4708 connection.cc:196] Error closing socket: Network error: TlsSocket::Close: Broken pipe
[       OK ] Parameters/TestRpc.TestConnectionNetworkPlane/SSL_UnixSocket (103 ms)
[ RUN      ] Parameters/TestRpc.TestTCPKeepalive/SSL_UnixSocket
I20260929 21:42:57.668978  4734 acceptor_pool.cc:254] collecting diagnostics on the listening RPC socket unix:/tmp/dist-test-taskhaUp3y/test-tmp/rpc-test-5ebf5216c1a84aa4b5e9224ef4e1b259.sock every 8 connection(s)
I20260929 21:42:57.669633  4735 acceptor_pool.cc:254] collecting diagnostics on the listening RPC socket unix:/tmp/dist-test-taskhaUp3y/test-tmp/rpc-test-5ebf5216c1a84aa4b5e9224ef4e1b259.sock every 8 connection(s)
I20260929 21:42:57.697553  4738 rpc-test-base.h:222] got call: sleep_micros: 8000000 deferred: true
I20260929 21:43:05.701624  4738 rpcz_store.cc:275] Call kudu.rpc.GenericCalculatorService.Sleep from unix:<unnamed> (request call id 0) took 8004 ms. Trace:
I20260929 21:43:05.702157  4738 rpcz_store.cc:276] 0929 21:42:57.697380 (+     0us) service_pool.cc:170] Inserting onto call queue
0929 21:42:57.697495 (+   115us) service_pool.cc:227] Handling call
0929 21:43:05.701414 (+8003919us) inbound_call.cc:173] Queueing success response
Metrics: {}
W20260929 21:43:05.708451  4731 connection.cc:196] Error closing socket: Network error: TlsSocket::Close: Broken pipe
[       OK ] Parameters/TestRpc.TestTCPKeepalive/SSL_UnixSocket (8073 ms)
[ RUN      ] Parameters/TestRpc.TestMaxSmallSidecars/SSL_UnixSocket
I20260929 21:43:05.742514  4760 acceptor_pool.cc:254] collecting diagnostics on the listening RPC socket unix:/tmp/dist-test-taskhaUp3y/test-tmp/rpc-test-9c5f31679ec1480696d03c1731dcae44.sock every 8 connection(s)
I20260929 21:43:05.743371  4761 acceptor_pool.cc:254] collecting diagnostics on the listening RPC socket unix:/tmp/dist-test-taskhaUp3y/test-tmp/rpc-test-9c5f31679ec1480696d03c1731dcae44.sock every 8 connection(s)
[       OK ] Parameters/TestRpc.TestMaxSmallSidecars/SSL_UnixSocket (187 ms)
[ RUN      ] Parameters/TestRpc.TestCallTimeout/SSL_UnixSocket
I20260929 21:43:05.939960  4785 acceptor_pool.cc:254] collecting diagnostics on the listening RPC socket unix:/tmp/dist-test-taskhaUp3y/test-tmp/rpc-test-0a4c9168a7214568b0dbe3b21196ffd2.sock every 8 connection(s)
I20260929 21:43:05.940677  4786 acceptor_pool.cc:254] collecting diagnostics on the listening RPC socket unix:/tmp/dist-test-taskhaUp3y/test-tmp/rpc-test-0a4c9168a7214568b0dbe3b21196ffd2.sock every 8 connection(s)
I20260929 21:43:05.960299  4470 rpc-test-base.h:595] status: Timed out: connection negotiation to unix:/tmp/dist-test-taskhaUp3y/test-tmp/rpc-test-0a4c9168a7214568b0dbe3b21196ffd2.sock for RPC Sleep timed out after 0.000s (ON_OUTBOUND_QUEUE), seconds elapsed: 0.0022104
I20260929 21:43:05.968722  4789 rpc-test-base.h:222] got call: sleep_micros: 700000
I20260929 21:43:06.162055  4470 rpc-test-base.h:595] status: Timed out: Sleep RPC to unix:/tmp/dist-test-taskhaUp3y/test-tmp/rpc-test-0a4c9168a7214568b0dbe3b21196ffd2.sock timed out after 0.200s (SENT), seconds elapsed: 0.201468
I20260929 21:43:06.163398  4788 rpc-test-base.h:222] got call: sleep_micros: 2000000
W20260929 21:43:06.669306  4789 rpcz_store.cc:267] Call kudu.rpc.GenericCalculatorService.Sleep from unix:<unnamed> (request call id 1) took 700 ms (client timeout 200 ms). Trace:
W20260929 21:43:06.669613  4789 rpcz_store.cc:269] 0929 21:43:05.968507 (+     0us) service_pool.cc:170] Inserting onto call queue
0929 21:43:05.968604 (+    97us) service_pool.cc:227] Handling call
0929 21:43:06.669239 (+700635us) inbound_call.cc:173] Queueing success response
Metrics: {}
I20260929 21:43:07.664475  4470 rpc-test-base.h:595] status: Timed out: Sleep RPC to unix:/tmp/dist-test-taskhaUp3y/test-tmp/rpc-test-0a4c9168a7214568b0dbe3b21196ffd2.sock timed out after 1.500s (SENT), seconds elapsed: 1.50208
W20260929 21:43:08.163883  4788 rpcz_store.cc:267] Call kudu.rpc.GenericCalculatorService.Sleep from unix:<unnamed> (request call id 2) took 2000 ms (client timeout 1500 ms). Trace:
W20260929 21:43:08.164204  4788 rpcz_store.cc:269] 0929 21:43:06.163235 (+     0us) service_pool.cc:170] Inserting onto call queue
0929 21:43:06.163337 (+   102us) service_pool.cc:227] Handling call
0929 21:43:08.163826 (+2000489us) inbound_call.cc:173] Queueing success response
Metrics: {}
W20260929 21:43:08.164739  4782 connection.cc:441] server connection from unix:<unnamed> torn down before Call kudu.rpc.GenericCalculatorService.Sleep from unix:<unnamed> (request call id 2) could send its response
[       OK ] Parameters/TestRpc.TestCallTimeout/SSL_UnixSocket (2266 ms)
[ RUN      ] Parameters/TestRpc.TestServerShutsDown/SSL_UnixSocket
I20260929 21:43:08.171773  4470 rpc-test.cc:1125] Connecting to 0.0.0.0:33137
W20260929 21:43:08.181074  4802 negotiation.cc:337] Failed RPC negotiation. Trace:
0929 21:43:08.179453 (+     0us) reactor.cc:625] Submitting negotiation task for client connection to 0.0.0.0:33137 (local address 127.0.0.1:55720)
0929 21:43:08.180031 (+   578us) negotiation.cc:107] Waiting for socket to connect
0929 21:43:08.180113 (+    82us) client_negotiation.cc:174] Beginning negotiation
0929 21:43:08.180332 (+   219us) client_negotiation.cc:252] Sending NEGOTIATE NegotiatePB request
0929 21:43:08.180548 (+   216us) negotiation.cc:327] Negotiation complete: Network error: Client connection negotiation failed: client connection to 0.0.0.0:33137: BlockingWrite error: write error: Broken pipe (error 32)
Metrics: {"client-negotiator.queue_time_us":120}
[       OK ] Parameters/TestRpc.TestServerShutsDown/SSL_UnixSocket (13 ms)
[ RUN      ] Parameters/TestRpc.TimedOutOnResponseMetric/SSL_UnixSocket
I20260929 21:43:08.233898  4819 acceptor_pool.cc:254] collecting diagnostics on the listening RPC socket unix:/tmp/dist-test-taskhaUp3y/test-tmp/rpc-test-1670ff00af504192b4e1fed799238da4.sock every 8 connection(s)
I20260929 21:43:08.234658  4820 acceptor_pool.cc:254] collecting diagnostics on the listening RPC socket unix:/tmp/dist-test-taskhaUp3y/test-tmp/rpc-test-1670ff00af504192b4e1fed799238da4.sock every 8 connection(s)
W20260929 21:43:08.474474  4823 rpcz_store.cc:267] Call kudu.rpc_test.CalculatorService.Sleep from unix:<unnamed> (request call id 3) took 50 ms (client timeout 25 ms). Trace:
W20260929 21:43:08.474773  4823 rpcz_store.cc:269] 0929 21:43:08.423969 (+     0us) service_pool.cc:170] Inserting onto call queue
0929 21:43:08.424060 (+    91us) service_pool.cc:227] Handling call
0929 21:43:08.474406 (+ 50346us) inbound_call.cc:173] Queueing success response
Related trace 'test_child':
Metrics: {"test_sleep_us":50000,"child_traces":[["test_child",{"related_trace_metric":1}]]}
W20260929 21:43:08.533476  4823 rpcz_store.cc:267] Call kudu.rpc_test.CalculatorService.Sleep from unix:<unnamed> (request call id 4) took 50 ms (client timeout 50 ms). Trace:
W20260929 21:43:08.533728  4823 rpcz_store.cc:269] 0929 21:43:08.482964 (+     0us) service_pool.cc:170] Inserting onto call queue
0929 21:43:08.483068 (+   104us) service_pool.cc:227] Handling call
0929 21:43:08.533419 (+ 50351us) inbound_call.cc:173] Queueing success response
Related trace 'test_child':
Metrics: {"test_sleep_us":50000,"child_traces":[["test_child",{"related_trace_metric":1}]]}
W20260929 21:43:08.537038  4816 connection.cc:196] Error closing socket: Network error: TlsSocket::Close: Broken pipe
[       OK ] Parameters/TestRpc.TimedOutOnResponseMetric/SSL_UnixSocket (358 ms)
[ RUN      ] Parameters/TestRpc.AcceptorDispatchingTimesMetric/SSL_UnixSocket
I20260929 21:43:08.553273  4844 acceptor_pool.cc:254] collecting diagnostics on the listening RPC socket 0.0.0.0:33623 every 8 connection(s)
I20260929 21:43:08.553870  4845 acceptor_pool.cc:254] collecting diagnostics on the listening RPC socket 0.0.0.0:33623 every 8 connection(s)
W20260929 21:43:08.559991  4840 negotiation.cc:337] Failed RPC negotiation. Trace:
0929 21:43:08.557416 (+     0us) reactor.cc:625] Submitting negotiation task for server connection from 127.0.0.1:48366 (local address 127.0.0.1:33623)
0929 21:43:08.558053 (+   637us) server_negotiation.cc:206] Beginning negotiation
0929 21:43:08.558067 (+    14us) server_negotiation.cc:399] Waiting for connection header
0929 21:43:08.558485 (+   418us) negotiation.cc:327] Negotiation complete: Network error: Server connection negotiation failed: server connection from 127.0.0.1:48366: BlockingRecv error: recv got EOF from 127.0.0.1:48366 (error 108)
Metrics: {"server-negotiator.queue_time_us":148}
[       OK ] Parameters/TestRpc.AcceptorDispatchingTimesMetric/SSL_UnixSocket (20 ms)
[ RUN      ] Parameters/TestRpc.TestRpcCallbackDestroysMessenger/SSL_UnixSocket
[       OK ] Parameters/TestRpc.TestRpcCallbackDestroysMessenger/SSL_UnixSocket (30 ms)
[ RUN      ] Parameters/TestRpc.TestApplicationFeatureFlag/SSL_UnixSocket
I20260929 21:43:08.612949  4869 acceptor_pool.cc:254] collecting diagnostics on the listening RPC socket unix:/tmp/dist-test-taskhaUp3y/test-tmp/rpc-test-14a7f802215143c2966d8dd12015be1e.sock every 8 connection(s)
I20260929 21:43:08.613662  4870 acceptor_pool.cc:254] collecting diagnostics on the listening RPC socket unix:/tmp/dist-test-taskhaUp3y/test-tmp/rpc-test-14a7f802215143c2966d8dd12015be1e.sock every 8 connection(s)
W20260929 21:43:08.644950  4866 messenger.cc:357] Unable to handle RPC call: Not implemented: call requires unsupported application feature flags: 99
W20260929 21:43:08.647337  4866 connection.cc:196] Error closing socket: Network error: TlsSocket::Close: Broken pipe
[       OK ] Parameters/TestRpc.TestApplicationFeatureFlag/SSL_UnixSocket (59 ms)
[ RUN      ] Parameters/TestRpc.TestCancellation/SSL_UnixSocket
I20260929 21:43:08.673326  4894 acceptor_pool.cc:254] collecting diagnostics on the listening RPC socket unix:/tmp/dist-test-taskhaUp3y/test-tmp/rpc-test-785174c484f547f794c0cb40b939812a.sock every 8 connection(s)
I20260929 21:43:08.674003  4895 acceptor_pool.cc:254] collecting diagnostics on the listening RPC socket unix:/tmp/dist-test-taskhaUp3y/test-tmp/rpc-test-785174c484f547f794c0cb40b939812a.sock every 8 connection(s)
I20260929 21:43:08.676949  4470 rpc-test.cc:1648] Connecting to unix:/tmp/dist-test-taskhaUp3y/test-tmp/rpc-test-785174c484f547f794c0cb40b939812a.sock
I20260929 21:43:08.776350  4470 rpc-test-base.h:595] status: Aborted: Sleep RPC to unix:/tmp/dist-test-taskhaUp3y/test-tmp/rpc-test-785174c484f547f794c0cb40b939812a.sock is cancelled in state READY, seconds elapsed: 0.000334512
I20260929 21:43:08.957912  4470 rpc-test-base.h:595] status: Aborted: Sleep RPC to unix:/tmp/dist-test-taskhaUp3y/test-tmp/rpc-test-785174c484f547f794c0cb40b939812a.sock is cancelled in state SENT, seconds elapsed: 0.000808326
I20260929 21:43:08.958096  4897 rpc-test-base.h:222] got call: sleep_micros: 510000
I20260929 21:43:09.158885  4470 rpc-test-base.h:595] status: Aborted: Sleep RPC to unix:/tmp/dist-test-taskhaUp3y/test-tmp/rpc-test-785174c484f547f794c0cb40b939812a.sock is cancelled in state SENT, seconds elapsed: 0.000826154
I20260929 21:43:09.159058  4896 rpc-test-base.h:222] got call: sleep_micros: 510000
I20260929 21:43:09.340673  4470 rpc-test-base.h:595] status: Aborted: Sleep RPC to unix:/tmp/dist-test-taskhaUp3y/test-tmp/rpc-test-785174c484f547f794c0cb40b939812a.sock is cancelled in state SENT, seconds elapsed: 0.000646454
W20260929 21:43:09.352113  4898 rpcz_store.cc:267] Call kudu.rpc.GenericCalculatorService.Sleep from unix:<unnamed> (request call id 11) took 11 ms (client timeout 10 ms). Trace:
W20260929 21:43:09.352427  4898 rpcz_store.cc:269] 0929 21:43:09.340718 (+     0us) service_pool.cc:170] Inserting onto call queue
0929 21:43:09.351854 (+ 11136us) service_pool.cc:214] Skipping call since client already timed out
0929 21:43:09.351950 (+    96us) inbound_call.cc:173] Queueing failure response
Metrics: {}
I20260929 21:43:09.352898  4898 rpc-test-base.h:222] got call: sleep_micros: 1500000
W20260929 21:43:09.468719  4897 rpcz_store.cc:267] Call kudu.rpc.GenericCalculatorService.Sleep from unix:<unnamed> (request call id 3) took 510 ms (client timeout 10 ms). Trace:
W20260929 21:43:09.469014  4897 rpcz_store.cc:269] 0929 21:43:08.957922 (+     0us) service_pool.cc:170] Inserting onto call queue
0929 21:43:08.958045 (+   123us) service_pool.cc:227] Handling call
0929 21:43:09.468663 (+510618us) inbound_call.cc:173] Queueing success response
Metrics: {}
W20260929 21:43:09.669669  4896 rpcz_store.cc:267] Call kudu.rpc.GenericCalculatorService.Sleep from unix:<unnamed> (request call id 7) took 510 ms (client timeout 10 ms). Trace:
W20260929 21:43:09.669982  4896 rpcz_store.cc:269] 0929 21:43:09.158891 (+     0us) service_pool.cc:170] Inserting onto call queue
0929 21:43:09.159014 (+   123us) service_pool.cc:227] Handling call
0929 21:43:09.669596 (+510582us) inbound_call.cc:173] Queueing success response
Metrics: {}
I20260929 21:43:10.343240  4470 rpc-test-base.h:595] status: Timed out: Sleep RPC to unix:/tmp/dist-test-taskhaUp3y/test-tmp/rpc-test-785174c484f547f794c0cb40b939812a.sock timed out after 1.000s (SENT), seconds elapsed: 1.00203
I20260929 21:43:10.344992  4896 rpc-test-base.h:222] got call: sleep_micros: 1500000
W20260929 21:43:10.853538  4898 rpcz_store.cc:267] Call kudu.rpc.GenericCalculatorService.Sleep from unix:<unnamed> (request call id 12) took 1511 ms (client timeout 1000 ms). Trace:
W20260929 21:43:10.853916  4898 rpcz_store.cc:269] 0929 21:43:09.341960 (+     0us) service_pool.cc:170] Inserting onto call queue
0929 21:43:09.352861 (+ 10901us) service_pool.cc:227] Handling call
0929 21:43:10.853370 (+1500509us) inbound_call.cc:173] Queueing success response
Metrics: {}
I20260929 21:43:11.345041  4470 rpc-test-base.h:595] status: Timed out: Sleep RPC to unix:/tmp/dist-test-taskhaUp3y/test-tmp/rpc-test-785174c484f547f794c0cb40b939812a.sock timed out after 1.000s (SENT), seconds elapsed: 1.00131
W20260929 21:43:11.346493  4891 messenger.cc:357] Unable to handle RPC call: Not implemented: call requires unsupported application feature flags: 99, 1
W20260929 21:43:11.348018  4891 messenger.cc:357] Unable to handle RPC call: Not implemented: call requires unsupported application feature flags: 99, 1
W20260929 21:43:11.585747  4891 connection.cc:196] Error closing socket: Network error: TlsSocket::Close: Broken pipe
W20260929 21:43:11.845542  4896 rpcz_store.cc:267] Call kudu.rpc.GenericCalculatorService.Sleep from unix:<unnamed> (request call id 13) took 1500 ms (client timeout 1000 ms). Trace:
W20260929 21:43:11.845829  4896 rpcz_store.cc:269] 0929 21:43:10.344725 (+     0us) service_pool.cc:170] Inserting onto call queue
0929 21:43:10.344889 (+   164us) service_pool.cc:227] Handling call
0929 21:43:11.845492 (+1500603us) inbound_call.cc:173] Queueing success response
Metrics: {}
W20260929 21:43:11.846297  4891 connection.cc:441] server connection from unix:<unnamed> torn down before Call kudu.rpc.GenericCalculatorService.Sleep from unix:<unnamed> (request call id 13) could send its response
[       OK ] Parameters/TestRpc.TestCancellation/SSL_UnixSocket (3202 ms)
[ RUN      ] Parameters/TestRpc.TestCancellationMultiThreads/SSL_UnixSocket
I20260929 21:43:11.890434  4920 acceptor_pool.cc:254] collecting diagnostics on the listening RPC socket unix:/tmp/dist-test-taskhaUp3y/test-tmp/rpc-test-ae3e1ffbbd534e59ba47bf89eb82e093.sock every 8 connection(s)
I20260929 21:43:11.891304  4921 acceptor_pool.cc:254] collecting diagnostics on the listening RPC socket unix:/tmp/dist-test-taskhaUp3y/test-tmp/rpc-test-ae3e1ffbbd534e59ba47bf89eb82e093.sock every 8 connection(s)
I20260929 21:43:11.894215  4470 rpc-test.cc:1808] Connecting to unix:/tmp/dist-test-taskhaUp3y/test-tmp/rpc-test-ae3e1ffbbd534e59ba47bf89eb82e093.sock
I20260929 21:43:12.067109  4934 test_util.cc:268] Using random seed: 297476547
I20260929 21:43:12.068143  4935 test_util.cc:268] Using random seed: 297477651
I20260929 21:43:12.069613  4936 test_util.cc:268] Using random seed: 297479012
I20260929 21:43:12.070933  4937 test_util.cc:268] Using random seed: 297480429
I20260929 21:43:12.072324  4938 test_util.cc:268] Using random seed: 297481738
I20260929 21:43:12.073531  4939 test_util.cc:268] Using random seed: 297482956
I20260929 21:43:12.074980  4940 test_util.cc:268] Using random seed: 297484359
I20260929 21:43:12.076287  4941 test_util.cc:268] Using random seed: 297485699
I20260929 21:43:12.077520  4942 test_util.cc:268] Using random seed: 297486944
I20260929 21:43:12.079041  4943 test_util.cc:268] Using random seed: 297488388
I20260929 21:43:12.080585  4944 test_util.cc:268] Using random seed: 297489943
I20260929 21:43:12.081851  4945 test_util.cc:268] Using random seed: 297491240
I20260929 21:43:12.085166  4947 test_util.cc:268] Using random seed: 297494527
I20260929 21:43:12.084414  4946 test_util.cc:268] Using random seed: 297492844
I20260929 21:43:12.086716  4948 test_util.cc:268] Using random seed: 297496072
I20260929 21:43:12.088533  4949 test_util.cc:268] Using random seed: 297497887
I20260929 21:43:12.090243  4950 test_util.cc:268] Using random seed: 297499629
I20260929 21:43:12.091576  4951 test_util.cc:268] Using random seed: 297500973
I20260929 21:43:12.093189  4952 test_util.cc:268] Using random seed: 297502589
I20260929 21:43:12.094774  4953 test_util.cc:268] Using random seed: 297504083
I20260929 21:43:12.096071  4954 test_util.cc:268] Using random seed: 297505468
I20260929 21:43:12.097802  4955 test_util.cc:268] Using random seed: 297507084
I20260929 21:43:12.099442  4956 test_util.cc:268] Using random seed: 297508700
I20260929 21:43:12.101435  4957 test_util.cc:268] Using random seed: 297510734
I20260929 21:43:12.102952  4958 test_util.cc:268] Using random seed: 297512289
I20260929 21:43:12.104759  4959 test_util.cc:268] Using random seed: 297514098
I20260929 21:43:12.106429  4960 test_util.cc:268] Using random seed: 297515777
I20260929 21:43:12.108026  4961 test_util.cc:268] Using random seed: 297517368
I20260929 21:43:12.109570  4962 test_util.cc:268] Using random seed: 297518946
I20260929 21:43:12.111377  4963 test_util.cc:268] Using random seed: 297520780
W20260929 21:43:31.781383  4917 connection.cc:196] Error closing socket: Network error: TlsSocket::Close: Broken pipe
[       OK ] Parameters/TestRpc.TestCancellationMultiThreads/SSL_UnixSocket (19943 ms)
[ RUN      ] Parameters/TestRpc.TestCallId/SSL_UnixSocket
I20260929 21:43:31.839217  4977 acceptor_pool.cc:254] collecting diagnostics on the listening RPC socket unix:/tmp/dist-test-taskhaUp3y/test-tmp/rpc-test-0f42ce118518456ba4d9f191922d2ebc.sock every 8 connection(s)
I20260929 21:43:31.840126  4978 acceptor_pool.cc:254] collecting diagnostics on the listening RPC socket unix:/tmp/dist-test-taskhaUp3y/test-tmp/rpc-test-0f42ce118518456ba4d9f191922d2ebc.sock every 8 connection(s)
[       OK ] Parameters/TestRpc.TestCallId/SSL_UnixSocket (90 ms)
[----------] 20 tests from Parameters/TestRpc (38376 ms total)

[----------] Global test environment tear-down
[==========] 21 tests from 2 test suites ran. (41664 ms total)
[  PASSED  ] 20 tests.
[  FAILED  ] 1 test, listed below:
[  FAILED  ] Parameters/TestRpc.TestCallWithChainCertAndRootCA/SSL_UnixSocket, where GetParam() = (true, true)

 1 FAILED TEST
I20260929 21:43:31.905762  4470 logging.cc:424] LogThrottler /data0/somelongdirectorytoavoidrpathissues/src/kudu/src/kudu/rpc/acceptor_pool.cc:285: suppressed but not reported on 3 messages since previous log ~34 seconds ago