Diagnosed failure

Parameters/TestRpc.TestCallWithChainCertAndRootCA/SSL_UnixSocket: /data0/somelongdirectorytoavoidrpathissues/src/kudu/src/kudu/rpc/rpc-test.cc:303: Failure
Failed
Bad status: Runtime error: could not verify certificate chain (error with cert: subject=CN = localhost, ST = sadfjas, C = AS, emailAddress = sdflkdsajf, O = lskdfjlsad, OU = sldfkja, issuer=C = AS, ST = ASDfkjdhf, L = lskdjf, O = saldfja, OU = skdjf, CN = localhost, emailAddress = sadjflkadsj): : certificate has expired
Google Test trace:
/data0/somelongdirectorytoavoidrpathissues/src/kudu/src/kudu/rpc/rpc-test.cc:300: Connecting to unix:/tmp/dist-test-taskIhJAvR/test-tmp/rpc-test-656d122809f14cc4b7c133c870996079.sock
I20260925 19:31:38.330129  7224 test_util.cc:175] -----------------------------------------------
I20260925 19:31:38.330295  7224 test_util.cc:176] Had fatal failures, leaving test files at /tmp/dist-test-taskIhJAvR/test-tmp/rpc-test.2.Parameters_TestRpc.TestCallWithChainCertAndRootCA_SSL_UnixSocket.1790364694750359-7224-0

Full log

Note: This is test shard 3 of 8.
[==========] Running 21 tests from 2 test suites.
[----------] Global test environment set-up.
[----------] 1 test from TestRpc
[ RUN      ] TestRpc.TestNegotiationTimeout
WARNING: Logging before InitGoogleLogging() is written to STDERR
I20260925 19:31:34.937937  7224 rpc-test-base.h:595] status: Timed out: connection negotiation to 0.0.0.0:37263 for RPC Sleep timed out after 0.100s (ON_OUTBOUND_QUEUE), seconds elapsed: 0.10189
W20260925 19:31:38.016198  7234 negotiation.cc:337] Failed RPC negotiation. Trace:
0925 19:31:34.836900 (+     0us) reactor.cc:625] Submitting negotiation task for client connection to 0.0.0.0:37263 (local address 127.0.0.1:51152)
0925 19:31:34.837550 (+   650us) negotiation.cc:107] Waiting for socket to connect
0925 19:31:34.837603 (+    53us) client_negotiation.cc:174] Beginning negotiation
0925 19:31:34.849426 (+ 11823us) client_negotiation.cc:252] Sending NEGOTIATE NegotiatePB request
0925 19:31:38.015040 (+3165614us) negotiation.cc:327] Negotiation complete: Timed out: Client connection negotiation failed: client connection to 0.0.0.0:37263: received 0 of 4 requested bytes
Metrics: {"client-negotiator.queue_time_us":206}
[       OK ] TestRpc.TestNegotiationTimeout (3217 ms)
[----------] 1 test from TestRpc (3217 ms total)

[----------] 20 tests from Parameters/TestRpc
[ RUN      ] Parameters/TestRpc.TestAcceptorPoolStartStop/SSL_UnixSocket
I20260925 19:31:38.068378  7250 acceptor_pool.cc:254] collecting diagnostics on the listening RPC socket unix:/tmp/dist-test-taskIhJAvR/test-tmp/rpc-test-f56d6464c63841e583bcb8c9a7d73e4e.sock every 8 connection(s)
I20260925 19:31:38.070094  7251 acceptor_pool.cc:254] collecting diagnostics on the listening RPC socket unix:/tmp/dist-test-taskIhJAvR/test-tmp/rpc-test-f56d6464c63841e583bcb8c9a7d73e4e.sock every 8 connection(s)
I20260925 19:31:38.104732  7261 acceptor_pool.cc:254] collecting diagnostics on the listening RPC socket unix:/tmp/dist-test-taskIhJAvR/test-tmp/rpc-test-f56d6464c63841e583bcb8c9a7d73e4e.sock every 8 connection(s)
I20260925 19:31:38.106221  7262 acceptor_pool.cc:254] collecting diagnostics on the listening RPC socket unix:/tmp/dist-test-taskIhJAvR/test-tmp/rpc-test-f56d6464c63841e583bcb8c9a7d73e4e.sock every 8 connection(s)
I20260925 19:31:38.120911  7272 acceptor_pool.cc:254] collecting diagnostics on the listening RPC socket unix:/tmp/dist-test-taskIhJAvR/test-tmp/rpc-test-f56d6464c63841e583bcb8c9a7d73e4e.sock every 8 connection(s)
I20260925 19:31:38.121610  7273 acceptor_pool.cc:254] collecting diagnostics on the listening RPC socket unix:/tmp/dist-test-taskIhJAvR/test-tmp/rpc-test-f56d6464c63841e583bcb8c9a7d73e4e.sock every 8 connection(s)
I20260925 19:31:38.147816  7283 acceptor_pool.cc:254] collecting diagnostics on the listening RPC socket unix:/tmp/dist-test-taskIhJAvR/test-tmp/rpc-test-f56d6464c63841e583bcb8c9a7d73e4e.sock every 8 connection(s)
I20260925 19:31:38.148558  7284 acceptor_pool.cc:254] collecting diagnostics on the listening RPC socket unix:/tmp/dist-test-taskIhJAvR/test-tmp/rpc-test-f56d6464c63841e583bcb8c9a7d73e4e.sock every 8 connection(s)
I20260925 19:31:38.166955  7294 acceptor_pool.cc:254] collecting diagnostics on the listening RPC socket unix:/tmp/dist-test-taskIhJAvR/test-tmp/rpc-test-f56d6464c63841e583bcb8c9a7d73e4e.sock every 8 connection(s)
I20260925 19:31:38.167625  7295 acceptor_pool.cc:254] collecting diagnostics on the listening RPC socket unix:/tmp/dist-test-taskIhJAvR/test-tmp/rpc-test-f56d6464c63841e583bcb8c9a7d73e4e.sock every 8 connection(s)
[       OK ] Parameters/TestRpc.TestAcceptorPoolStartStop/SSL_UnixSocket (151 ms)
[ RUN      ] Parameters/TestRpc.TestCall/SSL_UnixSocket
I20260925 19:31:38.200167  7307 acceptor_pool.cc:254] collecting diagnostics on the listening RPC socket unix:/tmp/dist-test-taskIhJAvR/test-tmp/rpc-test-a16e0cb282ad4bd79fdc81bdac1fdeb3.sock every 8 connection(s)
I20260925 19:31:38.202288  7308 acceptor_pool.cc:254] collecting diagnostics on the listening RPC socket unix:/tmp/dist-test-taskIhJAvR/test-tmp/rpc-test-a16e0cb282ad4bd79fdc81bdac1fdeb3.sock every 8 connection(s)
I20260925 19:31:38.207109  7224 rpc-test.cc:234] Connecting to unix:/tmp/dist-test-taskIhJAvR/test-tmp/rpc-test-a16e0cb282ad4bd79fdc81bdac1fdeb3.sock
W20260925 19:31:38.256340  7304 connection.cc:196] Error closing socket: Network error: TlsSocket::Close: Broken pipe
[       OK ] Parameters/TestRpc.TestCall/SSL_UnixSocket (95 ms)
[ RUN      ] Parameters/TestRpc.TestCallWithChainCertAndRootCA/SSL_UnixSocket
I20260925 19:31:38.309496  7332 acceptor_pool.cc:254] collecting diagnostics on the listening RPC socket unix:/tmp/dist-test-taskIhJAvR/test-tmp/rpc-test-656d122809f14cc4b7c133c870996079.sock every 8 connection(s)
I20260925 19:31:38.310240  7333 acceptor_pool.cc:254] collecting diagnostics on the listening RPC socket unix:/tmp/dist-test-taskIhJAvR/test-tmp/rpc-test-656d122809f14cc4b7c133c870996079.sock every 8 connection(s)
/data0/somelongdirectorytoavoidrpathissues/src/kudu/src/kudu/rpc/rpc-test.cc:303: Failure
Failed
Bad status: Runtime error: could not verify certificate chain (error with cert: subject=CN = localhost, ST = sadfjas, C = AS, emailAddress = sdflkdsajf, O = lskdfjlsad, OU = sldfkja, issuer=C = AS, ST = ASDfkjdhf, L = lskdjf, O = saldfja, OU = skdjf, CN = localhost, emailAddress = sadjflkadsj): : certificate has expired
Google Test trace:
/data0/somelongdirectorytoavoidrpathissues/src/kudu/src/kudu/rpc/rpc-test.cc:300: Connecting to unix:/tmp/dist-test-taskIhJAvR/test-tmp/rpc-test-656d122809f14cc4b7c133c870996079.sock
I20260925 19:31:38.330129  7224 test_util.cc:175] -----------------------------------------------
I20260925 19:31:38.330295  7224 test_util.cc:176] Had fatal failures, leaving test files at /tmp/dist-test-taskIhJAvR/test-tmp/rpc-test.2.Parameters_TestRpc.TestCallWithChainCertAndRootCA_SSL_UnixSocket.1790364694750359-7224-0
[  FAILED  ] Parameters/TestRpc.TestCallWithChainCertAndRootCA/SSL_UnixSocket, where GetParam() = (true, true) (63 ms)
[ RUN      ] Parameters/TestRpc.TestCallWithBadPasswordProtectedKey/SSL_UnixSocket
[       OK ] Parameters/TestRpc.TestCallWithBadPasswordProtectedKey/SSL_UnixSocket (31 ms)
[ RUN      ] Parameters/TestRpc.TestInvalidMethodCall/SSL_UnixSocket
I20260925 19:31:38.394781  7369 acceptor_pool.cc:254] collecting diagnostics on the listening RPC socket unix:/tmp/dist-test-taskIhJAvR/test-tmp/rpc-test-5154f28351d142f08dda95fc73abdabb.sock every 8 connection(s)
I20260925 19:31:38.395645  7370 acceptor_pool.cc:254] collecting diagnostics on the listening RPC socket unix:/tmp/dist-test-taskIhJAvR/test-tmp/rpc-test-5154f28351d142f08dda95fc73abdabb.sock every 8 connection(s)
I20260925 19:31:38.399087  7224 rpc-test.cc:406] Connecting to unix:/tmp/dist-test-taskIhJAvR/test-tmp/rpc-test-5154f28351d142f08dda95fc73abdabb.sock
[       OK ] Parameters/TestRpc.TestInvalidMethodCall/SSL_UnixSocket (81 ms)
[ RUN      ] Parameters/TestRpc.TestHighFDs/SSL_UnixSocket
I20260925 19:31:38.637993  7394 acceptor_pool.cc:254] collecting diagnostics on the listening RPC socket unix:/tmp/dist-test-taskIhJAvR/test-tmp/rpc-test-d3c8d88a163548cb8251731db4d201c1.sock every 8 connection(s)
I20260925 19:31:38.638767  7395 acceptor_pool.cc:254] collecting diagnostics on the listening RPC socket unix:/tmp/dist-test-taskIhJAvR/test-tmp/rpc-test-d3c8d88a163548cb8251731db4d201c1.sock every 8 connection(s)
W20260925 19:31:38.667485  7391 connection.cc:196] Error closing socket: Network error: TlsSocket::Close: Broken pipe
[       OK ] Parameters/TestRpc.TestHighFDs/SSL_UnixSocket (236 ms)
[ RUN      ] Parameters/TestRpc.TestConnectionAlwaysKeepalive/SSL_UnixSocket
I20260925 19:31:38.702014  7417 acceptor_pool.cc:254] collecting diagnostics on the listening RPC socket unix:/tmp/dist-test-taskIhJAvR/test-tmp/rpc-test-26028043cf754134b5388e098a83cb08.sock every 8 connection(s)
I20260925 19:31:38.702781  7418 acceptor_pool.cc:254] collecting diagnostics on the listening RPC socket unix:/tmp/dist-test-taskIhJAvR/test-tmp/rpc-test-26028043cf754134b5388e098a83cb08.sock every 8 connection(s)
I20260925 19:31:38.705858  7224 rpc-test.cc:532] Connecting to unix:/tmp/dist-test-taskIhJAvR/test-tmp/rpc-test-26028043cf754134b5388e098a83cb08.sock
W20260925 19:31:41.757843  7416 connection.cc:196] Error closing socket: Network error: TlsSocket::Close: Broken pipe
[       OK ] Parameters/TestRpc.TestConnectionAlwaysKeepalive/SSL_UnixSocket (3081 ms)
[ RUN      ] Parameters/TestRpc.TestReopenOutboundConnections/SSL_UnixSocket
I20260925 19:31:41.779634  7440 acceptor_pool.cc:254] collecting diagnostics on the listening RPC socket unix:/tmp/dist-test-taskIhJAvR/test-tmp/rpc-test-39288b576559475ea6cbfee0cc731302.sock every 8 connection(s)
I20260925 19:31:41.780352  7441 acceptor_pool.cc:254] collecting diagnostics on the listening RPC socket unix:/tmp/dist-test-taskIhJAvR/test-tmp/rpc-test-39288b576559475ea6cbfee0cc731302.sock every 8 connection(s)
I20260925 19:31:41.783550  7224 rpc-test.cc:658] Connecting to unix:/tmp/dist-test-taskIhJAvR/test-tmp/rpc-test-39288b576559475ea6cbfee0cc731302.sock
W20260925 19:31:41.817164  7439 connection.cc:196] Error closing socket: Network error: TlsSocket::Close: Broken pipe
W20260925 19:31:41.825968  7439 connection.cc:196] Error closing socket: Network error: TlsSocket::Close: Broken pipe
W20260925 19:31:41.834964  7439 connection.cc:196] Error closing socket: Network error: TlsSocket::Close: Broken pipe
W20260925 19:31:41.843956  7439 connection.cc:196] Error closing socket: Network error: TlsSocket::Close: Broken pipe
W20260925 19:31:41.853204  7439 connection.cc:196] Error closing socket: Network error: TlsSocket::Close: Broken pipe
W20260925 19:31:41.862548  7439 connection.cc:196] Error closing socket: Network error: TlsSocket::Close: Broken pipe
W20260925 19:31:41.873026  7439 connection.cc:196] Error closing socket: Network error: TlsSocket::Close: Broken pipe
W20260925 19:31:41.883762  7439 connection.cc:196] Error closing socket: Network error: TlsSocket::Close: Broken pipe
W20260925 19:31:41.894443  7439 connection.cc:196] Error closing socket: Network error: TlsSocket::Close: Broken pipe
W20260925 19:31:41.904748  7439 connection.cc:196] Error closing socket: Network error: TlsSocket::Close: Broken pipe
W20260925 19:31:41.915551  7439 connection.cc:196] Error closing socket: Network error: TlsSocket::Close: Broken pipe
W20260925 19:31:41.926170  7439 connection.cc:196] Error closing socket: Network error: TlsSocket::Close: Broken pipe
W20260925 19:31:41.936937  7439 connection.cc:196] Error closing socket: Network error: TlsSocket::Close: Broken pipe
W20260925 19:31:41.947225  7439 connection.cc:196] Error closing socket: Network error: TlsSocket::Close: Broken pipe
W20260925 19:31:41.947281  7440 acceptor_pool.cc:285] unable to collect diagnostics on RPC socket unix:/tmp/dist-test-taskIhJAvR/test-tmp/rpc-test-39288b576559475ea6cbfee0cc731302.sock: Not implemented: netlink diagnostics is currently supported only on IPv4 TCP sockets
W20260925 19:31:41.957882  7439 connection.cc:196] Error closing socket: Network error: TlsSocket::Close: Broken pipe
W20260925 19:31:41.968348  7439 connection.cc:196] Error closing socket: Network error: TlsSocket::Close: Broken pipe
W20260925 19:31:41.978597  7439 connection.cc:196] Error closing socket: Network error: TlsSocket::Close: Broken pipe
W20260925 19:31:41.989144  7439 connection.cc:196] Error closing socket: Network error: TlsSocket::Close: Broken pipe
W20260925 19:31:41.999635  7439 connection.cc:196] Error closing socket: Network error: TlsSocket::Close: Broken pipe
W20260925 19:31:42.009902  7439 connection.cc:196] Error closing socket: Network error: TlsSocket::Close: Broken pipe
W20260925 19:31:42.020418  7439 connection.cc:196] Error closing socket: Network error: TlsSocket::Close: Broken pipe
W20260925 19:31:42.031031  7439 connection.cc:196] Error closing socket: Network error: TlsSocket::Close: Broken pipe
W20260925 19:31:42.040347  7439 connection.cc:196] Error closing socket: Network error: TlsSocket::Close: Broken pipe
W20260925 19:31:42.050920  7439 connection.cc:196] Error closing socket: Network error: TlsSocket::Close: Broken pipe
W20260925 19:31:42.061466  7439 connection.cc:196] Error closing socket: Network error: TlsSocket::Close: Broken pipe
W20260925 19:31:42.072928  7439 connection.cc:196] Error closing socket: Network error: TlsSocket::Close: Broken pipe
W20260925 19:31:42.087925  7439 connection.cc:196] Error closing socket: Network error: TlsSocket::Close: Broken pipe
W20260925 19:31:42.099984  7439 connection.cc:196] Error closing socket: Network error: TlsSocket::Close: Broken pipe
W20260925 19:31:42.112618  7439 connection.cc:196] Error closing socket: Network error: TlsSocket::Close: Broken pipe
W20260925 19:31:42.122583  7439 connection.cc:196] Error closing socket: Network error: TlsSocket::Close: Broken pipe
W20260925 19:31:42.130846  7439 connection.cc:196] Error closing socket: Network error: TlsSocket::Close: Broken pipe
W20260925 19:31:42.141351  7439 connection.cc:196] Error closing socket: Network error: TlsSocket::Close: Broken pipe
[       OK ] Parameters/TestRpc.TestReopenOutboundConnections/SSL_UnixSocket (383 ms)
[ RUN      ] Parameters/TestRpc.TestConnectionNetworkPlane/SSL_UnixSocket
I20260925 19:31:42.172063  7463 acceptor_pool.cc:254] collecting diagnostics on the listening RPC socket unix:/tmp/dist-test-taskIhJAvR/test-tmp/rpc-test-ddac08de0b5747028b24f3191cb73ee7.sock every 8 connection(s)
I20260925 19:31:42.172804  7464 acceptor_pool.cc:254] collecting diagnostics on the listening RPC socket unix:/tmp/dist-test-taskIhJAvR/test-tmp/rpc-test-ddac08de0b5747028b24f3191cb73ee7.sock every 8 connection(s)
I20260925 19:31:42.175901  7224 rpc-test.cc:772] Connecting to unix:/tmp/dist-test-taskIhJAvR/test-tmp/rpc-test-ddac08de0b5747028b24f3191cb73ee7.sock
W20260925 19:31:42.218837  7462 connection.cc:196] Error closing socket: Network error: TlsSocket::Close: Broken pipe
W20260925 19:31:42.220314  7462 connection.cc:196] Error closing socket: Network error: TlsSocket::Close: Broken pipe
[       OK ] Parameters/TestRpc.TestConnectionNetworkPlane/SSL_UnixSocket (79 ms)
[ RUN      ] Parameters/TestRpc.TestTCPKeepalive/SSL_UnixSocket
I20260925 19:31:42.244628  7488 acceptor_pool.cc:254] collecting diagnostics on the listening RPC socket unix:/tmp/dist-test-taskIhJAvR/test-tmp/rpc-test-fb7e67ca6fc748be8db019e775478de0.sock every 8 connection(s)
I20260925 19:31:42.245344  7489 acceptor_pool.cc:254] collecting diagnostics on the listening RPC socket unix:/tmp/dist-test-taskIhJAvR/test-tmp/rpc-test-fb7e67ca6fc748be8db019e775478de0.sock every 8 connection(s)
I20260925 19:31:42.277204  7492 rpc-test-base.h:222] got call: sleep_micros: 8000000 deferred: true
I20260925 19:31:50.281212  7492 rpcz_store.cc:275] Call kudu.rpc.GenericCalculatorService.Sleep from unix:<unnamed> (request call id 0) took 8004 ms. Trace:
I20260925 19:31:50.281623  7492 rpcz_store.cc:276] 0925 19:31:42.277053 (+     0us) service_pool.cc:170] Inserting onto call queue
0925 19:31:42.277151 (+    98us) service_pool.cc:227] Handling call
0925 19:31:50.281035 (+8003884us) inbound_call.cc:173] Queueing success response
Metrics: {}
W20260925 19:31:50.289525  7485 connection.cc:196] Error closing socket: Network error: TlsSocket::Close: Broken pipe
[       OK ] Parameters/TestRpc.TestTCPKeepalive/SSL_UnixSocket (8071 ms)
[ RUN      ] Parameters/TestRpc.TestMaxSmallSidecars/SSL_UnixSocket
I20260925 19:31:50.327432  7514 acceptor_pool.cc:254] collecting diagnostics on the listening RPC socket unix:/tmp/dist-test-taskIhJAvR/test-tmp/rpc-test-9aeaa8605f0f4436be18972b57cbb300.sock every 8 connection(s)
I20260925 19:31:50.328280  7515 acceptor_pool.cc:254] collecting diagnostics on the listening RPC socket unix:/tmp/dist-test-taskIhJAvR/test-tmp/rpc-test-9aeaa8605f0f4436be18972b57cbb300.sock every 8 connection(s)
W20260925 19:31:50.520347  7511 connection.cc:196] Error closing socket: Network error: TlsSocket::Close: Broken pipe
[       OK ] Parameters/TestRpc.TestMaxSmallSidecars/SSL_UnixSocket (228 ms)
[ RUN      ] Parameters/TestRpc.TestCallTimeout/SSL_UnixSocket
I20260925 19:31:50.550518  7539 acceptor_pool.cc:254] collecting diagnostics on the listening RPC socket unix:/tmp/dist-test-taskIhJAvR/test-tmp/rpc-test-ae8b29c094e24e4797ef4a41f4663bdb.sock every 8 connection(s)
I20260925 19:31:50.551242  7540 acceptor_pool.cc:254] collecting diagnostics on the listening RPC socket unix:/tmp/dist-test-taskIhJAvR/test-tmp/rpc-test-ae8b29c094e24e4797ef4a41f4663bdb.sock every 8 connection(s)
I20260925 19:31:50.585232  7224 rpc-test-base.h:595] status: Timed out: connection negotiation to unix:/tmp/dist-test-taskIhJAvR/test-tmp/rpc-test-ae8b29c094e24e4797ef4a41f4663bdb.sock for RPC Sleep timed out after 0.000s (ON_OUTBOUND_QUEUE), seconds elapsed: 0.00248508
I20260925 19:31:50.592604  7543 rpc-test-base.h:222] got call: sleep_micros: 700000
I20260925 19:31:50.786115  7224 rpc-test-base.h:595] status: Timed out: Sleep RPC to unix:/tmp/dist-test-taskIhJAvR/test-tmp/rpc-test-ae8b29c094e24e4797ef4a41f4663bdb.sock timed out after 0.200s (SENT), seconds elapsed: 0.200521
I20260925 19:31:50.787621  7542 rpc-test-base.h:222] got call: sleep_micros: 2000000
W20260925 19:31:51.293318  7543 rpcz_store.cc:267] Call kudu.rpc.GenericCalculatorService.Sleep from unix:<unnamed> (request call id 1) took 700 ms (client timeout 200 ms). Trace:
W20260925 19:31:51.293720  7543 rpcz_store.cc:269] 0925 19:31:50.592423 (+     0us) service_pool.cc:170] Inserting onto call queue
0925 19:31:50.592549 (+   126us) service_pool.cc:227] Handling call
0925 19:31:51.293263 (+700714us) inbound_call.cc:173] Queueing success response
Metrics: {}
I20260925 19:31:52.288159  7224 rpc-test-base.h:595] status: Timed out: Sleep RPC to unix:/tmp/dist-test-taskIhJAvR/test-tmp/rpc-test-ae8b29c094e24e4797ef4a41f4663bdb.sock timed out after 1.500s (SENT), seconds elapsed: 1.5017
W20260925 19:31:52.788179  7542 rpcz_store.cc:267] Call kudu.rpc.GenericCalculatorService.Sleep from unix:<unnamed> (request call id 2) took 2000 ms (client timeout 1500 ms). Trace:
W20260925 19:31:52.788547  7542 rpcz_store.cc:269] 0925 19:31:50.787351 (+     0us) service_pool.cc:170] Inserting onto call queue
0925 19:31:50.787466 (+   115us) service_pool.cc:227] Handling call
0925 19:31:52.788113 (+2000647us) inbound_call.cc:173] Queueing success response
Metrics: {}
W20260925 19:31:52.789109  7536 connection.cc:441] server connection from unix:<unnamed> torn down before Call kudu.rpc.GenericCalculatorService.Sleep from unix:<unnamed> (request call id 2) could send its response
[       OK ] Parameters/TestRpc.TestCallTimeout/SSL_UnixSocket (2269 ms)
[ RUN      ] Parameters/TestRpc.TestServerShutsDown/SSL_UnixSocket
I20260925 19:31:52.796061  7224 rpc-test.cc:1125] Connecting to 0.0.0.0:35745
W20260925 19:31:52.805830  7556 negotiation.cc:337] Failed RPC negotiation. Trace:
0925 19:31:52.804429 (+     0us) reactor.cc:625] Submitting negotiation task for client connection to 0.0.0.0:35745 (local address 127.0.0.1:35300)
0925 19:31:52.804864 (+   435us) negotiation.cc:107] Waiting for socket to connect
0925 19:31:52.804895 (+    31us) client_negotiation.cc:174] Beginning negotiation
0925 19:31:52.805112 (+   217us) client_negotiation.cc:252] Sending NEGOTIATE NegotiatePB request
0925 19:31:52.805309 (+   197us) negotiation.cc:327] Negotiation complete: Network error: Client connection negotiation failed: client connection to 0.0.0.0:35745: BlockingWrite error: write error: Broken pipe (error 32)
Metrics: {"client-negotiator.queue_time_us":107}
[       OK ] Parameters/TestRpc.TestServerShutsDown/SSL_UnixSocket (13 ms)
[ RUN      ] Parameters/TestRpc.TimedOutOnResponseMetric/SSL_UnixSocket
I20260925 19:31:52.838471  7573 acceptor_pool.cc:254] collecting diagnostics on the listening RPC socket unix:/tmp/dist-test-taskIhJAvR/test-tmp/rpc-test-72fccdc671b1407682bf1bf3946a589b.sock every 8 connection(s)
I20260925 19:31:52.839200  7574 acceptor_pool.cc:254] collecting diagnostics on the listening RPC socket unix:/tmp/dist-test-taskIhJAvR/test-tmp/rpc-test-72fccdc671b1407682bf1bf3946a589b.sock every 8 connection(s)
W20260925 19:31:53.082368  7577 rpcz_store.cc:267] Call kudu.rpc_test.CalculatorService.Sleep from unix:<unnamed> (request call id 3) took 50 ms (client timeout 25 ms). Trace:
W20260925 19:31:53.082754  7577 rpcz_store.cc:269] 0925 19:31:53.031744 (+     0us) service_pool.cc:170] Inserting onto call queue
0925 19:31:53.031871 (+   127us) service_pool.cc:227] Handling call
0925 19:31:53.082292 (+ 50421us) inbound_call.cc:173] Queueing success response
Related trace 'test_child':
Metrics: {"test_sleep_us":50000,"child_traces":[["test_child",{"related_trace_metric":1}]]}
W20260925 19:31:53.141827  7577 rpcz_store.cc:267] Call kudu.rpc_test.CalculatorService.Sleep from unix:<unnamed> (request call id 4) took 50 ms (client timeout 50 ms). Trace:
W20260925 19:31:53.142168  7577 rpcz_store.cc:269] 0925 19:31:53.091236 (+     0us) service_pool.cc:170] Inserting onto call queue
0925 19:31:53.091381 (+   145us) service_pool.cc:227] Handling call
0925 19:31:53.141748 (+ 50367us) inbound_call.cc:173] Queueing success response
Related trace 'test_child':
Metrics: {"test_sleep_us":50000,"child_traces":[["test_child",{"related_trace_metric":1}]]}
W20260925 19:31:53.145757  7570 connection.cc:196] Error closing socket: Network error: TlsSocket::Close: Broken pipe
[       OK ] Parameters/TestRpc.TimedOutOnResponseMetric/SSL_UnixSocket (342 ms)
[ RUN      ] Parameters/TestRpc.AcceptorDispatchingTimesMetric/SSL_UnixSocket
I20260925 19:31:53.163292  7598 acceptor_pool.cc:254] collecting diagnostics on the listening RPC socket 0.0.0.0:33533 every 8 connection(s)
I20260925 19:31:53.164027  7599 acceptor_pool.cc:254] collecting diagnostics on the listening RPC socket 0.0.0.0:33533 every 8 connection(s)
W20260925 19:31:53.170480  7594 negotiation.cc:337] Failed RPC negotiation. Trace:
0925 19:31:53.167842 (+     0us) reactor.cc:625] Submitting negotiation task for server connection from 127.0.0.1:59622 (local address 127.0.0.1:33533)
0925 19:31:53.168485 (+   643us) server_negotiation.cc:206] Beginning negotiation
0925 19:31:53.168527 (+    42us) server_negotiation.cc:399] Waiting for connection header
0925 19:31:53.168926 (+   399us) negotiation.cc:327] Negotiation complete: Network error: Server connection negotiation failed: server connection from 127.0.0.1:59622: BlockingRecv error: recv got EOF from 127.0.0.1:59622 (error 108)
Metrics: {"server-negotiator.queue_time_us":132}
[       OK ] Parameters/TestRpc.AcceptorDispatchingTimesMetric/SSL_UnixSocket (21 ms)
[ RUN      ] Parameters/TestRpc.TestRpcCallbackDestroysMessenger/SSL_UnixSocket
[       OK ] Parameters/TestRpc.TestRpcCallbackDestroysMessenger/SSL_UnixSocket (25 ms)
[ RUN      ] Parameters/TestRpc.TestApplicationFeatureFlag/SSL_UnixSocket
I20260925 19:31:53.230746  7623 acceptor_pool.cc:254] collecting diagnostics on the listening RPC socket unix:/tmp/dist-test-taskIhJAvR/test-tmp/rpc-test-4d1f199c9dcb476abd0913dd583bfcf3.sock every 8 connection(s)
I20260925 19:31:53.231511  7624 acceptor_pool.cc:254] collecting diagnostics on the listening RPC socket unix:/tmp/dist-test-taskIhJAvR/test-tmp/rpc-test-4d1f199c9dcb476abd0913dd583bfcf3.sock every 8 connection(s)
W20260925 19:31:53.284855  7620 messenger.cc:357] Unable to handle RPC call: Not implemented: call requires unsupported application feature flags: 99
[       OK ] Parameters/TestRpc.TestApplicationFeatureFlag/SSL_UnixSocket (95 ms)
[ RUN      ] Parameters/TestRpc.TestCancellation/SSL_UnixSocket
I20260925 19:31:53.313561  7648 acceptor_pool.cc:254] collecting diagnostics on the listening RPC socket unix:/tmp/dist-test-taskIhJAvR/test-tmp/rpc-test-58355da90c654c9bb4e4cc32bc228520.sock every 8 connection(s)
I20260925 19:31:53.314296  7649 acceptor_pool.cc:254] collecting diagnostics on the listening RPC socket unix:/tmp/dist-test-taskIhJAvR/test-tmp/rpc-test-58355da90c654c9bb4e4cc32bc228520.sock every 8 connection(s)
I20260925 19:31:53.317471  7224 rpc-test.cc:1648] Connecting to unix:/tmp/dist-test-taskIhJAvR/test-tmp/rpc-test-58355da90c654c9bb4e4cc32bc228520.sock
I20260925 19:31:53.427261  7224 rpc-test-base.h:595] status: Aborted: Sleep RPC to unix:/tmp/dist-test-taskIhJAvR/test-tmp/rpc-test-58355da90c654c9bb4e4cc32bc228520.sock is cancelled in state READY, seconds elapsed: 0.000387478
I20260925 19:31:53.602563  7224 rpc-test-base.h:595] status: Aborted: Sleep RPC to unix:/tmp/dist-test-taskIhJAvR/test-tmp/rpc-test-58355da90c654c9bb4e4cc32bc228520.sock is cancelled in state SENT, seconds elapsed: 0.000882027
I20260925 19:31:53.602773  7651 rpc-test-base.h:222] got call: sleep_micros: 510000
I20260925 19:31:53.784296  7224 rpc-test-base.h:595] status: Aborted: Sleep RPC to unix:/tmp/dist-test-taskIhJAvR/test-tmp/rpc-test-58355da90c654c9bb4e4cc32bc228520.sock is cancelled in state SENT, seconds elapsed: 0.000901975
I20260925 19:31:53.784565  7650 rpc-test-base.h:222] got call: sleep_micros: 510000
I20260925 19:31:53.966976  7224 rpc-test-base.h:595] status: Aborted: Sleep RPC to unix:/tmp/dist-test-taskIhJAvR/test-tmp/rpc-test-58355da90c654c9bb4e4cc32bc228520.sock is cancelled in state SENT, seconds elapsed: 0.000738007
W20260925 19:31:53.977979  7652 rpcz_store.cc:267] Call kudu.rpc.GenericCalculatorService.Sleep from unix:<unnamed> (request call id 11) took 10 ms (client timeout 10 ms). Trace:
W20260925 19:31:53.978255  7652 rpcz_store.cc:269] 0925 19:31:53.967106 (+     0us) service_pool.cc:170] Inserting onto call queue
0925 19:31:53.977684 (+ 10578us) service_pool.cc:214] Skipping call since client already timed out
0925 19:31:53.977807 (+   123us) inbound_call.cc:173] Queueing failure response
Metrics: {}
I20260925 19:31:53.978823  7652 rpc-test-base.h:222] got call: sleep_micros: 1500000
W20260925 19:31:54.113373  7651 rpcz_store.cc:267] Call kudu.rpc.GenericCalculatorService.Sleep from unix:<unnamed> (request call id 3) took 510 ms (client timeout 10 ms). Trace:
W20260925 19:31:54.113708  7651 rpcz_store.cc:269] 0925 19:31:53.602600 (+     0us) service_pool.cc:170] Inserting onto call queue
0925 19:31:53.602728 (+   128us) service_pool.cc:227] Handling call
0925 19:31:54.113319 (+510591us) inbound_call.cc:173] Queueing success response
Metrics: {}
W20260925 19:31:54.295167  7650 rpcz_store.cc:267] Call kudu.rpc.GenericCalculatorService.Sleep from unix:<unnamed> (request call id 7) took 510 ms (client timeout 10 ms). Trace:
W20260925 19:31:54.295477  7650 rpcz_store.cc:269] 0925 19:31:53.784370 (+     0us) service_pool.cc:170] Inserting onto call queue
0925 19:31:53.784509 (+   139us) service_pool.cc:227] Handling call
0925 19:31:54.295104 (+510595us) inbound_call.cc:173] Queueing success response
Metrics: {}
I20260925 19:31:54.969180  7224 rpc-test-base.h:595] status: Timed out: Sleep RPC to unix:/tmp/dist-test-taskIhJAvR/test-tmp/rpc-test-58355da90c654c9bb4e4cc32bc228520.sock timed out after 1.000s (SENT), seconds elapsed: 1.00176
I20260925 19:31:54.971095  7650 rpc-test-base.h:222] got call: sleep_micros: 1500000
W20260925 19:31:55.479460  7652 rpcz_store.cc:267] Call kudu.rpc.GenericCalculatorService.Sleep from unix:<unnamed> (request call id 12) took 1511 ms (client timeout 1000 ms). Trace:
W20260925 19:31:55.479832  7652 rpcz_store.cc:269] 0925 19:31:53.967996 (+     0us) service_pool.cc:170] Inserting onto call queue
0925 19:31:53.978794 (+ 10798us) service_pool.cc:227] Handling call
0925 19:31:55.479319 (+1500525us) inbound_call.cc:173] Queueing success response
Metrics: {}
I20260925 19:31:55.971330  7224 rpc-test-base.h:595] status: Timed out: Sleep RPC to unix:/tmp/dist-test-taskIhJAvR/test-tmp/rpc-test-58355da90c654c9bb4e4cc32bc228520.sock timed out after 1.000s (SENT), seconds elapsed: 1.00164
W20260925 19:31:55.972796  7645 messenger.cc:357] Unable to handle RPC call: Not implemented: call requires unsupported application feature flags: 99, 1
W20260925 19:31:55.974179  7645 messenger.cc:357] Unable to handle RPC call: Not implemented: call requires unsupported application feature flags: 99, 1
W20260925 19:31:56.190685  7645 connection.cc:196] Error closing socket: Network error: TlsSocket::Close: Broken pipe
W20260925 19:31:56.471695  7650 rpcz_store.cc:267] Call kudu.rpc.GenericCalculatorService.Sleep from unix:<unnamed> (request call id 13) took 1501 ms (client timeout 1000 ms). Trace:
W20260925 19:31:56.472023  7650 rpcz_store.cc:269] 0925 19:31:54.970786 (+     0us) service_pool.cc:170] Inserting onto call queue
0925 19:31:54.970978 (+   192us) service_pool.cc:227] Handling call
0925 19:31:56.471639 (+1500661us) inbound_call.cc:173] Queueing success response
Metrics: {}
W20260925 19:31:56.472599  7645 connection.cc:441] server connection from unix:<unnamed> torn down before Call kudu.rpc.GenericCalculatorService.Sleep from unix:<unnamed> (request call id 13) could send its response
[       OK ] Parameters/TestRpc.TestCancellation/SSL_UnixSocket (3186 ms)
[ RUN      ] Parameters/TestRpc.TestCancellationMultiThreads/SSL_UnixSocket
I20260925 19:31:56.506992  7674 acceptor_pool.cc:254] collecting diagnostics on the listening RPC socket unix:/tmp/dist-test-taskIhJAvR/test-tmp/rpc-test-573203b0d7fd40e996ca8f2ddb92cb3a.sock every 8 connection(s)
I20260925 19:31:56.507845  7675 acceptor_pool.cc:254] collecting diagnostics on the listening RPC socket unix:/tmp/dist-test-taskIhJAvR/test-tmp/rpc-test-573203b0d7fd40e996ca8f2ddb92cb3a.sock every 8 connection(s)
I20260925 19:31:56.510949  7224 rpc-test.cc:1808] Connecting to unix:/tmp/dist-test-taskIhJAvR/test-tmp/rpc-test-573203b0d7fd40e996ca8f2ddb92cb3a.sock
I20260925 19:31:56.660243  7688 test_util.cc:268] Using random seed: -990612055
I20260925 19:31:56.661372  7689 test_util.cc:268] Using random seed: -990610849
I20260925 19:31:56.662915  7690 test_util.cc:268] Using random seed: -990609418
I20260925 19:31:56.664305  7691 test_util.cc:268] Using random seed: -990607932
I20260925 19:31:56.666146  7692 test_util.cc:268] Using random seed: -990606241
I20260925 19:31:56.667694  7693 test_util.cc:268] Using random seed: -990604733
I20260925 19:31:56.669450  7694 test_util.cc:268] Using random seed: -990602926
I20260925 19:31:56.670921  7695 test_util.cc:268] Using random seed: -990601428
I20260925 19:31:56.672634  7696 test_util.cc:268] Using random seed: -990599730
I20260925 19:31:56.674013  7697 test_util.cc:268] Using random seed: -990598327
I20260925 19:31:56.675757  7698 test_util.cc:268] Using random seed: -990596631
I20260925 19:31:56.677163  7699 test_util.cc:268] Using random seed: -990595187
I20260925 19:31:56.679195  7700 test_util.cc:268] Using random seed: -990593185
I20260925 19:31:56.681443  7701 test_util.cc:268] Using random seed: -990590961
I20260925 19:31:56.683050  7702 test_util.cc:268] Using random seed: -990589309
I20260925 19:31:56.684923  7703 test_util.cc:268] Using random seed: -990587452
I20260925 19:31:56.686597  7704 test_util.cc:268] Using random seed: -990585754
I20260925 19:31:56.688687  7705 test_util.cc:268] Using random seed: -990583771
I20260925 19:31:56.691233  7706 test_util.cc:268] Using random seed: -990581145
I20260925 19:31:56.692857  7707 test_util.cc:268] Using random seed: -990579515
I20260925 19:31:56.694582  7708 test_util.cc:268] Using random seed: -990577782
I20260925 19:31:56.695973  7709 test_util.cc:268] Using random seed: -990576358
I20260925 19:31:56.697592  7710 test_util.cc:268] Using random seed: -990574723
I20260925 19:31:56.699133  7711 test_util.cc:268] Using random seed: -990573239
I20260925 19:31:56.700604  7712 test_util.cc:268] Using random seed: -990571774
I20260925 19:31:56.702433  7713 test_util.cc:268] Using random seed: -990569968
I20260925 19:31:56.704061  7714 test_util.cc:268] Using random seed: -990568300
I20260925 19:31:56.705801  7715 test_util.cc:268] Using random seed: -990566645
I20260925 19:31:56.707122  7716 test_util.cc:268] Using random seed: -990565189
I20260925 19:31:56.709098  7717 test_util.cc:268] Using random seed: -990563271
W20260925 19:32:15.924273  7671 connection.cc:196] Error closing socket: Network error: TlsSocket::Close: Broken pipe
[       OK ] Parameters/TestRpc.TestCancellationMultiThreads/SSL_UnixSocket (19461 ms)
[ RUN      ] Parameters/TestRpc.TestCallId/SSL_UnixSocket
I20260925 19:32:15.969444  7731 acceptor_pool.cc:254] collecting diagnostics on the listening RPC socket unix:/tmp/dist-test-taskIhJAvR/test-tmp/rpc-test-4cff313d987a440c9ef839a022cd0573.sock every 8 connection(s)
I20260925 19:32:15.970323  7732 acceptor_pool.cc:254] collecting diagnostics on the listening RPC socket unix:/tmp/dist-test-taskIhJAvR/test-tmp/rpc-test-4cff313d987a440c9ef839a022cd0573.sock every 8 connection(s)
[       OK ] Parameters/TestRpc.TestCallId/SSL_UnixSocket (82 ms)
[----------] 20 tests from Parameters/TestRpc (38005 ms total)

[----------] Global test environment tear-down
[==========] 21 tests from 2 test suites ran. (41224 ms total)
[  PASSED  ] 20 tests.
[  FAILED  ] 1 test, listed below:
[  FAILED  ] Parameters/TestRpc.TestCallWithChainCertAndRootCA/SSL_UnixSocket, where GetParam() = (true, true)

 1 FAILED TEST
I20260925 19:32:16.042829  7224 logging.cc:424] LogThrottler /data0/somelongdirectorytoavoidrpathissues/src/kudu/src/kudu/rpc/acceptor_pool.cc:285: suppressed but not reported on 3 messages since previous log ~34 seconds ago