Diagnosed failure

Parameters/TestRpc.TestCallWithChainCertAndChainCA/SSL_TCP: /data0/somelongdirectorytoavoidrpathissues/src/kudu/src/kudu/rpc/rpc-test.cc:270: Failure
Failed
Bad status: Runtime error: could not verify certificate chain (error with cert: subject=CN = localhost, ST = sadfjas, C = AS, emailAddress = sdflkdsajf, O = lskdfjlsad, OU = sldfkja, issuer=C = AS, ST = ASDfkjdhf, L = lskdjf, O = saldfja, OU = skdjf, CN = localhost, emailAddress = sadjflkadsj): : certificate has expired
Google Test trace:
/data0/somelongdirectorytoavoidrpathissues/src/kudu/src/kudu/rpc/rpc-test.cc:267: Connecting to 0.0.0.0:36785
I20260926 12:10:25.658891   811 test_util.cc:175] -----------------------------------------------
I20260926 12:10:25.659094   811 test_util.cc:176] Had fatal failures, leaving test files at /tmp/dist-test-taskz1xmQz/test-tmp/rpc-test.5.Parameters_TestRpc.TestCallWithChainCertAndChainCA_SSL_TCP.1790424624281661-811-0

Full log

Note: This is test shard 6 of 8.
[==========] Running 21 tests from 2 test suites.
[----------] Global test environment set-up.
[----------] 20 tests from Parameters/TestRpc
[ RUN      ] Parameters/TestRpc.TestMessengerCreateDestroy/SSL_TCP
WARNING: Logging before InitGoogleLogging() is written to STDERR
I20260926 12:10:24.383962   811 rpc-test.cc:169] started messenger TestCreateDestroy
[       OK ] Parameters/TestRpc.TestMessengerCreateDestroy/SSL_TCP (1181 ms)
[ RUN      ] Parameters/TestRpc.TestNegotiationDeadlock/SSL_TCP
I20260926 12:10:25.546060   833 acceptor_pool.cc:254] collecting diagnostics on the listening RPC socket 0.0.0.0:41831 every 8 connection(s)
I20260926 12:10:25.547544   834 acceptor_pool.cc:254] collecting diagnostics on the listening RPC socket 0.0.0.0:41831 every 8 connection(s)
[       OK ] Parameters/TestRpc.TestNegotiationDeadlock/SSL_TCP (80 ms)
[ RUN      ] Parameters/TestRpc.TestCallWithChainCertAndChainCA/SSL_TCP
I20260926 12:10:25.627048   849 acceptor_pool.cc:254] collecting diagnostics on the listening RPC socket 0.0.0.0:36785 every 8 connection(s)
I20260926 12:10:25.629604   850 acceptor_pool.cc:254] collecting diagnostics on the listening RPC socket 0.0.0.0:36785 every 8 connection(s)
/data0/somelongdirectorytoavoidrpathissues/src/kudu/src/kudu/rpc/rpc-test.cc:270: Failure
Failed
Bad status: Runtime error: could not verify certificate chain (error with cert: subject=CN = localhost, ST = sadfjas, C = AS, emailAddress = sdflkdsajf, O = lskdfjlsad, OU = sldfkja, issuer=C = AS, ST = ASDfkjdhf, L = lskdjf, O = saldfja, OU = skdjf, CN = localhost, emailAddress = sadjflkadsj): : certificate has expired
Google Test trace:
/data0/somelongdirectorytoavoidrpathissues/src/kudu/src/kudu/rpc/rpc-test.cc:267: Connecting to 0.0.0.0:36785
I20260926 12:10:25.658891   811 test_util.cc:175] -----------------------------------------------
I20260926 12:10:25.659094   811 test_util.cc:176] Had fatal failures, leaving test files at /tmp/dist-test-taskz1xmQz/test-tmp/rpc-test.5.Parameters_TestRpc.TestCallWithChainCertAndChainCA_SSL_TCP.1790424624281661-811-0
[  FAILED  ] Parameters/TestRpc.TestCallWithChainCertAndChainCA/SSL_TCP, where GetParam() = (true, false) (57 ms)
[ RUN      ] Parameters/TestRpc.TestCallWithPasswordProtectedKey/SSL_TCP
I20260926 12:10:25.675724   874 acceptor_pool.cc:254] collecting diagnostics on the listening RPC socket 0.0.0.0:41663 every 8 connection(s)
I20260926 12:10:25.676478   875 acceptor_pool.cc:254] collecting diagnostics on the listening RPC socket 0.0.0.0:41663 every 8 connection(s)
[       OK ] Parameters/TestRpc.TestCallWithPasswordProtectedKey/SSL_TCP (66 ms)
[ RUN      ] Parameters/TestRpc.TestCallToBadServer/SSL_TCP
I20260926 12:10:25.759537   811 rpc-test.cc:394] Status: Network error: Client connection negotiation failed: client connection to 0.0.0.0:0: connect: Connection refused (error 111)
I20260926 12:10:25.760756   811 rpc-test.cc:394] Status: Network error: Client connection negotiation failed: client connection to 0.0.0.0:0: connect: Connection refused (error 111)
I20260926 12:10:25.761894   811 rpc-test.cc:394] Status: Network error: Client connection negotiation failed: client connection to 0.0.0.0:0: connect: Connection refused (error 111)
I20260926 12:10:25.763026   811 rpc-test.cc:394] Status: Network error: Client connection negotiation failed: client connection to 0.0.0.0:0: connect: Connection refused (error 111)
I20260926 12:10:25.764213   811 rpc-test.cc:394] Status: Network error: Client connection negotiation failed: client connection to 0.0.0.0:0: connect: Connection refused (error 111)
[       OK ] Parameters/TestRpc.TestCallToBadServer/SSL_TCP (41 ms)
[ RUN      ] Parameters/TestRpc.TestWrongService/SSL_TCP
I20260926 12:10:25.801813   909 acceptor_pool.cc:254] collecting diagnostics on the listening RPC socket 0.0.0.0:43765 every 8 connection(s)
I20260926 12:10:25.802775   910 acceptor_pool.cc:254] collecting diagnostics on the listening RPC socket 0.0.0.0:43765 every 8 connection(s)
I20260926 12:10:25.850602   908 messenger.cc:345] service WrongServiceName not registered on TestServer
[       OK ] Parameters/TestRpc.TestWrongService/SSL_TCP (95 ms)
[ RUN      ] Parameters/TestRpc.TestConnectionKeepalive/SSL_TCP
I20260926 12:10:25.882922   932 acceptor_pool.cc:254] collecting diagnostics on the listening RPC socket 0.0.0.0:38423 every 8 connection(s)
I20260926 12:10:25.883690   933 acceptor_pool.cc:254] collecting diagnostics on the listening RPC socket 0.0.0.0:38423 every 8 connection(s)
I20260926 12:10:25.886788   811 rpc-test.cc:488] Connecting to 0.0.0.0:38423
[       OK ] Parameters/TestRpc.TestConnectionKeepalive/SSL_TCP (1075 ms)
[ RUN      ] Parameters/TestRpc.TestClientConnectionMetrics/SSL_TCP
I20260926 12:10:26.964910   957 acceptor_pool.cc:254] collecting diagnostics on the listening RPC socket 0.0.0.0:40055 every 8 connection(s)
I20260926 12:10:26.965651   958 acceptor_pool.cc:254] collecting diagnostics on the listening RPC socket 0.0.0.0:40055 every 8 connection(s)
I20260926 12:10:26.968798   811 rpc-test.cc:569] Connecting to 0.0.0.0:40055
[       OK ] Parameters/TestRpc.TestClientConnectionMetrics/SSL_TCP (116514 ms)
[ RUN      ] Parameters/TestRpc.TestCredentialsPolicy/SSL_TCP
I20260926 12:12:23.480079   991 acceptor_pool.cc:254] collecting diagnostics on the listening RPC socket 0.0.0.0:46343 every 8 connection(s)
I20260926 12:12:23.480866   992 acceptor_pool.cc:254] collecting diagnostics on the listening RPC socket 0.0.0.0:46343 every 8 connection(s)
I20260926 12:12:23.484122   811 rpc-test.cc:700] Connecting to 0.0.0.0:46343
[       OK ] Parameters/TestRpc.TestCredentialsPolicy/SSL_TCP (100 ms)
[ RUN      ] Parameters/TestRpc.TestCallLongerThanKeepalive/SSL_TCP
I20260926 12:12:23.578272  1016 acceptor_pool.cc:254] collecting diagnostics on the listening RPC socket 0.0.0.0:38791 every 8 connection(s)
I20260926 12:12:23.579007  1017 acceptor_pool.cc:254] collecting diagnostics on the listening RPC socket 0.0.0.0:38791 every 8 connection(s)
I20260926 12:12:23.610451  1020 rpc-test-base.h:222] got call: sleep_micros: 3000000 deferred: true
I20260926 12:12:26.614993  1020 rpcz_store.cc:275] Call kudu.rpc.GenericCalculatorService.Sleep from 127.0.0.1:59870 (request call id 0) took 3004 ms. Trace:
I20260926 12:12:26.615480  1020 rpcz_store.cc:276] 0926 12:12:23.610190 (+     0us) service_pool.cc:170] Inserting onto call queue
0926 12:12:23.610301 (+   111us) service_pool.cc:227] Handling call
0926 12:12:26.614825 (+3004524us) inbound_call.cc:173] Queueing success response
Metrics: {}
[       OK ] Parameters/TestRpc.TestCallLongerThanKeepalive/SSL_TCP (3075 ms)
[ RUN      ] Parameters/TestRpc.TestRpcSidecar/SSL_TCP
I20260926 12:12:26.657663  1042 acceptor_pool.cc:254] collecting diagnostics on the listening RPC socket 0.0.0.0:36829 every 8 connection(s)
I20260926 12:12:26.658493  1043 acceptor_pool.cc:254] collecting diagnostics on the listening RPC socket 0.0.0.0:36829 every 8 connection(s)
[       OK ] Parameters/TestRpc.TestRpcSidecar/SSL_TCP (529 ms)
[ RUN      ] Parameters/TestRpc.TestRpcSidecarLimits/SSL_TCP
I20260926 12:12:43.969476  1068 acceptor_pool.cc:254] collecting diagnostics on the listening RPC socket 0.0.0.0:37743 every 8 connection(s)
I20260926 12:12:43.970264  1069 acceptor_pool.cc:254] collecting diagnostics on the listening RPC socket 0.0.0.0:37743 every 8 connection(s)
W20260926 12:12:44.000006   811 serialization.cc:72] Serialized kudu.rpc_test.PushStringsRequestPB (2147483654 bytes) is larger than the maximum configured RPC message size (52428800 bytes). Sending anyway, but peer may reject the data.
W20260926 12:12:44.012555  1066 connection.cc:535] server connection from 127.0.0.1:52120 recv error: Network error: RPC frame had a length of 2147483714, but we only support messages up to 52428800 bytes long.
W20260926 12:12:44.012987  1066 connection.cc:158] shutting down server connection from 127.0.0.1:52120 with pending inbound data: 4/2147483714 bytes received; last active 0 ns ago: status Network error: RPC frame had a length of 2147483714, but we only support messages up to 52428800 bytes long.
W20260926 12:12:44.014192  1081 connection.cc:698] client connection to 0.0.0.0:37743 send error: Network error: failed to write to TLS socket: Connection reset by peer
W20260926 12:12:44.014853  1081 connection.cc:196] Error closing socket: Network error: TlsSocket::Close: Success
[       OK ] Parameters/TestRpc.TestRpcSidecarLimits/SSL_TCP (17682 ms)
[ RUN      ] Parameters/TestRpc.TestCallTimeoutDoesntAffectNegotiation/SSL_TCP
I20260926 12:12:44.858528  1094 acceptor_pool.cc:254] collecting diagnostics on the listening RPC socket 0.0.0.0:34721 every 8 connection(s)
I20260926 12:12:44.859326  1095 acceptor_pool.cc:254] collecting diagnostics on the listening RPC socket 0.0.0.0:34721 every 8 connection(s)
W20260926 12:12:44.886307  1090 negotiation.cc:266] Injecting 500ms delay in negotiation
I20260926 12:12:44.935930   811 rpc-test-base.h:595] status: Timed out: connection negotiation to 0.0.0.0:34721 for RPC Sleep timed out after 0.050s (ON_OUTBOUND_QUEUE), seconds elapsed: 0.0506559
[       OK ] Parameters/TestRpc.TestCallTimeoutDoesntAffectNegotiation/SSL_TCP (562 ms)
[ RUN      ] Parameters/TestRpc.TestRpcHandlerLatencyMetric/SSL_TCP
I20260926 12:12:45.429370  1119 acceptor_pool.cc:254] collecting diagnostics on the listening RPC socket 0.0.0.0:43901 every 8 connection(s)
I20260926 12:12:45.430070  1120 acceptor_pool.cc:254] collecting diagnostics on the listening RPC socket 0.0.0.0:43901 every 8 connection(s)
I20260926 12:12:45.498247   811 rpc-test.cc:1236] Sleep() min lat: 21590
I20260926 12:12:45.498448   811 rpc-test.cc:1237] Sleep() mean lat: 21590
I20260926 12:12:45.498602   811 rpc-test.cc:1238] Sleep() max lat: 21590
I20260926 12:12:45.498721   811 rpc-test.cc:1239] Sleep() #calls: 1
[       OK ] Parameters/TestRpc.TestRpcHandlerLatencyMetric/SSL_TCP (101 ms)
[ RUN      ] Parameters/TestRpc.TimedOutOnResponseMetricServiceQueue/SSL_TCP
I20260926 12:12:45.522934  1145 acceptor_pool.cc:254] collecting diagnostics on the listening RPC socket 0.0.0.0:46455 every 8 connection(s)
I20260926 12:12:45.523665  1146 acceptor_pool.cc:254] collecting diagnostics on the listening RPC socket 0.0.0.0:46455 every 8 connection(s)
W20260926 12:12:45.589404  1147 rpcz_store.cc:267] Call kudu.rpc_test.CalculatorService.Sleep from 127.0.0.1:36400 (request call id 2) took 20 ms (client timeout 20 ms). Trace:
W20260926 12:12:45.589824  1147 rpcz_store.cc:269] 0926 12:12:45.568935 (+     0us) service_pool.cc:170] Inserting onto call queue
0926 12:12:45.589280 (+ 20345us) service_pool.cc:214] Skipping call since client already timed out
0926 12:12:45.589358 (+    78us) inbound_call.cc:173] Queueing failure response
Metrics: {}
[       OK ] Parameters/TestRpc.TimedOutOnResponseMetricServiceQueue/SSL_TCP (91 ms)
[ RUN      ] Parameters/TestRpc.RpcPendingConnectionsMetric/SSL_TCP
I20260926 12:12:45.607441  1168 acceptor_pool.cc:254] collecting diagnostics on the listening RPC socket 0.0.0.0:34225 every 8 connection(s)
I20260926 12:12:45.608206  1169 acceptor_pool.cc:254] collecting diagnostics on the listening RPC socket 0.0.0.0:34225 every 8 connection(s)
W20260926 12:12:45.622818  1164 negotiation.cc:337] Failed RPC negotiation. Trace:
0926 12:12:45.621047 (+     0us) reactor.cc:625] Submitting negotiation task for server connection from 127.0.0.1:56650 (local address 127.0.0.1:34225)
0926 12:12:45.621709 (+   662us) server_negotiation.cc:206] Beginning negotiation
0926 12:12:45.621745 (+    36us) server_negotiation.cc:399] Waiting for connection header
0926 12:12:45.622150 (+   405us) negotiation.cc:327] Negotiation complete: Network error: Server connection negotiation failed: server connection from 127.0.0.1:56650: BlockingRecv error: recv got EOF from 127.0.0.1:56650 (error 108)
Metrics: {"server-negotiator.queue_time_us":138}
[       OK ] Parameters/TestRpc.RpcPendingConnectionsMetric/SSL_TCP (39 ms)
[ RUN      ] Parameters/TestRpc.TestRpcContextClientDeadline/SSL_TCP
I20260926 12:12:45.661439  1184 acceptor_pool.cc:254] collecting diagnostics on the listening RPC socket 0.0.0.0:39209 every 8 connection(s)
I20260926 12:12:45.662149  1185 acceptor_pool.cc:254] collecting diagnostics on the listening RPC socket 0.0.0.0:39209 every 8 connection(s)
[       OK ] Parameters/TestRpc.TestRpcContextClientDeadline/SSL_TCP (89 ms)
[ RUN      ] Parameters/TestRpc.TestApplicationFeatureFlagUnsupportedServer/SSL_TCP
I20260926 12:12:45.747545  1209 acceptor_pool.cc:254] collecting diagnostics on the listening RPC socket 0.0.0.0:40691 every 8 connection(s)
I20260926 12:12:45.748260  1210 acceptor_pool.cc:254] collecting diagnostics on the listening RPC socket 0.0.0.0:40691 every 8 connection(s)
[       OK ] Parameters/TestRpc.TestApplicationFeatureFlagUnsupportedServer/SSL_TCP (58 ms)
[ RUN      ] Parameters/TestRpc.TestCancellationAsync/SSL_TCP
I20260926 12:12:45.802448  1234 acceptor_pool.cc:254] collecting diagnostics on the listening RPC socket 0.0.0.0:36211 every 8 connection(s)
I20260926 12:12:45.803189  1235 acceptor_pool.cc:254] collecting diagnostics on the listening RPC socket 0.0.0.0:36211 every 8 connection(s)
I20260926 12:12:45.806279   811 rpc-test.cc:1716] Connecting to 0.0.0.0:36211
I20260926 12:12:45.842381   811 test_util.cc:268] Using random seed: -1070971978
I20260926 12:12:46.077749  1238 rpc-test-base.h:240] got call: sleep_micros: 500 pattern: 4294967295 num_repetitions: 2097152 sidecar_idx: 0
I20260926 12:12:46.247140  1237 rpc-test-base.h:240] got call: sleep_micros: 500 pattern: 4294967295 num_repetitions: 2097152 sidecar_idx: 0
I20260926 12:12:46.439343  1238 rpc-test-base.h:240] got call: sleep_micros: 500 pattern: 4294967295 num_repetitions: 2097152 sidecar_idx: 0
I20260926 12:12:46.613637  1237 rpc-test-base.h:240] got call: sleep_micros: 500 pattern: 4294967295 num_repetitions: 2097152 sidecar_idx: 0
I20260926 12:12:46.800913  1238 rpc-test-base.h:240] got call: sleep_micros: 500 pattern: 4294967295 num_repetitions: 2097152 sidecar_idx: 0
I20260926 12:12:46.983836  1237 rpc-test-base.h:240] got call: sleep_micros: 500 pattern: 4294967295 num_repetitions: 2097152 sidecar_idx: 0
I20260926 12:12:47.172487  1237 rpc-test-base.h:240] got call: sleep_micros: 500 pattern: 4294967295 num_repetitions: 2097152 sidecar_idx: 0
I20260926 12:12:47.353860  1237 rpc-test-base.h:240] got call: sleep_micros: 500 pattern: 4294967295 num_repetitions: 2097152 sidecar_idx: 0
W20260926 12:12:47.509250  1233 connection.cc:196] Error closing socket: Network error: TlsSocket::Close: Broken pipe
W20260926 12:12:47.511389  1233 connection.cc:441] server connection from 127.0.0.1:41272 torn down before Call kudu.rpc.GenericCalculatorService.SleepWithSidecar from 127.0.0.1:41272 (request call id 8) could send its response
[       OK ] Parameters/TestRpc.TestCancellationAsync/SSL_TCP (1737 ms)
[ RUN      ] Parameters/TestRpc.TestPerformanceBySocketType/SSL_TCP
I20260926 12:12:47.623162  1259 acceptor_pool.cc:254] collecting diagnostics on the listening RPC socket 0.0.0.0:46837 every 8 connection(s)
I20260926 12:12:47.623911  1260 acceptor_pool.cc:254] collecting diagnostics on the listening RPC socket 0.0.0.0:46837 every 8 connection(s)
I20260926 12:12:47.626922   811 rpc-test.cc:1846] Connecting to 0.0.0.0:46837
I20260926 12:13:07.112840   811 rpc-test.cc:1859] Sending 1024MB via ssl-enabled tcp socket: real 19.467s	user 16.670s	sys 11.278s
I20260926 12:13:26.290498   811 rpc-test.cc:1859] Sending 1024MB via ssl-enabled tcp socket: real 19.177s	user 16.550s	sys 10.766s
I20260926 12:13:45.598950   811 rpc-test.cc:1859] Sending 1024MB via ssl-enabled tcp socket: real 19.308s	user 16.375s	sys 11.291s
I20260926 12:14:04.767100   811 rpc-test.cc:1859] Sending 1024MB via ssl-enabled tcp socket: real 19.168s	user 16.323s	sys 11.008s
I20260926 12:14:24.100167   811 rpc-test.cc:1859] Sending 1024MB via ssl-enabled tcp socket: real 19.333s	user 16.758s	sys 10.831s
[       OK ] Parameters/TestRpc.TestPerformanceBySocketType/SSL_TCP (96596 ms)
[----------] 20 tests from Parameters/TestRpc (239779 ms total)

[----------] 1 test from Parameters/TestRpcSocketTxRxQueue
[ RUN      ] Parameters/TestRpcSocketTxRxQueue.OverCapacity/0
W20260926 12:14:24.564785  1285 negotiation.cc:337] Failed RPC negotiation. Trace:
0926 12:14:24.134438 (+     0us) reactor.cc:625] Submitting negotiation task for client connection to 0.0.0.0:38331 (local address 127.0.0.1:37088)
0926 12:14:24.135141 (+   703us) negotiation.cc:107] Waiting for socket to connect
0926 12:14:24.135194 (+    53us) client_negotiation.cc:174] Beginning negotiation
0926 12:14:24.135726 (+   532us) client_negotiation.cc:252] Sending NEGOTIATE NegotiatePB request
0926 12:14:24.563602 (+427876us) negotiation.cc:327] Negotiation complete: Network error: Client connection negotiation failed: client connection to 0.0.0.0:38331: BlockingRecv error: recv error from unknown peer: Transport endpoint is not connected (error 107)
Metrics: {"client-negotiator.queue_time_us":142}
W20260926 12:14:24.566341  1303 negotiation.cc:337] Failed RPC negotiation. Trace:
0926 12:14:24.148534 (+     0us) reactor.cc:625] Submitting negotiation task for client connection to 0.0.0.0:38331 (local address 127.0.0.1:37110)
0926 12:14:24.149192 (+   658us) negotiation.cc:107] Waiting for socket to connect
0926 12:14:24.149233 (+    41us) client_negotiation.cc:174] Beginning negotiation
0926 12:14:24.149533 (+   300us) client_negotiation.cc:252] Sending NEGOTIATE NegotiatePB request
0926 12:14:24.563711 (+414178us) negotiation.cc:327] Negotiation complete: Network error: Client connection negotiation failed: client connection to 0.0.0.0:38331: BlockingRecv error: recv error from unknown peer: Transport endpoint is not connected (error 107)
Metrics: {"client-negotiator.queue_time_us":172}
W20260926 12:14:24.566864  1330 negotiation.cc:337] Failed RPC negotiation. Trace:
0926 12:14:24.190786 (+     0us) reactor.cc:625] Submitting negotiation task for client connection to 0.0.0.0:38331 (local address 127.0.0.1:37130)
0926 12:14:24.191583 (+   797us) negotiation.cc:107] Waiting for socket to connect
0926 12:14:24.191624 (+    41us) client_negotiation.cc:174] Beginning negotiation
0926 12:14:24.191878 (+   254us) client_negotiation.cc:252] Sending NEGOTIATE NegotiatePB request
0926 12:14:24.564495 (+372617us) negotiation.cc:327] Negotiation complete: Network error: Client connection negotiation failed: client connection to 0.0.0.0:38331: BlockingRecv error: recv error from unknown peer: Transport endpoint is not connected (error 107)
Metrics: {"client-negotiator.queue_time_us":169}
W20260926 12:14:24.567368  1294 negotiation.cc:337] Failed RPC negotiation. Trace:
0926 12:14:24.141141 (+     0us) reactor.cc:625] Submitting negotiation task for client connection to 0.0.0.0:38331 (local address 127.0.0.1:37102)
0926 12:14:24.141678 (+   537us) negotiation.cc:107] Waiting for socket to connect
0926 12:14:24.141710 (+    32us) client_negotiation.cc:174] Beginning negotiation
0926 12:14:24.141894 (+   184us) client_negotiation.cc:252] Sending NEGOTIATE NegotiatePB request
0926 12:14:24.563667 (+421773us) negotiation.cc:327] Negotiation complete: Network error: Client connection negotiation failed: client connection to 0.0.0.0:38331: BlockingRecv error: recv error from unknown peer: Transport endpoint is not connected (error 107)
Metrics: {"client-negotiator.queue_time_us":127}
W20260926 12:14:24.567837  1321 negotiation.cc:337] Failed RPC negotiation. Trace:
0926 12:14:24.172683 (+     0us) reactor.cc:625] Submitting negotiation task for client connection to 0.0.0.0:38331 (local address 127.0.0.1:37124)
0926 12:14:24.173287 (+   604us) negotiation.cc:107] Waiting for socket to connect
0926 12:14:24.173316 (+    29us) client_negotiation.cc:174] Beginning negotiation
0926 12:14:24.173501 (+   185us) client_negotiation.cc:252] Sending NEGOTIATE NegotiatePB request
0926 12:14:24.566434 (+392933us) negotiation.cc:327] Negotiation complete: Network error: Client connection negotiation failed: client connection to 0.0.0.0:38331: BlockingRecv error: recv error from unknown peer: Transport endpoint is not connected (error 107)
Metrics: {"client-negotiator.queue_time_us":150}
W20260926 12:14:24.568231  1312 negotiation.cc:337] Failed RPC negotiation. Trace:
0926 12:14:24.160702 (+     0us) reactor.cc:625] Submitting negotiation task for client connection to 0.0.0.0:38331 (local address 127.0.0.1:37116)
0926 12:14:24.161350 (+   648us) negotiation.cc:107] Waiting for socket to connect
0926 12:14:24.161401 (+    51us) client_negotiation.cc:174] Beginning negotiation
0926 12:14:24.161697 (+   296us) client_negotiation.cc:252] Sending NEGOTIATE NegotiatePB request
0926 12:14:24.563602 (+401905us) negotiation.cc:327] Negotiation complete: Network error: Client connection negotiation failed: client connection to 0.0.0.0:38331: BlockingRecv error: recv error from unknown peer: Transport endpoint is not connected (error 107)
Metrics: {"client-negotiator.queue_time_us":154}
[       OK ] Parameters/TestRpcSocketTxRxQueue.OverCapacity/0 (1255 ms)
[----------] 1 test from Parameters/TestRpcSocketTxRxQueue (1256 ms total)

[----------] Global test environment tear-down
[==========] 21 tests from 2 test suites ran. (241036 ms total)
[  PASSED  ] 20 tests.
[  FAILED  ] 1 test, listed below:
[  FAILED  ] Parameters/TestRpc.TestCallWithChainCertAndChainCA/SSL_TCP, where GetParam() = (true, false)

 1 FAILED TEST