Diagnosed failure

Parameters/TestRpc.TestCallWithChainCertAndChainCA/SSL_TCP: /data0/somelongdirectorytoavoidrpathissues/src/kudu/src/kudu/rpc/rpc-test.cc:270: Failure
Failed
Bad status: Runtime error: could not verify certificate chain (error with cert: subject=CN = localhost, ST = sadfjas, C = AS, emailAddress = sdflkdsajf, O = lskdfjlsad, OU = sldfkja, issuer=C = AS, ST = ASDfkjdhf, L = lskdjf, O = saldfja, OU = skdjf, CN = localhost, emailAddress = sadjflkadsj): : certificate has expired
Google Test trace:
/data0/somelongdirectorytoavoidrpathissues/src/kudu/src/kudu/rpc/rpc-test.cc:267: Connecting to 0.0.0.0:46865
I20260925 21:47:27.938763  2810 test_util.cc:175] -----------------------------------------------
I20260925 21:47:27.938859  2810 test_util.cc:176] Had fatal failures, leaving test files at /tmp/dist-test-taskeV91g5/test-tmp/rpc-test.5.Parameters_TestRpc.TestCallWithChainCertAndChainCA_SSL_TCP.1790372847801310-2810-0

Full log

Note: This is test shard 6 of 8.
[==========] Running 21 tests from 2 test suites.
[----------] Global test environment set-up.
[----------] 20 tests from Parameters/TestRpc
[ RUN      ] Parameters/TestRpc.TestMessengerCreateDestroy/SSL_TCP
WARNING: Logging before InitGoogleLogging() is written to STDERR
I20260925 21:47:27.850302  2810 rpc-test.cc:169] started messenger TestCreateDestroy
[       OK ] Parameters/TestRpc.TestMessengerCreateDestroy/SSL_TCP (32 ms)
[ RUN      ] Parameters/TestRpc.TestNegotiationDeadlock/SSL_TCP
I20260925 21:47:27.867174  2830 acceptor_pool.cc:254] collecting diagnostics on the listening RPC socket 0.0.0.0:36887 every 8 connection(s)
I20260925 21:47:27.867377  2831 acceptor_pool.cc:254] collecting diagnostics on the listening RPC socket 0.0.0.0:36887 every 8 connection(s)
[       OK ] Parameters/TestRpc.TestNegotiationDeadlock/SSL_TCP (33 ms)
[ RUN      ] Parameters/TestRpc.TestCallWithChainCertAndChainCA/SSL_TCP
I20260925 21:47:27.927052  2846 acceptor_pool.cc:254] collecting diagnostics on the listening RPC socket 0.0.0.0:46865 every 8 connection(s)
I20260925 21:47:27.927431  2847 acceptor_pool.cc:254] collecting diagnostics on the listening RPC socket 0.0.0.0:46865 every 8 connection(s)
/data0/somelongdirectorytoavoidrpathissues/src/kudu/src/kudu/rpc/rpc-test.cc:270: Failure
Failed
Bad status: Runtime error: could not verify certificate chain (error with cert: subject=CN = localhost, ST = sadfjas, C = AS, emailAddress = sdflkdsajf, O = lskdfjlsad, OU = sldfkja, issuer=C = AS, ST = ASDfkjdhf, L = lskdjf, O = saldfja, OU = skdjf, CN = localhost, emailAddress = sadjflkadsj): : certificate has expired
Google Test trace:
/data0/somelongdirectorytoavoidrpathissues/src/kudu/src/kudu/rpc/rpc-test.cc:267: Connecting to 0.0.0.0:46865
I20260925 21:47:27.938763  2810 test_util.cc:175] -----------------------------------------------
I20260925 21:47:27.938859  2810 test_util.cc:176] Had fatal failures, leaving test files at /tmp/dist-test-taskeV91g5/test-tmp/rpc-test.5.Parameters_TestRpc.TestCallWithChainCertAndChainCA_SSL_TCP.1790372847801310-2810-0
[  FAILED  ] Parameters/TestRpc.TestCallWithChainCertAndChainCA/SSL_TCP, where GetParam() = (true, false) (51 ms)
[ RUN      ] Parameters/TestRpc.TestCallWithPasswordProtectedKey/SSL_TCP
I20260925 21:47:27.956512  2871 acceptor_pool.cc:254] collecting diagnostics on the listening RPC socket 0.0.0.0:46853 every 8 connection(s)
I20260925 21:47:27.956792  2872 acceptor_pool.cc:254] collecting diagnostics on the listening RPC socket 0.0.0.0:46853 every 8 connection(s)
[       OK ] Parameters/TestRpc.TestCallWithPasswordProtectedKey/SSL_TCP (54 ms)
[ RUN      ] Parameters/TestRpc.TestCallToBadServer/SSL_TCP
I20260925 21:47:28.003543  2810 rpc-test.cc:394] Status: Network error: Client connection negotiation failed: client connection to 0.0.0.0:0: connect: Connection refused (error 111)
I20260925 21:47:28.004276  2810 rpc-test.cc:394] Status: Network error: Client connection negotiation failed: client connection to 0.0.0.0:0: connect: Connection refused (error 111)
I20260925 21:47:28.004951  2810 rpc-test.cc:394] Status: Network error: Client connection negotiation failed: client connection to 0.0.0.0:0: connect: Connection refused (error 111)
I20260925 21:47:28.005568  2810 rpc-test.cc:394] Status: Network error: Client connection negotiation failed: client connection to 0.0.0.0:0: connect: Connection refused (error 111)
I20260925 21:47:28.006155  2810 rpc-test.cc:394] Status: Network error: Client connection negotiation failed: client connection to 0.0.0.0:0: connect: Connection refused (error 111)
[       OK ] Parameters/TestRpc.TestCallToBadServer/SSL_TCP (15 ms)
[ RUN      ] Parameters/TestRpc.TestWrongService/SSL_TCP
I20260925 21:47:28.031126  2906 acceptor_pool.cc:254] collecting diagnostics on the listening RPC socket 0.0.0.0:37819 every 8 connection(s)
I20260925 21:47:28.031376  2907 acceptor_pool.cc:254] collecting diagnostics on the listening RPC socket 0.0.0.0:37819 every 8 connection(s)
I20260925 21:47:28.053076  2905 messenger.cc:345] service WrongServiceName not registered on TestServer
[       OK ] Parameters/TestRpc.TestWrongService/SSL_TCP (50 ms)
[ RUN      ] Parameters/TestRpc.TestConnectionKeepalive/SSL_TCP
I20260925 21:47:28.092365  2929 acceptor_pool.cc:254] collecting diagnostics on the listening RPC socket 0.0.0.0:35583 every 8 connection(s)
I20260925 21:47:28.092633  2930 acceptor_pool.cc:254] collecting diagnostics on the listening RPC socket 0.0.0.0:35583 every 8 connection(s)
I20260925 21:47:28.093631  2810 rpc-test.cc:488] Connecting to 0.0.0.0:35583
[       OK ] Parameters/TestRpc.TestConnectionKeepalive/SSL_TCP (1074 ms)
[ RUN      ] Parameters/TestRpc.TestClientConnectionMetrics/SSL_TCP
I20260925 21:47:29.152987  2954 acceptor_pool.cc:254] collecting diagnostics on the listening RPC socket 0.0.0.0:38119 every 8 connection(s)
I20260925 21:47:29.153195  2955 acceptor_pool.cc:254] collecting diagnostics on the listening RPC socket 0.0.0.0:38119 every 8 connection(s)
I20260925 21:47:29.154214  2810 rpc-test.cc:569] Connecting to 0.0.0.0:38119
[       OK ] Parameters/TestRpc.TestClientConnectionMetrics/SSL_TCP (19412 ms)
[ RUN      ] Parameters/TestRpc.TestCredentialsPolicy/SSL_TCP
I20260925 21:47:48.560643  2977 acceptor_pool.cc:254] collecting diagnostics on the listening RPC socket 0.0.0.0:33927 every 8 connection(s)
I20260925 21:47:48.560890  2978 acceptor_pool.cc:254] collecting diagnostics on the listening RPC socket 0.0.0.0:33927 every 8 connection(s)
I20260925 21:47:48.561839  2810 rpc-test.cc:700] Connecting to 0.0.0.0:33927
[       OK ] Parameters/TestRpc.TestCredentialsPolicy/SSL_TCP (58 ms)
[ RUN      ] Parameters/TestRpc.TestCallLongerThanKeepalive/SSL_TCP
I20260925 21:47:48.623065  3002 acceptor_pool.cc:254] collecting diagnostics on the listening RPC socket 0.0.0.0:34085 every 8 connection(s)
I20260925 21:47:48.623291  3003 acceptor_pool.cc:254] collecting diagnostics on the listening RPC socket 0.0.0.0:34085 every 8 connection(s)
I20260925 21:47:48.638741  3006 rpc-test-base.h:222] got call: sleep_micros: 3000000 deferred: true
I20260925 21:47:51.640558  3006 rpcz_store.cc:275] Call kudu.rpc.GenericCalculatorService.Sleep from 127.0.0.1:60686 (request call id 0) took 3001 ms. Trace:
I20260925 21:47:51.640767  3006 rpcz_store.cc:276] 0925 21:47:48.638616 (+     0us) service_pool.cc:170] Inserting onto call queue
0925 21:47:48.638696 (+    80us) service_pool.cc:227] Handling call
0925 21:47:51.640511 (+3001815us) inbound_call.cc:173] Queueing success response
Metrics: {}
[       OK ] Parameters/TestRpc.TestCallLongerThanKeepalive/SSL_TCP (3042 ms)
[ RUN      ] Parameters/TestRpc.TestRpcSidecar/SSL_TCP
I20260925 21:47:51.662431  3027 acceptor_pool.cc:254] collecting diagnostics on the listening RPC socket 0.0.0.0:39141 every 8 connection(s)
I20260925 21:47:51.662654  3028 acceptor_pool.cc:254] collecting diagnostics on the listening RPC socket 0.0.0.0:39141 every 8 connection(s)
[       OK ] Parameters/TestRpc.TestRpcSidecar/SSL_TCP (127 ms)
[ RUN      ] Parameters/TestRpc.TestRpcSidecarLimits/SSL_TCP
I20260925 21:47:53.924829  3052 acceptor_pool.cc:254] collecting diagnostics on the listening RPC socket 0.0.0.0:39497 every 8 connection(s)
I20260925 21:47:53.925081  3053 acceptor_pool.cc:254] collecting diagnostics on the listening RPC socket 0.0.0.0:39497 every 8 connection(s)
W20260925 21:47:53.947993  2810 serialization.cc:72] Serialized kudu.rpc_test.PushStringsRequestPB (2147483654 bytes) is larger than the maximum configured RPC message size (52428800 bytes). Sending anyway, but peer may reject the data.
W20260925 21:47:53.954699  3051 connection.cc:535] server connection from 127.0.0.1:45326 recv error: Network error: RPC frame had a length of 2147483714, but we only support messages up to 52428800 bytes long.
W20260925 21:47:53.954843  3051 connection.cc:158] shutting down server connection from 127.0.0.1:45326 with pending inbound data: 4/2147483714 bytes received; last active 0 ns ago: status Network error: RPC frame had a length of 2147483714, but we only support messages up to 52428800 bytes long.
W20260925 21:47:53.955359  3065 connection.cc:196] Error closing socket: Network error: TlsSocket::Close: Connection reset by peer
I20260925 21:47:53.986788  3077 acceptor_pool.cc:254] collecting diagnostics on the listening RPC socket 0.0.0.0:36571 every 8 connection(s)
I20260925 21:47:53.987018  3078 acceptor_pool.cc:254] collecting diagnostics on the listening RPC socket 0.0.0.0:36571 every 8 connection(s)
W20260925 21:47:59.186707  3075 connection.cc:577] server connection from 127.0.0.1:46576: received bad data: 'Corruption: Invalid packet: message had a length of 2147483710, but we only support messages up to 2147483647 bytes
'
[       OK ] Parameters/TestRpc.TestRpcSidecarLimits/SSL_TCP (7874 ms)
[ RUN      ] Parameters/TestRpc.TestCallTimeoutDoesntAffectNegotiation/SSL_TCP
I20260925 21:47:59.669812  3102 acceptor_pool.cc:254] collecting diagnostics on the listening RPC socket 0.0.0.0:35353 every 8 connection(s)
I20260925 21:47:59.670075  3103 acceptor_pool.cc:254] collecting diagnostics on the listening RPC socket 0.0.0.0:35353 every 8 connection(s)
W20260925 21:47:59.688472  3098 negotiation.cc:266] Injecting 500ms delay in negotiation
I20260925 21:47:59.738950  2810 rpc-test-base.h:595] status: Timed out: connection negotiation to 0.0.0.0:35353 for RPC Sleep timed out after 0.050s (ON_OUTBOUND_QUEUE), seconds elapsed: 0.0510926
[       OK ] Parameters/TestRpc.TestCallTimeoutDoesntAffectNegotiation/SSL_TCP (549 ms)
[ RUN      ] Parameters/TestRpc.TestRpcHandlerLatencyMetric/SSL_TCP
I20260925 21:48:00.211421  3127 acceptor_pool.cc:254] collecting diagnostics on the listening RPC socket 0.0.0.0:33833 every 8 connection(s)
I20260925 21:48:00.211658  3128 acceptor_pool.cc:254] collecting diagnostics on the listening RPC socket 0.0.0.0:33833 every 8 connection(s)
I20260925 21:48:00.262192  2810 rpc-test.cc:1236] Sleep() min lat: 20684
I20260925 21:48:00.262279  2810 rpc-test.cc:1237] Sleep() mean lat: 20684
I20260925 21:48:00.262317  2810 rpc-test.cc:1238] Sleep() max lat: 20684
I20260925 21:48:00.262385  2810 rpc-test.cc:1239] Sleep() #calls: 1
[       OK ] Parameters/TestRpc.TestRpcHandlerLatencyMetric/SSL_TCP (67 ms)
[ RUN      ] Parameters/TestRpc.TimedOutOnResponseMetricServiceQueue/SSL_TCP
I20260925 21:48:00.278666  3153 acceptor_pool.cc:254] collecting diagnostics on the listening RPC socket 0.0.0.0:45429 every 8 connection(s)
I20260925 21:48:00.278888  3154 acceptor_pool.cc:254] collecting diagnostics on the listening RPC socket 0.0.0.0:45429 every 8 connection(s)
W20260925 21:48:00.341629  3155 rpcz_store.cc:267] Call kudu.rpc_test.CalculatorService.Sleep from 127.0.0.1:39298 (request call id 2) took 20 ms (client timeout 20 ms). Trace:
W20260925 21:48:00.341796  3155 rpcz_store.cc:269] 0925 21:48:00.321124 (+     0us) service_pool.cc:170] Inserting onto call queue
0925 21:48:00.341526 (+ 20402us) service_pool.cc:214] Skipping call since client already timed out
0925 21:48:00.341588 (+    62us) inbound_call.cc:173] Queueing failure response
Metrics: {}
[       OK ] Parameters/TestRpc.TimedOutOnResponseMetricServiceQueue/SSL_TCP (78 ms)
[ RUN      ] Parameters/TestRpc.RpcPendingConnectionsMetric/SSL_TCP
I20260925 21:48:00.350582  3176 acceptor_pool.cc:254] collecting diagnostics on the listening RPC socket 0.0.0.0:41063 every 8 connection(s)
I20260925 21:48:00.350816  3177 acceptor_pool.cc:254] collecting diagnostics on the listening RPC socket 0.0.0.0:41063 every 8 connection(s)
W20260925 21:48:00.362998  3172 negotiation.cc:337] Failed RPC negotiation. Trace:
0925 21:48:00.362176 (+     0us) reactor.cc:625] Submitting negotiation task for server connection from 127.0.0.1:35010 (local address 127.0.0.1:41063)
0925 21:48:00.362392 (+   216us) server_negotiation.cc:206] Beginning negotiation
0925 21:48:00.362401 (+     9us) server_negotiation.cc:399] Waiting for connection header
0925 21:48:00.362609 (+   208us) negotiation.cc:327] Negotiation complete: Network error: Server connection negotiation failed: server connection from 127.0.0.1:35010: BlockingRecv error: recv got EOF from 127.0.0.1:35010 (error 108)
Metrics: {"server-negotiator.queue_time_us":61}
[       OK ] Parameters/TestRpc.RpcPendingConnectionsMetric/SSL_TCP (29 ms)
[ RUN      ] Parameters/TestRpc.TestRpcContextClientDeadline/SSL_TCP
I20260925 21:48:00.397099  3192 acceptor_pool.cc:254] collecting diagnostics on the listening RPC socket 0.0.0.0:44871 every 8 connection(s)
I20260925 21:48:00.397300  3193 acceptor_pool.cc:254] collecting diagnostics on the listening RPC socket 0.0.0.0:44871 every 8 connection(s)
[       OK ] Parameters/TestRpc.TestRpcContextClientDeadline/SSL_TCP (75 ms)
[ RUN      ] Parameters/TestRpc.TestApplicationFeatureFlagUnsupportedServer/SSL_TCP
I20260925 21:48:00.490248  3217 acceptor_pool.cc:254] collecting diagnostics on the listening RPC socket 0.0.0.0:34127 every 8 connection(s)
I20260925 21:48:00.490502  3218 acceptor_pool.cc:254] collecting diagnostics on the listening RPC socket 0.0.0.0:34127 every 8 connection(s)
[       OK ] Parameters/TestRpc.TestApplicationFeatureFlagUnsupportedServer/SSL_TCP (62 ms)
[ RUN      ] Parameters/TestRpc.TestCancellationAsync/SSL_TCP
I20260925 21:48:00.527009  3242 acceptor_pool.cc:254] collecting diagnostics on the listening RPC socket 0.0.0.0:35657 every 8 connection(s)
I20260925 21:48:00.527248  3243 acceptor_pool.cc:254] collecting diagnostics on the listening RPC socket 0.0.0.0:35657 every 8 connection(s)
I20260925 21:48:00.528069  2810 rpc-test.cc:1716] Connecting to 0.0.0.0:35657
I20260925 21:48:00.539065  2810 test_util.cc:268] Using random seed: -1416667745
I20260925 21:48:00.577780  3246 rpc-test-base.h:240] got call: sleep_micros: 500 pattern: 4294967295 num_repetitions: 2097152 sidecar_idx: 0
I20260925 21:48:00.606045  3245 rpc-test-base.h:240] got call: sleep_micros: 500 pattern: 4294967295 num_repetitions: 2097152 sidecar_idx: 0
I20260925 21:48:00.634254  3244 rpc-test-base.h:240] got call: sleep_micros: 500 pattern: 4294967295 num_repetitions: 2097152 sidecar_idx: 0
I20260925 21:48:00.668681  3245 rpc-test-base.h:240] got call: sleep_micros: 500 pattern: 4294967295 num_repetitions: 2097152 sidecar_idx: 0
I20260925 21:48:00.698846  3244 rpc-test-base.h:240] got call: sleep_micros: 500 pattern: 4294967295 num_repetitions: 2097152 sidecar_idx: 0
I20260925 21:48:00.729465  3245 rpc-test-base.h:240] got call: sleep_micros: 500 pattern: 4294967295 num_repetitions: 2097152 sidecar_idx: 0
W20260925 21:48:00.752084  3240 connection.cc:196] Error closing socket: Network error: TlsSocket::Close: Broken pipe
W20260925 21:48:00.753577  3240 connection.cc:441] server connection from 127.0.0.1:38658 torn down before Call kudu.rpc.GenericCalculatorService.SleepWithSidecar from 127.0.0.1:38658 (request call id 7) could send its response
W20260925 21:48:00.776274  3240 connection.cc:441] server connection from 127.0.0.1:38658 torn down before Call kudu.rpc.GenericCalculatorService.SleepWithSidecar from 127.0.0.1:38658 (request call id 8) could send its response
[       OK ] Parameters/TestRpc.TestCancellationAsync/SSL_TCP (265 ms)
[ RUN      ] Parameters/TestRpc.TestPerformanceBySocketType/SSL_TCP
I20260925 21:48:00.798481  3267 acceptor_pool.cc:254] collecting diagnostics on the listening RPC socket 0.0.0.0:39075 every 8 connection(s)
I20260925 21:48:00.798730  3268 acceptor_pool.cc:254] collecting diagnostics on the listening RPC socket 0.0.0.0:39075 every 8 connection(s)
I20260925 21:48:00.799574  2810 rpc-test.cc:1846] Connecting to 0.0.0.0:39075
I20260925 21:48:03.700981  2810 rpc-test.cc:1859] Sending 1024MB via ssl-enabled tcp socket: real 2.888s	user 2.761s	sys 2.054s
I20260925 21:48:06.516292  2810 rpc-test.cc:1859] Sending 1024MB via ssl-enabled tcp socket: real 2.815s	user 2.591s	sys 2.114s
I20260925 21:48:09.417846  2810 rpc-test.cc:1859] Sending 1024MB via ssl-enabled tcp socket: real 2.901s	user 2.707s	sys 2.094s
I20260925 21:48:12.293058  2810 rpc-test.cc:1859] Sending 1024MB via ssl-enabled tcp socket: real 2.875s	user 2.625s	sys 2.131s
I20260925 21:48:15.211536  2810 rpc-test.cc:1859] Sending 1024MB via ssl-enabled tcp socket: real 2.918s	user 2.730s	sys 2.117s
[       OK ] Parameters/TestRpc.TestPerformanceBySocketType/SSL_TCP (14439 ms)
[----------] 20 tests from Parameters/TestRpc (47398 ms total)

[----------] 1 test from Parameters/TestRpcSocketTxRxQueue
[ RUN      ] Parameters/TestRpcSocketTxRxQueue.OverCapacity/0
W20260925 21:48:15.513655  3284 negotiation.cc:337] Failed RPC negotiation. Trace:
0925 21:48:15.222793 (+     0us) reactor.cc:625] Submitting negotiation task for client connection to 0.0.0.0:43031 (local address 127.0.0.1:53920)
0925 21:48:15.223040 (+   247us) negotiation.cc:107] Waiting for socket to connect
0925 21:48:15.223060 (+    20us) client_negotiation.cc:174] Beginning negotiation
0925 21:48:15.223185 (+   125us) client_negotiation.cc:252] Sending NEGOTIATE NegotiatePB request
0925 21:48:15.513284 (+290099us) negotiation.cc:327] Negotiation complete: Network error: Client connection negotiation failed: client connection to 0.0.0.0:43031: BlockingRecv error: recv error from unknown peer: Transport endpoint is not connected (error 107)
Metrics: {"client-negotiator.queue_time_us":100}
W20260925 21:48:15.513751  3302 negotiation.cc:337] Failed RPC negotiation. Trace:
0925 21:48:15.228479 (+     0us) reactor.cc:625] Submitting negotiation task for client connection to 0.0.0.0:43031 (local address 127.0.0.1:53940)
0925 21:48:15.228677 (+   198us) negotiation.cc:107] Waiting for socket to connect
0925 21:48:15.228694 (+    17us) client_negotiation.cc:174] Beginning negotiation
0925 21:48:15.228798 (+   104us) client_negotiation.cc:252] Sending NEGOTIATE NegotiatePB request
0925 21:48:15.513365 (+284567us) negotiation.cc:327] Negotiation complete: Network error: Client connection negotiation failed: client connection to 0.0.0.0:43031: BlockingRecv error: recv error from unknown peer: Transport endpoint is not connected (error 107)
Metrics: {"client-negotiator.queue_time_us":82}
W20260925 21:48:15.514366  3293 negotiation.cc:337] Failed RPC negotiation. Trace:
0925 21:48:15.225930 (+     0us) reactor.cc:625] Submitting negotiation task for client connection to 0.0.0.0:43031 (local address 127.0.0.1:53926)
0925 21:48:15.226070 (+   140us) negotiation.cc:107] Waiting for socket to connect
0925 21:48:15.226086 (+    16us) client_negotiation.cc:174] Beginning negotiation
0925 21:48:15.226192 (+   106us) client_negotiation.cc:252] Sending NEGOTIATE NegotiatePB request
0925 21:48:15.513420 (+287228us) negotiation.cc:327] Negotiation complete: Network error: Client connection negotiation failed: client connection to 0.0.0.0:43031: BlockingRecv error: recv error from unknown peer: Transport endpoint is not connected (error 107)
Metrics: {"client-negotiator.queue_time_us":31}
W20260925 21:48:15.514636  3311 negotiation.cc:337] Failed RPC negotiation. Trace:
0925 21:48:15.230795 (+     0us) reactor.cc:625] Submitting negotiation task for client connection to 0.0.0.0:43031 (local address 127.0.0.1:53944)
0925 21:48:15.230955 (+   160us) negotiation.cc:107] Waiting for socket to connect
0925 21:48:15.230968 (+    13us) client_negotiation.cc:174] Beginning negotiation
0925 21:48:15.231050 (+    82us) client_negotiation.cc:252] Sending NEGOTIATE NegotiatePB request
0925 21:48:15.513300 (+282250us) negotiation.cc:327] Negotiation complete: Network error: Client connection negotiation failed: client connection to 0.0.0.0:43031: BlockingRecv error: recv error from unknown peer: Transport endpoint is not connected (error 107)
Metrics: {"client-negotiator.queue_time_us":51}
W20260925 21:48:15.514727  3320 negotiation.cc:337] Failed RPC negotiation. Trace:
0925 21:48:15.233331 (+     0us) reactor.cc:625] Submitting negotiation task for client connection to 0.0.0.0:43031 (local address 127.0.0.1:53954)
0925 21:48:15.233495 (+   164us) negotiation.cc:107] Waiting for socket to connect
0925 21:48:15.233510 (+    15us) client_negotiation.cc:174] Beginning negotiation
0925 21:48:15.233595 (+    85us) client_negotiation.cc:252] Sending NEGOTIATE NegotiatePB request
0925 21:48:15.514281 (+280686us) negotiation.cc:327] Negotiation complete: Network error: Client connection negotiation failed: client connection to 0.0.0.0:43031: BlockingRecv error: recv error from unknown peer: Transport endpoint is not connected (error 107)
Metrics: {"client-negotiator.queue_time_us":55}
W20260925 21:48:15.514966  3329 negotiation.cc:337] Failed RPC negotiation. Trace:
0925 21:48:15.235985 (+     0us) reactor.cc:625] Submitting negotiation task for client connection to 0.0.0.0:43031 (local address 127.0.0.1:53958)
0925 21:48:15.236233 (+   248us) negotiation.cc:107] Waiting for socket to connect
0925 21:48:15.236260 (+    27us) client_negotiation.cc:174] Beginning negotiation
0925 21:48:15.236340 (+    80us) client_negotiation.cc:252] Sending NEGOTIATE NegotiatePB request
0925 21:48:15.513853 (+277513us) negotiation.cc:327] Negotiation complete: Network error: Client connection negotiation failed: client connection to 0.0.0.0:43031: BlockingRecv error: recv error from unknown peer: Transport endpoint is not connected (error 107)
Metrics: {"client-negotiator.queue_time_us":57}
[       OK ] Parameters/TestRpcSocketTxRxQueue.OverCapacity/0 (1074 ms)
[----------] 1 test from Parameters/TestRpcSocketTxRxQueue (1074 ms total)

[----------] Global test environment tear-down
[==========] 21 tests from 2 test suites ran. (48472 ms total)
[  PASSED  ] 20 tests.
[  FAILED  ] 1 test, listed below:
[  FAILED  ] Parameters/TestRpc.TestCallWithChainCertAndChainCA/SSL_TCP, where GetParam() = (true, false)

 1 FAILED TEST