Diagnosed failure

Parameters/TestRpc.TestCallWithChainCertAndChainCA/SSL_TCP: /data0/somelongdirectorytoavoidrpathissues/src/kudu/src/kudu/rpc/rpc-test.cc:270: Failure
Failed
Bad status: Runtime error: could not verify certificate chain (error with cert: subject=CN = localhost, ST = sadfjas, C = AS, emailAddress = sdflkdsajf, O = lskdfjlsad, OU = sldfkja, issuer=C = AS, ST = ASDfkjdhf, L = lskdjf, O = saldfja, OU = skdjf, CN = localhost, emailAddress = sadjflkadsj): : certificate has expired
Google Test trace:
/data0/somelongdirectorytoavoidrpathissues/src/kudu/src/kudu/rpc/rpc-test.cc:267: Connecting to 0.0.0.0:37881
I20260926 13:39:43.596712  4439 test_util.cc:175] -----------------------------------------------
I20260926 13:39:43.596763  4439 test_util.cc:176] Had fatal failures, leaving test files at /tmp/dist-test-taskaPiCDa/test-tmp/rpc-test.5.Parameters_TestRpc.TestCallWithChainCertAndChainCA_SSL_TCP.1790429983511833-4439-0

Full log

Note: This is test shard 6 of 8.
[==========] Running 21 tests from 2 test suites.
[----------] Global test environment set-up.
[----------] 20 tests from Parameters/TestRpc
[ RUN      ] Parameters/TestRpc.TestMessengerCreateDestroy/SSL_TCP
WARNING: Logging before InitGoogleLogging() is written to STDERR
I20260926 13:39:43.540028  4439 rpc-test.cc:169] started messenger TestCreateDestroy
[       OK ] Parameters/TestRpc.TestMessengerCreateDestroy/SSL_TCP (23 ms)
[ RUN      ] Parameters/TestRpc.TestNegotiationDeadlock/SSL_TCP
I20260926 13:39:43.558444  4459 acceptor_pool.cc:254] collecting diagnostics on the listening RPC socket 0.0.0.0:37031 every 8 connection(s)
I20260926 13:39:43.558481  4460 acceptor_pool.cc:254] collecting diagnostics on the listening RPC socket 0.0.0.0:37031 every 8 connection(s)
[       OK ] Parameters/TestRpc.TestNegotiationDeadlock/SSL_TCP (27 ms)
[ RUN      ] Parameters/TestRpc.TestCallWithChainCertAndChainCA/SSL_TCP
I20260926 13:39:43.592031  4475 acceptor_pool.cc:254] collecting diagnostics on the listening RPC socket 0.0.0.0:37881 every 8 connection(s)
I20260926 13:39:43.592087  4476 acceptor_pool.cc:254] collecting diagnostics on the listening RPC socket 0.0.0.0:37881 every 8 connection(s)
/data0/somelongdirectorytoavoidrpathissues/src/kudu/src/kudu/rpc/rpc-test.cc:270: Failure
Failed
Bad status: Runtime error: could not verify certificate chain (error with cert: subject=CN = localhost, ST = sadfjas, C = AS, emailAddress = sdflkdsajf, O = lskdfjlsad, OU = sldfkja, issuer=C = AS, ST = ASDfkjdhf, L = lskdjf, O = saldfja, OU = skdjf, CN = localhost, emailAddress = sadjflkadsj): : certificate has expired
Google Test trace:
/data0/somelongdirectorytoavoidrpathissues/src/kudu/src/kudu/rpc/rpc-test.cc:267: Connecting to 0.0.0.0:37881
I20260926 13:39:43.596712  4439 test_util.cc:175] -----------------------------------------------
I20260926 13:39:43.596763  4439 test_util.cc:176] Had fatal failures, leaving test files at /tmp/dist-test-taskaPiCDa/test-tmp/rpc-test.5.Parameters_TestRpc.TestCallWithChainCertAndChainCA_SSL_TCP.1790429983511833-4439-0
[  FAILED  ] Parameters/TestRpc.TestCallWithChainCertAndChainCA/SSL_TCP, where GetParam() = (true, false) (27 ms)
[ RUN      ] Parameters/TestRpc.TestCallWithPasswordProtectedKey/SSL_TCP
I20260926 13:39:43.608129  4500 acceptor_pool.cc:254] collecting diagnostics on the listening RPC socket 0.0.0.0:40151 every 8 connection(s)
I20260926 13:39:43.608168  4501 acceptor_pool.cc:254] collecting diagnostics on the listening RPC socket 0.0.0.0:40151 every 8 connection(s)
[       OK ] Parameters/TestRpc.TestCallWithPasswordProtectedKey/SSL_TCP (24 ms)
[ RUN      ] Parameters/TestRpc.TestCallToBadServer/SSL_TCP
I20260926 13:39:43.634316  4439 rpc-test.cc:394] Status: Network error: Client connection negotiation failed: client connection to 0.0.0.0:0: connect: Connection refused (error 111)
I20260926 13:39:43.634718  4439 rpc-test.cc:394] Status: Network error: Client connection negotiation failed: client connection to 0.0.0.0:0: connect: Connection refused (error 111)
I20260926 13:39:43.635035  4439 rpc-test.cc:394] Status: Network error: Client connection negotiation failed: client connection to 0.0.0.0:0: connect: Connection refused (error 111)
I20260926 13:39:43.635342  4439 rpc-test.cc:394] Status: Network error: Client connection negotiation failed: client connection to 0.0.0.0:0: connect: Connection refused (error 111)
I20260926 13:39:43.635697  4439 rpc-test.cc:394] Status: Network error: Client connection negotiation failed: client connection to 0.0.0.0:0: connect: Connection refused (error 111)
[       OK ] Parameters/TestRpc.TestCallToBadServer/SSL_TCP (14 ms)
[ RUN      ] Parameters/TestRpc.TestWrongService/SSL_TCP
I20260926 13:39:43.645567  4535 acceptor_pool.cc:254] collecting diagnostics on the listening RPC socket 0.0.0.0:33139 every 8 connection(s)
I20260926 13:39:43.645589  4536 acceptor_pool.cc:254] collecting diagnostics on the listening RPC socket 0.0.0.0:33139 every 8 connection(s)
I20260926 13:39:43.658268  4534 messenger.cc:345] service WrongServiceName not registered on TestServer
[       OK ] Parameters/TestRpc.TestWrongService/SSL_TCP (23 ms)
[ RUN      ] Parameters/TestRpc.TestConnectionKeepalive/SSL_TCP
I20260926 13:39:43.679544  4558 acceptor_pool.cc:254] collecting diagnostics on the listening RPC socket 0.0.0.0:43541 every 8 connection(s)
I20260926 13:39:43.679572  4559 acceptor_pool.cc:254] collecting diagnostics on the listening RPC socket 0.0.0.0:43541 every 8 connection(s)
I20260926 13:39:43.679802  4439 rpc-test.cc:488] Connecting to 0.0.0.0:43541
[       OK ] Parameters/TestRpc.TestConnectionKeepalive/SSL_TCP (1047 ms)
[ RUN      ] Parameters/TestRpc.TestClientConnectionMetrics/SSL_TCP
I20260926 13:39:44.730006  4583 acceptor_pool.cc:254] collecting diagnostics on the listening RPC socket 0.0.0.0:36739 every 8 connection(s)
I20260926 13:39:44.730038  4584 acceptor_pool.cc:254] collecting diagnostics on the listening RPC socket 0.0.0.0:36739 every 8 connection(s)
I20260926 13:39:44.730280  4439 rpc-test.cc:569] Connecting to 0.0.0.0:36739
[       OK ] Parameters/TestRpc.TestClientConnectionMetrics/SSL_TCP (12865 ms)
[ RUN      ] Parameters/TestRpc.TestCredentialsPolicy/SSL_TCP
I20260926 13:39:57.582965  4606 acceptor_pool.cc:254] collecting diagnostics on the listening RPC socket 0.0.0.0:45685 every 8 connection(s)
I20260926 13:39:57.583007  4607 acceptor_pool.cc:254] collecting diagnostics on the listening RPC socket 0.0.0.0:45685 every 8 connection(s)
I20260926 13:39:57.583243  4439 rpc-test.cc:700] Connecting to 0.0.0.0:45685
[       OK ] Parameters/TestRpc.TestCredentialsPolicy/SSL_TCP (37 ms)
[ RUN      ] Parameters/TestRpc.TestCallLongerThanKeepalive/SSL_TCP
I20260926 13:39:57.623399  4631 acceptor_pool.cc:254] collecting diagnostics on the listening RPC socket 0.0.0.0:37773 every 8 connection(s)
I20260926 13:39:57.623489  4632 acceptor_pool.cc:254] collecting diagnostics on the listening RPC socket 0.0.0.0:37773 every 8 connection(s)
I20260926 13:39:57.648825  4635 rpc-test-base.h:222] got call: sleep_micros: 3000000 deferred: true
I20260926 13:40:00.649634  4635 rpcz_store.cc:275] Call kudu.rpc.GenericCalculatorService.Sleep from 127.0.0.1:45378 (request call id 0) took 3000 ms. Trace:
I20260926 13:40:00.649775  4635 rpcz_store.cc:276] 0926 13:39:57.648754 (+     0us) service_pool.cc:170] Inserting onto call queue
0926 13:39:57.648803 (+    49us) service_pool.cc:227] Handling call
0926 13:40:00.649612 (+3000809us) inbound_call.cc:173] Queueing success response
Metrics: {}
[       OK ] Parameters/TestRpc.TestCallLongerThanKeepalive/SSL_TCP (3041 ms)
[ RUN      ] Parameters/TestRpc.TestRpcSidecar/SSL_TCP
I20260926 13:40:00.658906  4656 acceptor_pool.cc:254] collecting diagnostics on the listening RPC socket 0.0.0.0:38515 every 8 connection(s)
I20260926 13:40:00.658973  4657 acceptor_pool.cc:254] collecting diagnostics on the listening RPC socket 0.0.0.0:38515 every 8 connection(s)
[       OK ] Parameters/TestRpc.TestRpcSidecar/SSL_TCP (68 ms)
[ RUN      ] Parameters/TestRpc.TestRpcSidecarLimits/SSL_TCP
I20260926 13:40:02.426621  4681 acceptor_pool.cc:254] collecting diagnostics on the listening RPC socket 0.0.0.0:34881 every 8 connection(s)
I20260926 13:40:02.426682  4682 acceptor_pool.cc:254] collecting diagnostics on the listening RPC socket 0.0.0.0:34881 every 8 connection(s)
W20260926 13:40:02.459090  4439 serialization.cc:72] Serialized kudu.rpc_test.PushStringsRequestPB (2147483654 bytes) is larger than the maximum configured RPC message size (52428800 bytes). Sending anyway, but peer may reject the data.
W20260926 13:40:02.463726  4680 connection.cc:535] server connection from 127.0.0.1:40726 recv error: Network error: RPC frame had a length of 2147483714, but we only support messages up to 52428800 bytes long.
W20260926 13:40:02.463786  4680 connection.cc:158] shutting down server connection from 127.0.0.1:40726 with pending inbound data: 4/2147483714 bytes received; last active 0 ns ago: status Network error: RPC frame had a length of 2147483714, but we only support messages up to 52428800 bytes long.
W20260926 13:40:02.463943  4694 connection.cc:698] client connection to 0.0.0.0:34881 send error: Network error: failed to write to TLS socket: Connection reset by peer
W20260926 13:40:02.464135  4694 connection.cc:196] Error closing socket: Network error: TlsSocket::Close: Success
I20260926 13:40:02.489500  4706 acceptor_pool.cc:254] collecting diagnostics on the listening RPC socket 0.0.0.0:34117 every 8 connection(s)
I20260926 13:40:02.489593  4707 acceptor_pool.cc:254] collecting diagnostics on the listening RPC socket 0.0.0.0:34117 every 8 connection(s)
W20260926 13:40:06.582613  4705 connection.cc:577] server connection from 127.0.0.1:36532: received bad data: 'Corruption: Invalid packet: message had a length of 2147483710, but we only support messages up to 2147483647 bytes
'
[       OK ] Parameters/TestRpc.TestRpcSidecarLimits/SSL_TCP (5862 ms)
[ RUN      ] Parameters/TestRpc.TestCallTimeoutDoesntAffectNegotiation/SSL_TCP
I20260926 13:40:06.606362  4731 acceptor_pool.cc:254] collecting diagnostics on the listening RPC socket 0.0.0.0:41351 every 8 connection(s)
I20260926 13:40:06.606384  4732 acceptor_pool.cc:254] collecting diagnostics on the listening RPC socket 0.0.0.0:41351 every 8 connection(s)
W20260926 13:40:06.622637  4727 negotiation.cc:266] Injecting 500ms delay in negotiation
I20260926 13:40:06.672977  4439 rpc-test-base.h:595] status: Timed out: connection negotiation to 0.0.0.0:41351 for RPC Sleep timed out after 0.050s (ON_OUTBOUND_QUEUE), seconds elapsed: 0.0507906
[       OK ] Parameters/TestRpc.TestCallTimeoutDoesntAffectNegotiation/SSL_TCP (543 ms)
[ RUN      ] Parameters/TestRpc.TestRpcHandlerLatencyMetric/SSL_TCP
I20260926 13:40:07.141276  4756 acceptor_pool.cc:254] collecting diagnostics on the listening RPC socket 0.0.0.0:43349 every 8 connection(s)
I20260926 13:40:07.141361  4757 acceptor_pool.cc:254] collecting diagnostics on the listening RPC socket 0.0.0.0:43349 every 8 connection(s)
I20260926 13:40:07.177903  4439 rpc-test.cc:1236] Sleep() min lat: 20362
I20260926 13:40:07.177968  4439 rpc-test.cc:1237] Sleep() mean lat: 20362
I20260926 13:40:07.177994  4439 rpc-test.cc:1238] Sleep() max lat: 20362
I20260926 13:40:07.178005  4439 rpc-test.cc:1239] Sleep() #calls: 1
[       OK ] Parameters/TestRpc.TestRpcHandlerLatencyMetric/SSL_TCP (51 ms)
[ RUN      ] Parameters/TestRpc.TimedOutOnResponseMetricServiceQueue/SSL_TCP
I20260926 13:40:07.197559  4782 acceptor_pool.cc:254] collecting diagnostics on the listening RPC socket 0.0.0.0:44801 every 8 connection(s)
I20260926 13:40:07.197588  4783 acceptor_pool.cc:254] collecting diagnostics on the listening RPC socket 0.0.0.0:44801 every 8 connection(s)
W20260926 13:40:07.246873  4784 rpcz_store.cc:267] Call kudu.rpc_test.CalculatorService.Sleep from 127.0.0.1:40456 (request call id 2) took 20 ms (client timeout 20 ms). Trace:
W20260926 13:40:07.246969  4784 rpcz_store.cc:269] 0926 13:40:07.226577 (+     0us) service_pool.cc:170] Inserting onto call queue
0926 13:40:07.246836 (+ 20259us) service_pool.cc:214] Skipping call since client already timed out
0926 13:40:07.246859 (+    23us) inbound_call.cc:173] Queueing failure response
Metrics: {}
[       OK ] Parameters/TestRpc.TimedOutOnResponseMetricServiceQueue/SSL_TCP (68 ms)
[ RUN      ] Parameters/TestRpc.RpcPendingConnectionsMetric/SSL_TCP
I20260926 13:40:07.250834  4805 acceptor_pool.cc:254] collecting diagnostics on the listening RPC socket 0.0.0.0:37455 every 8 connection(s)
I20260926 13:40:07.250895  4806 acceptor_pool.cc:254] collecting diagnostics on the listening RPC socket 0.0.0.0:37455 every 8 connection(s)
W20260926 13:40:07.260521  4801 negotiation.cc:337] Failed RPC negotiation. Trace:
0926 13:40:07.260028 (+     0us) reactor.cc:625] Submitting negotiation task for server connection from 127.0.0.1:36914 (local address 127.0.0.1:37455)
0926 13:40:07.260156 (+   128us) server_negotiation.cc:206] Beginning negotiation
0926 13:40:07.260160 (+     4us) server_negotiation.cc:399] Waiting for connection header
0926 13:40:07.260282 (+   122us) negotiation.cc:327] Negotiation complete: Network error: Server connection negotiation failed: server connection from 127.0.0.1:36914: BlockingRecv error: recv got EOF from 127.0.0.1:36914 (error 108)
Metrics: {"server-negotiator.queue_time_us":28}
[       OK ] Parameters/TestRpc.RpcPendingConnectionsMetric/SSL_TCP (22 ms)
[ RUN      ] Parameters/TestRpc.TestRpcContextClientDeadline/SSL_TCP
I20260926 13:40:07.276871  4821 acceptor_pool.cc:254] collecting diagnostics on the listening RPC socket 0.0.0.0:46065 every 8 connection(s)
I20260926 13:40:07.276913  4822 acceptor_pool.cc:254] collecting diagnostics on the listening RPC socket 0.0.0.0:46065 every 8 connection(s)
[       OK ] Parameters/TestRpc.TestRpcContextClientDeadline/SSL_TCP (48 ms)
[ RUN      ] Parameters/TestRpc.TestApplicationFeatureFlagUnsupportedServer/SSL_TCP
I20260926 13:40:07.351893  4846 acceptor_pool.cc:254] collecting diagnostics on the listening RPC socket 0.0.0.0:42413 every 8 connection(s)
I20260926 13:40:07.351922  4847 acceptor_pool.cc:254] collecting diagnostics on the listening RPC socket 0.0.0.0:42413 every 8 connection(s)
[       OK ] Parameters/TestRpc.TestApplicationFeatureFlagUnsupportedServer/SSL_TCP (47 ms)
[ RUN      ] Parameters/TestRpc.TestCancellationAsync/SSL_TCP
I20260926 13:40:07.383720  4871 acceptor_pool.cc:254] collecting diagnostics on the listening RPC socket 0.0.0.0:38463 every 8 connection(s)
I20260926 13:40:07.383761  4872 acceptor_pool.cc:254] collecting diagnostics on the listening RPC socket 0.0.0.0:38463 every 8 connection(s)
I20260926 13:40:07.383982  4439 rpc-test.cc:1716] Connecting to 0.0.0.0:38463
I20260926 13:40:07.391539  4439 test_util.cc:268] Using random seed: -124390094
I20260926 13:40:07.410590  4875 rpc-test-base.h:240] got call: sleep_micros: 500 pattern: 4294967295 num_repetitions: 2097152 sidecar_idx: 0
I20260926 13:40:07.426239  4874 rpc-test-base.h:240] got call: sleep_micros: 500 pattern: 4294967295 num_repetitions: 2097152 sidecar_idx: 0
I20260926 13:40:07.441604  4875 rpc-test-base.h:240] got call: sleep_micros: 500 pattern: 4294967295 num_repetitions: 2097152 sidecar_idx: 0
I20260926 13:40:07.458776  4874 rpc-test-base.h:240] got call: sleep_micros: 500 pattern: 4294967295 num_repetitions: 2097152 sidecar_idx: 0
I20260926 13:40:07.477290  4875 rpc-test-base.h:240] got call: sleep_micros: 500 pattern: 4294967295 num_repetitions: 2097152 sidecar_idx: 0
I20260926 13:40:07.494459  4874 rpc-test-base.h:240] got call: sleep_micros: 500 pattern: 4294967295 num_repetitions: 2097152 sidecar_idx: 0
I20260926 13:40:07.511552  4875 rpc-test-base.h:240] got call: sleep_micros: 500 pattern: 4294967295 num_repetitions: 2097152 sidecar_idx: 0
W20260926 13:40:07.517650  4870 connection.cc:441] server connection from 127.0.0.1:32966 torn down before Call kudu.rpc.GenericCalculatorService.SleepWithSidecar from 127.0.0.1:32966 (request call id 8) could send its response
W20260926 13:40:07.529485  4870 connection.cc:441] server connection from 127.0.0.1:32966 torn down before Call kudu.rpc.GenericCalculatorService.SleepWithSidecar from 127.0.0.1:32966 (request call id 9) could send its response
[       OK ] Parameters/TestRpc.TestCancellationAsync/SSL_TCP (163 ms)
[ RUN      ] Parameters/TestRpc.TestPerformanceBySocketType/SSL_TCP
I20260926 13:40:07.552918  4896 acceptor_pool.cc:254] collecting diagnostics on the listening RPC socket 0.0.0.0:43689 every 8 connection(s)
I20260926 13:40:07.552944  4897 acceptor_pool.cc:254] collecting diagnostics on the listening RPC socket 0.0.0.0:43689 every 8 connection(s)
I20260926 13:40:07.553187  4439 rpc-test.cc:1846] Connecting to 0.0.0.0:43689
I20260926 13:40:09.569716  4439 rpc-test.cc:1859] Sending 1024MB via ssl-enabled tcp socket: real 2.009s	user 1.943s	sys 1.605s
I20260926 13:40:11.587013  4439 rpc-test.cc:1859] Sending 1024MB via ssl-enabled tcp socket: real 2.017s	user 2.216s	sys 1.353s
I20260926 13:40:13.605584  4439 rpc-test.cc:1859] Sending 1024MB via ssl-enabled tcp socket: real 2.018s	user 2.062s	sys 1.512s
I20260926 13:40:15.586058  4439 rpc-test.cc:1859] Sending 1024MB via ssl-enabled tcp socket: real 1.980s	user 2.175s	sys 1.326s
I20260926 13:40:17.602510  4439 rpc-test.cc:1859] Sending 1024MB via ssl-enabled tcp socket: real 2.016s	user 2.172s	sys 1.403s
[       OK ] Parameters/TestRpc.TestPerformanceBySocketType/SSL_TCP (10073 ms)
[----------] 20 tests from Parameters/TestRpc (34086 ms total)

[----------] 1 test from Parameters/TestRpcSocketTxRxQueue
[ RUN      ] Parameters/TestRpcSocketTxRxQueue.OverCapacity/0
W20260926 13:40:17.871665  4931 negotiation.cc:337] Failed RPC negotiation. Trace:
0926 13:40:17.608333 (+     0us) reactor.cc:625] Submitting negotiation task for client connection to 0.0.0.0:42539 (local address 127.0.0.1:49264)
0926 13:40:17.608413 (+    80us) negotiation.cc:107] Waiting for socket to connect
0926 13:40:17.608424 (+    11us) client_negotiation.cc:174] Beginning negotiation
0926 13:40:17.608494 (+    70us) client_negotiation.cc:252] Sending NEGOTIATE NegotiatePB request
0926 13:40:17.871532 (+263038us) negotiation.cc:327] Negotiation complete: Network error: Client connection negotiation failed: client connection to 0.0.0.0:42539: BlockingRecv error: recv error from unknown peer: Transport endpoint is not connected (error 107)
Metrics: {"client-negotiator.queue_time_us":23}
W20260926 13:40:17.871688  4913 negotiation.cc:337] Failed RPC negotiation. Trace:
0926 13:40:17.606321 (+     0us) reactor.cc:625] Submitting negotiation task for client connection to 0.0.0.0:42539 (local address 127.0.0.1:49242)
0926 13:40:17.606410 (+    89us) negotiation.cc:107] Waiting for socket to connect
0926 13:40:17.606423 (+    13us) client_negotiation.cc:174] Beginning negotiation
0926 13:40:17.606492 (+    69us) client_negotiation.cc:252] Sending NEGOTIATE NegotiatePB request
0926 13:40:17.871513 (+265021us) negotiation.cc:327] Negotiation complete: Network error: Client connection negotiation failed: client connection to 0.0.0.0:42539: BlockingRecv error: recv error from unknown peer: Transport endpoint is not connected (error 107)
Metrics: {"client-negotiator.queue_time_us":23}
W20260926 13:40:17.871834  4958 negotiation.cc:337] Failed RPC negotiation. Trace:
0926 13:40:17.611495 (+     0us) reactor.cc:625] Submitting negotiation task for client connection to 0.0.0.0:42539 (local address 127.0.0.1:49270)
0926 13:40:17.611585 (+    90us) negotiation.cc:107] Waiting for socket to connect
0926 13:40:17.611596 (+    11us) client_negotiation.cc:174] Beginning negotiation
0926 13:40:17.611665 (+    69us) client_negotiation.cc:252] Sending NEGOTIATE NegotiatePB request
0926 13:40:17.871752 (+260087us) negotiation.cc:327] Negotiation complete: Network error: Client connection negotiation failed: client connection to 0.0.0.0:42539: BlockingRecv error: recv error from unknown peer: Transport endpoint is not connected (error 107)
Metrics: {"client-negotiator.queue_time_us":34}
W20260926 13:40:17.871690  4922 negotiation.cc:337] Failed RPC negotiation. Trace:
0926 13:40:17.607293 (+     0us) reactor.cc:625] Submitting negotiation task for client connection to 0.0.0.0:42539 (local address 127.0.0.1:49250)
0926 13:40:17.607399 (+   106us) negotiation.cc:107] Waiting for socket to connect
0926 13:40:17.607412 (+    13us) client_negotiation.cc:174] Beginning negotiation
0926 13:40:17.607489 (+    77us) client_negotiation.cc:252] Sending NEGOTIATE NegotiatePB request
0926 13:40:17.871532 (+264043us) negotiation.cc:327] Negotiation complete: Network error: Client connection negotiation failed: client connection to 0.0.0.0:42539: BlockingRecv error: recv error from unknown peer: Transport endpoint is not connected (error 107)
Metrics: {"client-negotiator.queue_time_us":32}
W20260926 13:40:17.871961  4940 negotiation.cc:337] Failed RPC negotiation. Trace:
0926 13:40:17.609447 (+     0us) reactor.cc:625] Submitting negotiation task for client connection to 0.0.0.0:42539 (local address 127.0.0.1:49266)
0926 13:40:17.609541 (+    94us) negotiation.cc:107] Waiting for socket to connect
0926 13:40:17.609552 (+    11us) client_negotiation.cc:174] Beginning negotiation
0926 13:40:17.609623 (+    71us) client_negotiation.cc:252] Sending NEGOTIATE NegotiatePB request
0926 13:40:17.871513 (+261890us) negotiation.cc:327] Negotiation complete: Network error: Client connection negotiation failed: client connection to 0.0.0.0:42539: BlockingRecv error: recv error from unknown peer: Transport endpoint is not connected (error 107)
Metrics: {"client-negotiator.queue_time_us":34}
W20260926 13:40:17.872156  4949 negotiation.cc:337] Failed RPC negotiation. Trace:
0926 13:40:17.610487 (+     0us) reactor.cc:625] Submitting negotiation task for client connection to 0.0.0.0:42539 (local address 127.0.0.1:49268)
0926 13:40:17.610564 (+    77us) negotiation.cc:107] Waiting for socket to connect
0926 13:40:17.610576 (+    12us) client_negotiation.cc:174] Beginning negotiation
0926 13:40:17.610643 (+    67us) client_negotiation.cc:252] Sending NEGOTIATE NegotiatePB request
0926 13:40:17.871752 (+261109us) negotiation.cc:327] Negotiation complete: Network error: Client connection negotiation failed: client connection to 0.0.0.0:42539: BlockingRecv error: recv error from unknown peer: Transport endpoint is not connected (error 107)
Metrics: {"client-negotiator.queue_time_us":23}
[       OK ] Parameters/TestRpcSocketTxRxQueue.OverCapacity/0 (1048 ms)
[----------] 1 test from Parameters/TestRpcSocketTxRxQueue (1048 ms total)

[----------] Global test environment tear-down
[==========] 21 tests from 2 test suites ran. (35134 ms total)
[  PASSED  ] 20 tests.
[  FAILED  ] 1 test, listed below:
[  FAILED  ] Parameters/TestRpc.TestCallWithChainCertAndChainCA/SSL_TCP, where GetParam() = (true, false)

 1 FAILED TEST