Parameters/TestRpc.TestCallWithChainCertAndRootCA/SSL_UnixSocket: /data0/somelongdirectorytoavoidrpathissues/src/kudu/src/kudu/rpc/rpc-test.cc:303: Failure
Failed
Bad status: Runtime error: could not verify certificate chain (error with cert: subject=CN = localhost, ST = sadfjas, C = AS, emailAddress = sdflkdsajf, O = lskdfjlsad, OU = sldfkja, issuer=C = AS, ST = ASDfkjdhf, L = lskdjf, O = saldfja, OU = skdjf, CN = localhost, emailAddress = sadjflkadsj): : certificate has expired
Google Test trace:
/data0/somelongdirectorytoavoidrpathissues/src/kudu/src/kudu/rpc/rpc-test.cc:300: Connecting to unix:/tmp/dist-test-taskTuSbcL/test-tmp/rpc-test-e12811cd42eb4b6eae6a82151a8eeb0a.sock
I20260925 03:03:44.662724 13687 test_util.cc:175] -----------------------------------------------
I20260925 03:03:44.662986 13687 test_util.cc:176] Had fatal failures, leaving test files at /tmp/dist-test-taskTuSbcL/test-tmp/rpc-test.2.Parameters_TestRpc.TestCallWithChainCertAndRootCA_SSL_UnixSocket.1790305421103832-13687-0
Note: This is test shard 3 of 8.
[==========] Running 21 tests from 2 test suites.
[----------] Global test environment set-up.
[----------] 1 test from TestRpc
[ RUN ] TestRpc.TestNegotiationTimeout
WARNING: Logging before InitGoogleLogging() is written to STDERR
I20260925 03:03:41.294823 13687 rpc-test-base.h:595] status: Timed out: connection negotiation to 0.0.0.0:46015 for RPC Sleep timed out after 0.100s (ON_OUTBOUND_QUEUE), seconds elapsed: 0.101629
W20260925 03:03:44.351352 13697 negotiation.cc:337] Failed RPC negotiation. Trace:
0925 03:03:41.194029 (+ 0us) reactor.cc:625] Submitting negotiation task for client connection to 0.0.0.0:46015 (local address 127.0.0.1:36520)
0925 03:03:41.194650 (+ 621us) negotiation.cc:107] Waiting for socket to connect
0925 03:03:41.194695 (+ 45us) client_negotiation.cc:174] Beginning negotiation
0925 03:03:41.206711 (+ 12016us) client_negotiation.cc:252] Sending NEGOTIATE NegotiatePB request
0925 03:03:44.350047 (+3143336us) negotiation.cc:327] Negotiation complete: Timed out: Client connection negotiation failed: client connection to 0.0.0.0:46015: received 0 of 4 requested bytes
Metrics: {"client-negotiator.queue_time_us":192}
[ OK ] TestRpc.TestNegotiationTimeout (3199 ms)
[----------] 1 test from TestRpc (3199 ms total)
[----------] 20 tests from Parameters/TestRpc
[ RUN ] Parameters/TestRpc.TestAcceptorPoolStartStop/SSL_UnixSocket
I20260925 03:03:44.393432 13713 acceptor_pool.cc:254] collecting diagnostics on the listening RPC socket unix:/tmp/dist-test-taskTuSbcL/test-tmp/rpc-test-6cc186203ea749e99e7140b7171d9e21.sock every 8 connection(s)
I20260925 03:03:44.395361 13714 acceptor_pool.cc:254] collecting diagnostics on the listening RPC socket unix:/tmp/dist-test-taskTuSbcL/test-tmp/rpc-test-6cc186203ea749e99e7140b7171d9e21.sock every 8 connection(s)
I20260925 03:03:44.445464 13724 acceptor_pool.cc:254] collecting diagnostics on the listening RPC socket unix:/tmp/dist-test-taskTuSbcL/test-tmp/rpc-test-6cc186203ea749e99e7140b7171d9e21.sock every 8 connection(s)
I20260925 03:03:44.447029 13725 acceptor_pool.cc:254] collecting diagnostics on the listening RPC socket unix:/tmp/dist-test-taskTuSbcL/test-tmp/rpc-test-6cc186203ea749e99e7140b7171d9e21.sock every 8 connection(s)
I20260925 03:03:44.486474 13735 acceptor_pool.cc:254] collecting diagnostics on the listening RPC socket unix:/tmp/dist-test-taskTuSbcL/test-tmp/rpc-test-6cc186203ea749e99e7140b7171d9e21.sock every 8 connection(s)
I20260925 03:03:44.487251 13736 acceptor_pool.cc:254] collecting diagnostics on the listening RPC socket unix:/tmp/dist-test-taskTuSbcL/test-tmp/rpc-test-6cc186203ea749e99e7140b7171d9e21.sock every 8 connection(s)
I20260925 03:03:44.504935 13746 acceptor_pool.cc:254] collecting diagnostics on the listening RPC socket unix:/tmp/dist-test-taskTuSbcL/test-tmp/rpc-test-6cc186203ea749e99e7140b7171d9e21.sock every 8 connection(s)
I20260925 03:03:44.505693 13747 acceptor_pool.cc:254] collecting diagnostics on the listening RPC socket unix:/tmp/dist-test-taskTuSbcL/test-tmp/rpc-test-6cc186203ea749e99e7140b7171d9e21.sock every 8 connection(s)
I20260925 03:03:44.525568 13757 acceptor_pool.cc:254] collecting diagnostics on the listening RPC socket unix:/tmp/dist-test-taskTuSbcL/test-tmp/rpc-test-6cc186203ea749e99e7140b7171d9e21.sock every 8 connection(s)
I20260925 03:03:44.526293 13758 acceptor_pool.cc:254] collecting diagnostics on the listening RPC socket unix:/tmp/dist-test-taskTuSbcL/test-tmp/rpc-test-6cc186203ea749e99e7140b7171d9e21.sock every 8 connection(s)
[ OK ] Parameters/TestRpc.TestAcceptorPoolStartStop/SSL_UnixSocket (174 ms)
[ RUN ] Parameters/TestRpc.TestCall/SSL_UnixSocket
I20260925 03:03:44.547498 13770 acceptor_pool.cc:254] collecting diagnostics on the listening RPC socket unix:/tmp/dist-test-taskTuSbcL/test-tmp/rpc-test-10064eaf4cca434193e203d95f3410ed.sock every 8 connection(s)
I20260925 03:03:44.549655 13771 acceptor_pool.cc:254] collecting diagnostics on the listening RPC socket unix:/tmp/dist-test-taskTuSbcL/test-tmp/rpc-test-10064eaf4cca434193e203d95f3410ed.sock every 8 connection(s)
I20260925 03:03:44.554839 13687 rpc-test.cc:234] Connecting to unix:/tmp/dist-test-taskTuSbcL/test-tmp/rpc-test-10064eaf4cca434193e203d95f3410ed.sock
W20260925 03:03:44.606645 13767 connection.cc:196] Error closing socket: Network error: TlsSocket::Close: Broken pipe
[ OK ] Parameters/TestRpc.TestCall/SSL_UnixSocket (80 ms)
[ RUN ] Parameters/TestRpc.TestCallWithChainCertAndRootCA/SSL_UnixSocket
I20260925 03:03:44.641472 13795 acceptor_pool.cc:254] collecting diagnostics on the listening RPC socket unix:/tmp/dist-test-taskTuSbcL/test-tmp/rpc-test-e12811cd42eb4b6eae6a82151a8eeb0a.sock every 8 connection(s)
I20260925 03:03:44.642268 13796 acceptor_pool.cc:254] collecting diagnostics on the listening RPC socket unix:/tmp/dist-test-taskTuSbcL/test-tmp/rpc-test-e12811cd42eb4b6eae6a82151a8eeb0a.sock every 8 connection(s)
/data0/somelongdirectorytoavoidrpathissues/src/kudu/src/kudu/rpc/rpc-test.cc:303: Failure
Failed
Bad status: Runtime error: could not verify certificate chain (error with cert: subject=CN = localhost, ST = sadfjas, C = AS, emailAddress = sdflkdsajf, O = lskdfjlsad, OU = sldfkja, issuer=C = AS, ST = ASDfkjdhf, L = lskdjf, O = saldfja, OU = skdjf, CN = localhost, emailAddress = sadjflkadsj): : certificate has expired
Google Test trace:
/data0/somelongdirectorytoavoidrpathissues/src/kudu/src/kudu/rpc/rpc-test.cc:300: Connecting to unix:/tmp/dist-test-taskTuSbcL/test-tmp/rpc-test-e12811cd42eb4b6eae6a82151a8eeb0a.sock
I20260925 03:03:44.662724 13687 test_util.cc:175] -----------------------------------------------
I20260925 03:03:44.662986 13687 test_util.cc:176] Had fatal failures, leaving test files at /tmp/dist-test-taskTuSbcL/test-tmp/rpc-test.2.Parameters_TestRpc.TestCallWithChainCertAndRootCA_SSL_UnixSocket.1790305421103832-13687-0
[ FAILED ] Parameters/TestRpc.TestCallWithChainCertAndRootCA/SSL_UnixSocket, where GetParam() = (true, true) (52 ms)
[ RUN ] Parameters/TestRpc.TestCallWithBadPasswordProtectedKey/SSL_UnixSocket
[ OK ] Parameters/TestRpc.TestCallWithBadPasswordProtectedKey/SSL_UnixSocket (31 ms)
[ RUN ] Parameters/TestRpc.TestInvalidMethodCall/SSL_UnixSocket
I20260925 03:03:44.716555 13832 acceptor_pool.cc:254] collecting diagnostics on the listening RPC socket unix:/tmp/dist-test-taskTuSbcL/test-tmp/rpc-test-07f8168f4a3e4fe798ab45d7735dde96.sock every 8 connection(s)
I20260925 03:03:44.717461 13833 acceptor_pool.cc:254] collecting diagnostics on the listening RPC socket unix:/tmp/dist-test-taskTuSbcL/test-tmp/rpc-test-07f8168f4a3e4fe798ab45d7735dde96.sock every 8 connection(s)
I20260925 03:03:44.721042 13687 rpc-test.cc:406] Connecting to unix:/tmp/dist-test-taskTuSbcL/test-tmp/rpc-test-07f8168f4a3e4fe798ab45d7735dde96.sock
[ OK ] Parameters/TestRpc.TestInvalidMethodCall/SSL_UnixSocket (75 ms)
[ RUN ] Parameters/TestRpc.TestHighFDs/SSL_UnixSocket
I20260925 03:03:44.990310 13857 acceptor_pool.cc:254] collecting diagnostics on the listening RPC socket unix:/tmp/dist-test-taskTuSbcL/test-tmp/rpc-test-224a6e8bce684212850c19c6ad155aef.sock every 8 connection(s)
I20260925 03:03:44.991093 13858 acceptor_pool.cc:254] collecting diagnostics on the listening RPC socket unix:/tmp/dist-test-taskTuSbcL/test-tmp/rpc-test-224a6e8bce684212850c19c6ad155aef.sock every 8 connection(s)
W20260925 03:03:45.023526 13854 connection.cc:196] Error closing socket: Network error: TlsSocket::Close: Broken pipe
[ OK ] Parameters/TestRpc.TestHighFDs/SSL_UnixSocket (263 ms)
[ RUN ] Parameters/TestRpc.TestConnectionAlwaysKeepalive/SSL_UnixSocket
I20260925 03:03:45.061801 13880 acceptor_pool.cc:254] collecting diagnostics on the listening RPC socket unix:/tmp/dist-test-taskTuSbcL/test-tmp/rpc-test-eb322db4c66841ff907881f2a6132178.sock every 8 connection(s)
I20260925 03:03:45.062542 13881 acceptor_pool.cc:254] collecting diagnostics on the listening RPC socket unix:/tmp/dist-test-taskTuSbcL/test-tmp/rpc-test-eb322db4c66841ff907881f2a6132178.sock every 8 connection(s)
I20260925 03:03:45.065680 13687 rpc-test.cc:532] Connecting to unix:/tmp/dist-test-taskTuSbcL/test-tmp/rpc-test-eb322db4c66841ff907881f2a6132178.sock
W20260925 03:03:48.094307 13879 connection.cc:196] Error closing socket: Network error: TlsSocket::Close: Broken pipe
[ OK ] Parameters/TestRpc.TestConnectionAlwaysKeepalive/SSL_UnixSocket (3065 ms)
[ RUN ] Parameters/TestRpc.TestReopenOutboundConnections/SSL_UnixSocket
I20260925 03:03:48.119788 13903 acceptor_pool.cc:254] collecting diagnostics on the listening RPC socket unix:/tmp/dist-test-taskTuSbcL/test-tmp/rpc-test-7bda87c43cd148c78563ff0559b357a9.sock every 8 connection(s)
I20260925 03:03:48.120498 13904 acceptor_pool.cc:254] collecting diagnostics on the listening RPC socket unix:/tmp/dist-test-taskTuSbcL/test-tmp/rpc-test-7bda87c43cd148c78563ff0559b357a9.sock every 8 connection(s)
I20260925 03:03:48.123696 13687 rpc-test.cc:658] Connecting to unix:/tmp/dist-test-taskTuSbcL/test-tmp/rpc-test-7bda87c43cd148c78563ff0559b357a9.sock
W20260925 03:03:48.159215 13902 connection.cc:196] Error closing socket: Network error: TlsSocket::Close: Broken pipe
W20260925 03:03:48.168116 13902 connection.cc:196] Error closing socket: Network error: TlsSocket::Close: Broken pipe
W20260925 03:03:48.177048 13902 connection.cc:196] Error closing socket: Network error: TlsSocket::Close: Broken pipe
W20260925 03:03:48.185770 13902 connection.cc:196] Error closing socket: Network error: TlsSocket::Close: Broken pipe
W20260925 03:03:48.194607 13902 connection.cc:196] Error closing socket: Network error: TlsSocket::Close: Broken pipe
W20260925 03:03:48.204090 13902 connection.cc:196] Error closing socket: Network error: TlsSocket::Close: Broken pipe
W20260925 03:03:48.213949 13902 connection.cc:196] Error closing socket: Network error: TlsSocket::Close: Broken pipe
W20260925 03:03:48.224257 13902 connection.cc:196] Error closing socket: Network error: TlsSocket::Close: Broken pipe
W20260925 03:03:48.233443 13902 connection.cc:196] Error closing socket: Network error: TlsSocket::Close: Broken pipe
W20260925 03:03:48.243974 13902 connection.cc:196] Error closing socket: Network error: TlsSocket::Close: Broken pipe
W20260925 03:03:48.254242 13902 connection.cc:196] Error closing socket: Network error: TlsSocket::Close: Broken pipe
W20260925 03:03:48.264688 13902 connection.cc:196] Error closing socket: Network error: TlsSocket::Close: Broken pipe
W20260925 03:03:48.274983 13902 connection.cc:196] Error closing socket: Network error: TlsSocket::Close: Broken pipe
W20260925 03:03:48.285228 13902 connection.cc:196] Error closing socket: Network error: TlsSocket::Close: Broken pipe
W20260925 03:03:48.285296 13903 acceptor_pool.cc:285] unable to collect diagnostics on RPC socket unix:/tmp/dist-test-taskTuSbcL/test-tmp/rpc-test-7bda87c43cd148c78563ff0559b357a9.sock: Not implemented: netlink diagnostics is currently supported only on IPv4 TCP sockets
W20260925 03:03:48.295603 13902 connection.cc:196] Error closing socket: Network error: TlsSocket::Close: Broken pipe
W20260925 03:03:48.305707 13902 connection.cc:196] Error closing socket: Network error: TlsSocket::Close: Broken pipe
W20260925 03:03:48.315811 13902 connection.cc:196] Error closing socket: Network error: TlsSocket::Close: Broken pipe
W20260925 03:03:48.325984 13902 connection.cc:196] Error closing socket: Network error: TlsSocket::Close: Broken pipe
W20260925 03:03:48.336449 13902 connection.cc:196] Error closing socket: Network error: TlsSocket::Close: Broken pipe
W20260925 03:03:48.346707 13902 connection.cc:196] Error closing socket: Network error: TlsSocket::Close: Broken pipe
W20260925 03:03:48.356858 13902 connection.cc:196] Error closing socket: Network error: TlsSocket::Close: Broken pipe
W20260925 03:03:48.367084 13902 connection.cc:196] Error closing socket: Network error: TlsSocket::Close: Broken pipe
W20260925 03:03:48.377455 13902 connection.cc:196] Error closing socket: Network error: TlsSocket::Close: Broken pipe
W20260925 03:03:48.387858 13902 connection.cc:196] Error closing socket: Network error: TlsSocket::Close: Broken pipe
W20260925 03:03:48.398087 13902 connection.cc:196] Error closing socket: Network error: TlsSocket::Close: Broken pipe
W20260925 03:03:48.407953 13902 connection.cc:196] Error closing socket: Network error: TlsSocket::Close: Broken pipe
W20260925 03:03:48.417447 13902 connection.cc:196] Error closing socket: Network error: TlsSocket::Close: Broken pipe
W20260925 03:03:48.427817 13902 connection.cc:196] Error closing socket: Network error: TlsSocket::Close: Broken pipe
W20260925 03:03:48.439697 13902 connection.cc:196] Error closing socket: Network error: TlsSocket::Close: Broken pipe
W20260925 03:03:48.449746 13902 connection.cc:196] Error closing socket: Network error: TlsSocket::Close: Broken pipe
W20260925 03:03:48.459363 13902 connection.cc:196] Error closing socket: Network error: TlsSocket::Close: Broken pipe
W20260925 03:03:48.470631 13902 connection.cc:196] Error closing socket: Network error: TlsSocket::Close: Broken pipe
[ OK ] Parameters/TestRpc.TestReopenOutboundConnections/SSL_UnixSocket (376 ms)
[ RUN ] Parameters/TestRpc.TestConnectionNetworkPlane/SSL_UnixSocket
I20260925 03:03:48.500764 13926 acceptor_pool.cc:254] collecting diagnostics on the listening RPC socket unix:/tmp/dist-test-taskTuSbcL/test-tmp/rpc-test-0dd1ddadba7445868f614587b3f09e7b.sock every 8 connection(s)
I20260925 03:03:48.501520 13927 acceptor_pool.cc:254] collecting diagnostics on the listening RPC socket unix:/tmp/dist-test-taskTuSbcL/test-tmp/rpc-test-0dd1ddadba7445868f614587b3f09e7b.sock every 8 connection(s)
I20260925 03:03:48.504700 13687 rpc-test.cc:772] Connecting to unix:/tmp/dist-test-taskTuSbcL/test-tmp/rpc-test-0dd1ddadba7445868f614587b3f09e7b.sock
W20260925 03:03:48.562412 13925 connection.cc:196] Error closing socket: Network error: TlsSocket::Close: Broken pipe
W20260925 03:03:48.563396 13925 connection.cc:196] Error closing socket: Network error: TlsSocket::Close: Broken pipe
[ OK ] Parameters/TestRpc.TestConnectionNetworkPlane/SSL_UnixSocket (92 ms)
[ RUN ] Parameters/TestRpc.TestTCPKeepalive/SSL_UnixSocket
I20260925 03:03:48.584897 13951 acceptor_pool.cc:254] collecting diagnostics on the listening RPC socket unix:/tmp/dist-test-taskTuSbcL/test-tmp/rpc-test-6f169c9828764ff3a441ef242cc183d9.sock every 8 connection(s)
I20260925 03:03:48.585632 13952 acceptor_pool.cc:254] collecting diagnostics on the listening RPC socket unix:/tmp/dist-test-taskTuSbcL/test-tmp/rpc-test-6f169c9828764ff3a441ef242cc183d9.sock every 8 connection(s)
I20260925 03:03:48.633235 13955 rpc-test-base.h:222] got call: sleep_micros: 8000000 deferred: true
I20260925 03:03:56.637208 13955 rpcz_store.cc:275] Call kudu.rpc.GenericCalculatorService.Sleep from unix:<unnamed> (request call id 0) took 8004 ms. Trace:
I20260925 03:03:56.637646 13955 rpcz_store.cc:276] 0925 03:03:48.633008 (+ 0us) service_pool.cc:170] Inserting onto call queue
0925 03:03:48.633179 (+ 171us) service_pool.cc:227] Handling call
0925 03:03:56.637031 (+8003852us) inbound_call.cc:173] Queueing success response
Metrics: {}
W20260925 03:03:56.643814 13948 connection.cc:196] Error closing socket: Network error: TlsSocket::Close: Broken pipe
[ OK ] Parameters/TestRpc.TestTCPKeepalive/SSL_UnixSocket (8082 ms)
[ RUN ] Parameters/TestRpc.TestMaxSmallSidecars/SSL_UnixSocket
I20260925 03:03:56.684782 13977 acceptor_pool.cc:254] collecting diagnostics on the listening RPC socket unix:/tmp/dist-test-taskTuSbcL/test-tmp/rpc-test-e5a33498d9d34721a47c154b53e5ef9c.sock every 8 connection(s)
I20260925 03:03:56.685650 13978 acceptor_pool.cc:254] collecting diagnostics on the listening RPC socket unix:/tmp/dist-test-taskTuSbcL/test-tmp/rpc-test-e5a33498d9d34721a47c154b53e5ef9c.sock every 8 connection(s)
W20260925 03:03:56.844522 13974 connection.cc:196] Error closing socket: Network error: TlsSocket::Close: Broken pipe
[ OK ] Parameters/TestRpc.TestMaxSmallSidecars/SSL_UnixSocket (198 ms)
[ RUN ] Parameters/TestRpc.TestCallTimeout/SSL_UnixSocket
I20260925 03:03:56.876884 14002 acceptor_pool.cc:254] collecting diagnostics on the listening RPC socket unix:/tmp/dist-test-taskTuSbcL/test-tmp/rpc-test-3e72bd31f3884c92b980cd6bce4d1674.sock every 8 connection(s)
I20260925 03:03:56.877748 14003 acceptor_pool.cc:254] collecting diagnostics on the listening RPC socket unix:/tmp/dist-test-taskTuSbcL/test-tmp/rpc-test-3e72bd31f3884c92b980cd6bce4d1674.sock every 8 connection(s)
I20260925 03:03:56.911073 13687 rpc-test-base.h:595] status: Timed out: connection negotiation to unix:/tmp/dist-test-taskTuSbcL/test-tmp/rpc-test-3e72bd31f3884c92b980cd6bce4d1674.sock for RPC Sleep timed out after 0.000s (ON_OUTBOUND_QUEUE), seconds elapsed: 0.00292438
I20260925 03:03:56.917775 14006 rpc-test-base.h:222] got call: sleep_micros: 700000
I20260925 03:03:57.112541 13687 rpc-test-base.h:595] status: Timed out: Sleep RPC to unix:/tmp/dist-test-taskTuSbcL/test-tmp/rpc-test-3e72bd31f3884c92b980cd6bce4d1674.sock timed out after 0.200s (SENT), seconds elapsed: 0.201046
I20260925 03:03:57.113948 14005 rpc-test-base.h:222] got call: sleep_micros: 2000000
W20260925 03:03:57.618405 14006 rpcz_store.cc:267] Call kudu.rpc.GenericCalculatorService.Sleep from unix:<unnamed> (request call id 1) took 700 ms (client timeout 200 ms). Trace:
W20260925 03:03:57.618817 14006 rpcz_store.cc:269] 0925 03:03:56.917628 (+ 0us) service_pool.cc:170] Inserting onto call queue
0925 03:03:56.917731 (+ 103us) service_pool.cc:227] Handling call
0925 03:03:57.618347 (+700616us) inbound_call.cc:173] Queueing success response
Metrics: {}
I20260925 03:03:58.615015 13687 rpc-test-base.h:595] status: Timed out: Sleep RPC to unix:/tmp/dist-test-taskTuSbcL/test-tmp/rpc-test-3e72bd31f3884c92b980cd6bce4d1674.sock timed out after 1.500s (SENT), seconds elapsed: 1.50215
W20260925 03:03:59.114526 14005 rpcz_store.cc:267] Call kudu.rpc.GenericCalculatorService.Sleep from unix:<unnamed> (request call id 2) took 2000 ms (client timeout 1500 ms). Trace:
W20260925 03:03:59.114905 14005 rpcz_store.cc:269] 0925 03:03:57.113761 (+ 0us) service_pool.cc:170] Inserting onto call queue
0925 03:03:57.113887 (+ 126us) service_pool.cc:227] Handling call
0925 03:03:59.114456 (+2000569us) inbound_call.cc:173] Queueing success response
Metrics: {}
W20260925 03:03:59.115526 13999 connection.cc:441] server connection from unix:<unnamed> torn down before Call kudu.rpc.GenericCalculatorService.Sleep from unix:<unnamed> (request call id 2) could send its response
[ OK ] Parameters/TestRpc.TestCallTimeout/SSL_UnixSocket (2271 ms)
[ RUN ] Parameters/TestRpc.TestServerShutsDown/SSL_UnixSocket
I20260925 03:03:59.123026 13687 rpc-test.cc:1125] Connecting to 0.0.0.0:41253
W20260925 03:03:59.132699 14019 negotiation.cc:337] Failed RPC negotiation. Trace:
0925 03:03:59.131288 (+ 0us) reactor.cc:625] Submitting negotiation task for client connection to 0.0.0.0:41253 (local address 127.0.0.1:39480)
0925 03:03:59.131732 (+ 444us) negotiation.cc:107] Waiting for socket to connect
0925 03:03:59.131763 (+ 31us) client_negotiation.cc:174] Beginning negotiation
0925 03:03:59.131971 (+ 208us) client_negotiation.cc:252] Sending NEGOTIATE NegotiatePB request
0925 03:03:59.132205 (+ 234us) negotiation.cc:327] Negotiation complete: Network error: Client connection negotiation failed: client connection to 0.0.0.0:41253: BlockingWrite error: write error: Broken pipe (error 32)
Metrics: {"client-negotiator.queue_time_us":103}
[ OK ] Parameters/TestRpc.TestServerShutsDown/SSL_UnixSocket (14 ms)
[ RUN ] Parameters/TestRpc.TimedOutOnResponseMetric/SSL_UnixSocket
I20260925 03:03:59.152350 14036 acceptor_pool.cc:254] collecting diagnostics on the listening RPC socket unix:/tmp/dist-test-taskTuSbcL/test-tmp/rpc-test-d9ab7b3a199d484aacc064509bebdef5.sock every 8 connection(s)
I20260925 03:03:59.153074 14037 acceptor_pool.cc:254] collecting diagnostics on the listening RPC socket unix:/tmp/dist-test-taskTuSbcL/test-tmp/rpc-test-d9ab7b3a199d484aacc064509bebdef5.sock every 8 connection(s)
W20260925 03:03:59.401957 14040 rpcz_store.cc:267] Call kudu.rpc_test.CalculatorService.Sleep from unix:<unnamed> (request call id 3) took 50 ms (client timeout 25 ms). Trace:
W20260925 03:03:59.402240 14040 rpcz_store.cc:269] 0925 03:03:59.351374 (+ 0us) service_pool.cc:170] Inserting onto call queue
0925 03:03:59.351490 (+ 116us) service_pool.cc:227] Handling call
0925 03:03:59.401885 (+ 50395us) inbound_call.cc:173] Queueing success response
Related trace 'test_child':
Metrics: {"test_sleep_us":50000,"child_traces":[["test_child",{"related_trace_metric":1}]]}
W20260925 03:03:59.460932 14040 rpcz_store.cc:267] Call kudu.rpc_test.CalculatorService.Sleep from unix:<unnamed> (request call id 4) took 50 ms (client timeout 50 ms). Trace:
W20260925 03:03:59.461220 14040 rpcz_store.cc:269] 0925 03:03:59.410385 (+ 0us) service_pool.cc:170] Inserting onto call queue
0925 03:03:59.410530 (+ 145us) service_pool.cc:227] Handling call
0925 03:03:59.460873 (+ 50343us) inbound_call.cc:173] Queueing success response
Related trace 'test_child':
Metrics: {"test_sleep_us":50000,"child_traces":[["test_child",{"related_trace_metric":1}]]}
[ OK ] Parameters/TestRpc.TimedOutOnResponseMetric/SSL_UnixSocket (334 ms)
[ RUN ] Parameters/TestRpc.AcceptorDispatchingTimesMetric/SSL_UnixSocket
I20260925 03:03:59.485077 14061 acceptor_pool.cc:254] collecting diagnostics on the listening RPC socket 0.0.0.0:33463 every 8 connection(s)
I20260925 03:03:59.485786 14062 acceptor_pool.cc:254] collecting diagnostics on the listening RPC socket 0.0.0.0:33463 every 8 connection(s)
W20260925 03:03:59.491387 14057 negotiation.cc:337] Failed RPC negotiation. Trace:
0925 03:03:59.489472 (+ 0us) reactor.cc:625] Submitting negotiation task for server connection from 127.0.0.1:44938 (local address 127.0.0.1:33463)
0925 03:03:59.489986 (+ 514us) server_negotiation.cc:206] Beginning negotiation
0925 03:03:59.490021 (+ 35us) server_negotiation.cc:399] Waiting for connection header
0925 03:03:59.490417 (+ 396us) negotiation.cc:327] Negotiation complete: Network error: Server connection negotiation failed: server connection from 127.0.0.1:44938: BlockingRecv error: recv got EOF from 127.0.0.1:44938 (error 108)
Metrics: {"server-negotiator.queue_time_us":136}
[ OK ] Parameters/TestRpc.AcceptorDispatchingTimesMetric/SSL_UnixSocket (24 ms)
[ RUN ] Parameters/TestRpc.TestRpcCallbackDestroysMessenger/SSL_UnixSocket
[ OK ] Parameters/TestRpc.TestRpcCallbackDestroysMessenger/SSL_UnixSocket (31 ms)
[ RUN ] Parameters/TestRpc.TestApplicationFeatureFlag/SSL_UnixSocket
I20260925 03:03:59.543520 14086 acceptor_pool.cc:254] collecting diagnostics on the listening RPC socket unix:/tmp/dist-test-taskTuSbcL/test-tmp/rpc-test-dddb9a87002445f5b40b54045b1d7c13.sock every 8 connection(s)
I20260925 03:03:59.544270 14087 acceptor_pool.cc:254] collecting diagnostics on the listening RPC socket unix:/tmp/dist-test-taskTuSbcL/test-tmp/rpc-test-dddb9a87002445f5b40b54045b1d7c13.sock every 8 connection(s)
W20260925 03:03:59.578157 14083 messenger.cc:357] Unable to handle RPC call: Not implemented: call requires unsupported application feature flags: 99
[ OK ] Parameters/TestRpc.TestApplicationFeatureFlag/SSL_UnixSocket (59 ms)
[ RUN ] Parameters/TestRpc.TestCancellation/SSL_UnixSocket
I20260925 03:03:59.604199 14111 acceptor_pool.cc:254] collecting diagnostics on the listening RPC socket unix:/tmp/dist-test-taskTuSbcL/test-tmp/rpc-test-59112cf2f1d943579f602e5091004eb9.sock every 8 connection(s)
I20260925 03:03:59.604930 14112 acceptor_pool.cc:254] collecting diagnostics on the listening RPC socket unix:/tmp/dist-test-taskTuSbcL/test-tmp/rpc-test-59112cf2f1d943579f602e5091004eb9.sock every 8 connection(s)
I20260925 03:03:59.608071 13687 rpc-test.cc:1648] Connecting to unix:/tmp/dist-test-taskTuSbcL/test-tmp/rpc-test-59112cf2f1d943579f602e5091004eb9.sock
I20260925 03:03:59.710398 13687 rpc-test-base.h:595] status: Aborted: Sleep RPC to unix:/tmp/dist-test-taskTuSbcL/test-tmp/rpc-test-59112cf2f1d943579f602e5091004eb9.sock is cancelled in state READY, seconds elapsed: 0.000317351
I20260925 03:03:59.882040 13687 rpc-test-base.h:595] status: Aborted: Sleep RPC to unix:/tmp/dist-test-taskTuSbcL/test-tmp/rpc-test-59112cf2f1d943579f602e5091004eb9.sock is cancelled in state SENT, seconds elapsed: 0.000675419
I20260925 03:03:59.882371 14114 rpc-test-base.h:222] got call: sleep_micros: 510000
I20260925 03:04:00.055255 13687 rpc-test-base.h:595] status: Aborted: Sleep RPC to unix:/tmp/dist-test-taskTuSbcL/test-tmp/rpc-test-59112cf2f1d943579f602e5091004eb9.sock is cancelled in state SENT, seconds elapsed: 0.000654262
I20260925 03:04:00.055588 14113 rpc-test-base.h:222] got call: sleep_micros: 510000
I20260925 03:04:00.243198 13687 rpc-test-base.h:595] status: Aborted: Sleep RPC to unix:/tmp/dist-test-taskTuSbcL/test-tmp/rpc-test-59112cf2f1d943579f602e5091004eb9.sock is cancelled in state SENT, seconds elapsed: 0.000821831
W20260925 03:04:00.253865 14115 rpcz_store.cc:267] Call kudu.rpc.GenericCalculatorService.Sleep from unix:<unnamed> (request call id 11) took 10 ms (client timeout 10 ms). Trace:
W20260925 03:04:00.254128 14115 rpcz_store.cc:269] 0925 03:04:00.243313 (+ 0us) service_pool.cc:170] Inserting onto call queue
0925 03:04:00.253582 (+ 10269us) service_pool.cc:214] Skipping call since client already timed out
0925 03:04:00.253705 (+ 123us) inbound_call.cc:173] Queueing failure response
Metrics: {}
I20260925 03:04:00.254709 14115 rpc-test-base.h:222] got call: sleep_micros: 1500000
W20260925 03:04:00.392885 14114 rpcz_store.cc:267] Call kudu.rpc.GenericCalculatorService.Sleep from unix:<unnamed> (request call id 3) took 510 ms (client timeout 10 ms). Trace:
W20260925 03:04:00.393254 14114 rpcz_store.cc:269] 0925 03:03:59.882202 (+ 0us) service_pool.cc:170] Inserting onto call queue
0925 03:03:59.882318 (+ 116us) service_pool.cc:227] Handling call
0925 03:04:00.392827 (+510509us) inbound_call.cc:173] Queueing success response
Metrics: {}
W20260925 03:04:00.566198 14113 rpcz_store.cc:267] Call kudu.rpc.GenericCalculatorService.Sleep from unix:<unnamed> (request call id 7) took 510 ms (client timeout 10 ms). Trace:
W20260925 03:04:00.566504 14113 rpcz_store.cc:269] 0925 03:04:00.055396 (+ 0us) service_pool.cc:170] Inserting onto call queue
0925 03:04:00.055537 (+ 141us) service_pool.cc:227] Handling call
0925 03:04:00.566139 (+510602us) inbound_call.cc:173] Queueing success response
Metrics: {}
I20260925 03:04:01.244689 13687 rpc-test-base.h:595] status: Timed out: Sleep RPC to unix:/tmp/dist-test-taskTuSbcL/test-tmp/rpc-test-59112cf2f1d943579f602e5091004eb9.sock timed out after 1.000s (SENT), seconds elapsed: 1.00104
I20260925 03:04:01.246582 14113 rpc-test-base.h:222] got call: sleep_micros: 1500000
W20260925 03:04:01.755376 14115 rpcz_store.cc:267] Call kudu.rpc.GenericCalculatorService.Sleep from unix:<unnamed> (request call id 12) took 1511 ms (client timeout 1000 ms). Trace:
W20260925 03:04:01.755750 14115 rpcz_store.cc:269] 0925 03:04:00.244256 (+ 0us) service_pool.cc:170] Inserting onto call queue
0925 03:04:00.254677 (+ 10421us) service_pool.cc:227] Handling call
0925 03:04:01.755234 (+1500557us) inbound_call.cc:173] Queueing success response
Metrics: {}
I20260925 03:04:02.247152 13687 rpc-test-base.h:595] status: Timed out: Sleep RPC to unix:/tmp/dist-test-taskTuSbcL/test-tmp/rpc-test-59112cf2f1d943579f602e5091004eb9.sock timed out after 1.000s (SENT), seconds elapsed: 1.00202
W20260925 03:04:02.248709 14108 messenger.cc:357] Unable to handle RPC call: Not implemented: call requires unsupported application feature flags: 99, 1
W20260925 03:04:02.250167 14108 messenger.cc:357] Unable to handle RPC call: Not implemented: call requires unsupported application feature flags: 99, 1
W20260925 03:04:02.484107 14108 connection.cc:196] Error closing socket: Network error: TlsSocket::Close: Broken pipe
W20260925 03:04:02.747228 14113 rpcz_store.cc:267] Call kudu.rpc.GenericCalculatorService.Sleep from unix:<unnamed> (request call id 13) took 1501 ms (client timeout 1000 ms). Trace:
W20260925 03:04:02.747542 14113 rpcz_store.cc:269] 0925 03:04:01.246203 (+ 0us) service_pool.cc:170] Inserting onto call queue
0925 03:04:01.246450 (+ 247us) service_pool.cc:227] Handling call
0925 03:04:02.747171 (+1500721us) inbound_call.cc:173] Queueing success response
Metrics: {}
W20260925 03:04:02.748054 14108 connection.cc:441] server connection from unix:<unnamed> torn down before Call kudu.rpc.GenericCalculatorService.Sleep from unix:<unnamed> (request call id 13) could send its response
[ OK ] Parameters/TestRpc.TestCancellation/SSL_UnixSocket (3171 ms)
[ RUN ] Parameters/TestRpc.TestCancellationMultiThreads/SSL_UnixSocket
I20260925 03:04:02.810964 14137 acceptor_pool.cc:254] collecting diagnostics on the listening RPC socket unix:/tmp/dist-test-taskTuSbcL/test-tmp/rpc-test-b14ab65f7af7463aa2851fdbfd83acb0.sock every 8 connection(s)
I20260925 03:04:02.811923 14138 acceptor_pool.cc:254] collecting diagnostics on the listening RPC socket unix:/tmp/dist-test-taskTuSbcL/test-tmp/rpc-test-b14ab65f7af7463aa2851fdbfd83acb0.sock every 8 connection(s)
I20260925 03:04:02.815371 13687 rpc-test.cc:1808] Connecting to unix:/tmp/dist-test-taskTuSbcL/test-tmp/rpc-test-b14ab65f7af7463aa2851fdbfd83acb0.sock
I20260925 03:04:02.975710 14151 test_util.cc:268] Using random seed: -134754447
I20260925 03:04:02.978294 14152 test_util.cc:268] Using random seed: -134751780
I20260925 03:04:02.979868 14153 test_util.cc:268] Using random seed: -134750204
I20260925 03:04:02.981791 14154 test_util.cc:268] Using random seed: -134748460
I20260925 03:04:02.983327 14155 test_util.cc:268] Using random seed: -134746902
I20260925 03:04:02.985229 14156 test_util.cc:268] Using random seed: -134745021
I20260925 03:04:02.986835 14157 test_util.cc:268] Using random seed: -134743404
I20260925 03:04:02.988814 14158 test_util.cc:268] Using random seed: -134741442
I20260925 03:04:02.990545 14159 test_util.cc:268] Using random seed: -134739688
I20260925 03:04:02.991906 14160 test_util.cc:268] Using random seed: -134738279
I20260925 03:04:02.993438 14161 test_util.cc:268] Using random seed: -134736787
I20260925 03:04:02.994979 14162 test_util.cc:268] Using random seed: -134735259
I20260925 03:04:02.996752 14163 test_util.cc:268] Using random seed: -134733482
I20260925 03:04:02.998718 14164 test_util.cc:268] Using random seed: -134731574
I20260925 03:04:03.000774 14165 test_util.cc:268] Using random seed: -134729487
I20260925 03:04:03.002525 14166 test_util.cc:268] Using random seed: -134727735
I20260925 03:04:03.004891 14167 test_util.cc:268] Using random seed: -134725378
I20260925 03:04:03.006469 14168 test_util.cc:268] Using random seed: -134723778
I20260925 03:04:03.008343 14169 test_util.cc:268] Using random seed: -134721936
I20260925 03:04:03.010083 14170 test_util.cc:268] Using random seed: -134720186
I20260925 03:04:03.012105 14171 test_util.cc:268] Using random seed: -134718119
I20260925 03:04:03.013873 14172 test_util.cc:268] Using random seed: -134716403
I20260925 03:04:03.015930 14173 test_util.cc:268] Using random seed: -134714333
I20260925 03:04:03.017603 14174 test_util.cc:268] Using random seed: -134712628
I20260925 03:04:03.019414 14175 test_util.cc:268] Using random seed: -134710841
I20260925 03:04:03.021564 14176 test_util.cc:268] Using random seed: -134708673
I20260925 03:04:03.023344 14177 test_util.cc:268] Using random seed: -134706924
I20260925 03:04:03.025337 14178 test_util.cc:268] Using random seed: -134704964
I20260925 03:04:03.027829 14179 test_util.cc:268] Using random seed: -134702440
I20260925 03:04:03.029521 14180 test_util.cc:268] Using random seed: -134700715
W20260925 03:04:23.436726 14134 connection.cc:196] Error closing socket: Network error: TlsSocket::Close: Broken pipe
[ OK ] Parameters/TestRpc.TestCancellationMultiThreads/SSL_UnixSocket (20697 ms)
[ RUN ] Parameters/TestRpc.TestCallId/SSL_UnixSocket
I20260925 03:04:23.487103 14195 acceptor_pool.cc:254] collecting diagnostics on the listening RPC socket unix:/tmp/dist-test-taskTuSbcL/test-tmp/rpc-test-26443da4ce9c45548ff89a0f9217ba45.sock every 8 connection(s)
I20260925 03:04:23.488008 14196 acceptor_pool.cc:254] collecting diagnostics on the listening RPC socket unix:/tmp/dist-test-taskTuSbcL/test-tmp/rpc-test-26443da4ce9c45548ff89a0f9217ba45.sock every 8 connection(s)
W20260925 03:04:23.531255 14192 connection.cc:196] Error closing socket: Network error: TlsSocket::Close: Broken pipe
[ OK ] Parameters/TestRpc.TestCallId/SSL_UnixSocket (86 ms)
[----------] 20 tests from Parameters/TestRpc (39187 ms total)
[----------] Global test environment tear-down
[==========] 21 tests from 2 test suites ran. (42387 ms total)
[ PASSED ] 20 tests.
[ FAILED ] 1 test, listed below:
[ FAILED ] Parameters/TestRpc.TestCallWithChainCertAndRootCA/SSL_UnixSocket, where GetParam() = (true, true)
1 FAILED TEST
I20260925 03:04:23.559491 13687 logging.cc:424] LogThrottler /data0/somelongdirectorytoavoidrpathissues/src/kudu/src/kudu/rpc/acceptor_pool.cc:285: suppressed but not reported on 3 messages since previous log ~35 seconds ago