Diagnosed failure

Parameters/TestRpc.TestCallWithChainCertAndChainCA/SSL_TCP: /data0/somelongdirectorytoavoidrpathissues/src/kudu/src/kudu/rpc/rpc-test.cc:270: Failure
Failed
Bad status: Runtime error: could not verify certificate chain (error with cert: subject=CN = localhost, ST = sadfjas, C = AS, emailAddress = sdflkdsajf, O = lskdfjlsad, OU = sldfkja, issuer=C = AS, ST = ASDfkjdhf, L = lskdjf, O = saldfja, OU = skdjf, CN = localhost, emailAddress = sadjflkadsj): : certificate has expired
Google Test trace:
/data0/somelongdirectorytoavoidrpathissues/src/kudu/src/kudu/rpc/rpc-test.cc:267: Connecting to 0.0.0.0:44935
I20260924 14:35:52.639250  3966 test_util.cc:175] -----------------------------------------------
I20260924 14:35:52.639427  3966 test_util.cc:176] Had fatal failures, leaving test files at /tmp/dist-test-taskORsRX9/test-tmp/rpc-test.5.Parameters_TestRpc.TestCallWithChainCertAndChainCA_SSL_TCP.1790260551268794-3966-0

Full log

Note: This is test shard 6 of 8.
[==========] Running 21 tests from 2 test suites.
[----------] Global test environment set-up.
[----------] 20 tests from Parameters/TestRpc
[ RUN      ] Parameters/TestRpc.TestMessengerCreateDestroy/SSL_TCP
WARNING: Logging before InitGoogleLogging() is written to STDERR
I20260924 14:35:51.374985  3966 rpc-test.cc:169] started messenger TestCreateDestroy
[       OK ] Parameters/TestRpc.TestMessengerCreateDestroy/SSL_TCP (1185 ms)
[ RUN      ] Parameters/TestRpc.TestNegotiationDeadlock/SSL_TCP
I20260924 14:35:52.530803  3988 acceptor_pool.cc:254] collecting diagnostics on the listening RPC socket 0.0.0.0:42525 every 8 connection(s)
I20260924 14:35:52.532243  3989 acceptor_pool.cc:254] collecting diagnostics on the listening RPC socket 0.0.0.0:42525 every 8 connection(s)
[       OK ] Parameters/TestRpc.TestNegotiationDeadlock/SSL_TCP (77 ms)
[ RUN      ] Parameters/TestRpc.TestCallWithChainCertAndChainCA/SSL_TCP
I20260924 14:35:52.609791  4004 acceptor_pool.cc:254] collecting diagnostics on the listening RPC socket 0.0.0.0:44935 every 8 connection(s)
I20260924 14:35:52.611582  4005 acceptor_pool.cc:254] collecting diagnostics on the listening RPC socket 0.0.0.0:44935 every 8 connection(s)
/data0/somelongdirectorytoavoidrpathissues/src/kudu/src/kudu/rpc/rpc-test.cc:270: Failure
Failed
Bad status: Runtime error: could not verify certificate chain (error with cert: subject=CN = localhost, ST = sadfjas, C = AS, emailAddress = sdflkdsajf, O = lskdfjlsad, OU = sldfkja, issuer=C = AS, ST = ASDfkjdhf, L = lskdjf, O = saldfja, OU = skdjf, CN = localhost, emailAddress = sadjflkadsj): : certificate has expired
Google Test trace:
/data0/somelongdirectorytoavoidrpathissues/src/kudu/src/kudu/rpc/rpc-test.cc:267: Connecting to 0.0.0.0:44935
I20260924 14:35:52.639250  3966 test_util.cc:175] -----------------------------------------------
I20260924 14:35:52.639427  3966 test_util.cc:176] Had fatal failures, leaving test files at /tmp/dist-test-taskORsRX9/test-tmp/rpc-test.5.Parameters_TestRpc.TestCallWithChainCertAndChainCA_SSL_TCP.1790260551268794-3966-0
[  FAILED  ] Parameters/TestRpc.TestCallWithChainCertAndChainCA/SSL_TCP, where GetParam() = (true, false) (53 ms)
[ RUN      ] Parameters/TestRpc.TestCallWithPasswordProtectedKey/SSL_TCP
I20260924 14:35:52.664268  4029 acceptor_pool.cc:254] collecting diagnostics on the listening RPC socket 0.0.0.0:44501 every 8 connection(s)
I20260924 14:35:52.664908  4030 acceptor_pool.cc:254] collecting diagnostics on the listening RPC socket 0.0.0.0:44501 every 8 connection(s)
[       OK ] Parameters/TestRpc.TestCallWithPasswordProtectedKey/SSL_TCP (77 ms)
[ RUN      ] Parameters/TestRpc.TestCallToBadServer/SSL_TCP
I20260924 14:35:52.731750  3966 rpc-test.cc:394] Status: Network error: Client connection negotiation failed: client connection to 0.0.0.0:0: connect: Connection refused (error 111)
I20260924 14:35:52.733213  3966 rpc-test.cc:394] Status: Network error: Client connection negotiation failed: client connection to 0.0.0.0:0: connect: Connection refused (error 111)
I20260924 14:35:52.734619  3966 rpc-test.cc:394] Status: Network error: Client connection negotiation failed: client connection to 0.0.0.0:0: connect: Connection refused (error 111)
I20260924 14:35:52.736016  3966 rpc-test.cc:394] Status: Network error: Client connection negotiation failed: client connection to 0.0.0.0:0: connect: Connection refused (error 111)
I20260924 14:35:52.737391  3966 rpc-test.cc:394] Status: Network error: Client connection negotiation failed: client connection to 0.0.0.0:0: connect: Connection refused (error 111)
[       OK ] Parameters/TestRpc.TestCallToBadServer/SSL_TCP (23 ms)
[ RUN      ] Parameters/TestRpc.TestWrongService/SSL_TCP
I20260924 14:35:52.765370  4065 acceptor_pool.cc:254] collecting diagnostics on the listening RPC socket 0.0.0.0:38653 every 8 connection(s)
I20260924 14:35:52.766229  4066 acceptor_pool.cc:254] collecting diagnostics on the listening RPC socket 0.0.0.0:38653 every 8 connection(s)
I20260924 14:35:52.797839  4063 messenger.cc:345] service WrongServiceName not registered on TestServer
[       OK ] Parameters/TestRpc.TestWrongService/SSL_TCP (66 ms)
[ RUN      ] Parameters/TestRpc.TestConnectionKeepalive/SSL_TCP
I20260924 14:35:52.831007  4088 acceptor_pool.cc:254] collecting diagnostics on the listening RPC socket 0.0.0.0:40573 every 8 connection(s)
I20260924 14:35:52.831794  4089 acceptor_pool.cc:254] collecting diagnostics on the listening RPC socket 0.0.0.0:40573 every 8 connection(s)
I20260924 14:35:52.834975  3966 rpc-test.cc:488] Connecting to 0.0.0.0:40573
[       OK ] Parameters/TestRpc.TestConnectionKeepalive/SSL_TCP (1075 ms)
[ RUN      ] Parameters/TestRpc.TestClientConnectionMetrics/SSL_TCP
I20260924 14:35:53.901535  4113 acceptor_pool.cc:254] collecting diagnostics on the listening RPC socket 0.0.0.0:41871 every 8 connection(s)
I20260924 14:35:53.902285  4114 acceptor_pool.cc:254] collecting diagnostics on the listening RPC socket 0.0.0.0:41871 every 8 connection(s)
I20260924 14:35:53.905575  3966 rpc-test.cc:569] Connecting to 0.0.0.0:41871
[       OK ] Parameters/TestRpc.TestClientConnectionMetrics/SSL_TCP (118282 ms)
[ RUN      ] Parameters/TestRpc.TestCredentialsPolicy/SSL_TCP
I20260924 14:37:52.188987  4148 acceptor_pool.cc:254] collecting diagnostics on the listening RPC socket 0.0.0.0:41401 every 8 connection(s)
I20260924 14:37:52.189821  4149 acceptor_pool.cc:254] collecting diagnostics on the listening RPC socket 0.0.0.0:41401 every 8 connection(s)
I20260924 14:37:52.193128  3966 rpc-test.cc:700] Connecting to 0.0.0.0:41401
[       OK ] Parameters/TestRpc.TestCredentialsPolicy/SSL_TCP (104 ms)
[ RUN      ] Parameters/TestRpc.TestCallLongerThanKeepalive/SSL_TCP
I20260924 14:37:52.289420  4174 acceptor_pool.cc:254] collecting diagnostics on the listening RPC socket 0.0.0.0:43919 every 8 connection(s)
I20260924 14:37:52.290161  4175 acceptor_pool.cc:254] collecting diagnostics on the listening RPC socket 0.0.0.0:43919 every 8 connection(s)
I20260924 14:37:52.316686  4178 rpc-test-base.h:222] got call: sleep_micros: 3000000 deferred: true
I20260924 14:37:55.321117  4178 rpcz_store.cc:275] Call kudu.rpc.GenericCalculatorService.Sleep from 127.0.0.1:50482 (request call id 0) took 3004 ms. Trace:
I20260924 14:37:55.321452  4178 rpcz_store.cc:276] 0924 14:37:52.316429 (+     0us) service_pool.cc:170] Inserting onto call queue
0924 14:37:52.316533 (+   104us) service_pool.cc:227] Handling call
0924 14:37:55.321055 (+3004522us) inbound_call.cc:173] Queueing success response
Metrics: {}
[       OK ] Parameters/TestRpc.TestCallLongerThanKeepalive/SSL_TCP (3061 ms)
[ RUN      ] Parameters/TestRpc.TestRpcSidecar/SSL_TCP
I20260924 14:37:55.360147  4199 acceptor_pool.cc:254] collecting diagnostics on the listening RPC socket 0.0.0.0:36313 every 8 connection(s)
I20260924 14:37:55.360877  4200 acceptor_pool.cc:254] collecting diagnostics on the listening RPC socket 0.0.0.0:36313 every 8 connection(s)
[       OK ] Parameters/TestRpc.TestRpcSidecar/SSL_TCP (536 ms)
[ RUN      ] Parameters/TestRpc.TestRpcSidecarLimits/SSL_TCP
I20260924 14:38:13.662307  4226 acceptor_pool.cc:254] collecting diagnostics on the listening RPC socket 0.0.0.0:42823 every 8 connection(s)
I20260924 14:38:13.663141  4227 acceptor_pool.cc:254] collecting diagnostics on the listening RPC socket 0.0.0.0:42823 every 8 connection(s)
W20260924 14:38:13.678493  3966 serialization.cc:72] Serialized kudu.rpc_test.PushStringsRequestPB (2147483654 bytes) is larger than the maximum configured RPC message size (52428800 bytes). Sending anyway, but peer may reject the data.
W20260924 14:38:13.690791  4224 connection.cc:535] server connection from 127.0.0.1:37332 recv error: Network error: RPC frame had a length of 2147483714, but we only support messages up to 52428800 bytes long.
W20260924 14:38:13.691264  4224 connection.cc:158] shutting down server connection from 127.0.0.1:37332 with pending inbound data: 4/2147483714 bytes received; last active 0 ns ago: status Network error: RPC frame had a length of 2147483714, but we only support messages up to 52428800 bytes long.
W20260924 14:38:13.692332  4239 connection.cc:698] client connection to 0.0.0.0:42823 send error: Network error: failed to write to TLS socket: Connection reset by peer
W20260924 14:38:13.693007  4239 connection.cc:196] Error closing socket: Network error: TlsSocket::Close: Success
[       OK ] Parameters/TestRpc.TestRpcSidecarLimits/SSL_TCP (18456 ms)
[ RUN      ] Parameters/TestRpc.TestCallTimeoutDoesntAffectNegotiation/SSL_TCP
I20260924 14:38:14.343448  4251 acceptor_pool.cc:254] collecting diagnostics on the listening RPC socket 0.0.0.0:35037 every 8 connection(s)
I20260924 14:38:14.344214  4252 acceptor_pool.cc:254] collecting diagnostics on the listening RPC socket 0.0.0.0:35037 every 8 connection(s)
W20260924 14:38:14.363306  4247 negotiation.cc:266] Injecting 500ms delay in negotiation
I20260924 14:38:14.412983  3966 rpc-test-base.h:595] status: Timed out: connection negotiation to 0.0.0.0:35037 for RPC Sleep timed out after 0.050s (ON_OUTBOUND_QUEUE), seconds elapsed: 0.0506692
[       OK ] Parameters/TestRpc.TestCallTimeoutDoesntAffectNegotiation/SSL_TCP (556 ms)
[ RUN      ] Parameters/TestRpc.TestRpcHandlerLatencyMetric/SSL_TCP
I20260924 14:38:14.918318  4276 acceptor_pool.cc:254] collecting diagnostics on the listening RPC socket 0.0.0.0:46801 every 8 connection(s)
I20260924 14:38:14.919134  4277 acceptor_pool.cc:254] collecting diagnostics on the listening RPC socket 0.0.0.0:46801 every 8 connection(s)
I20260924 14:38:14.971554  3966 rpc-test.cc:1236] Sleep() min lat: 21658
I20260924 14:38:14.971760  3966 rpc-test.cc:1237] Sleep() mean lat: 21658
I20260924 14:38:14.971889  3966 rpc-test.cc:1238] Sleep() max lat: 21658
I20260924 14:38:14.972012  3966 rpc-test.cc:1239] Sleep() #calls: 1
[       OK ] Parameters/TestRpc.TestRpcHandlerLatencyMetric/SSL_TCP (99 ms)
[ RUN      ] Parameters/TestRpc.TimedOutOnResponseMetricServiceQueue/SSL_TCP
I20260924 14:38:14.997795  4303 acceptor_pool.cc:254] collecting diagnostics on the listening RPC socket 0.0.0.0:33557 every 8 connection(s)
I20260924 14:38:14.998728  4304 acceptor_pool.cc:254] collecting diagnostics on the listening RPC socket 0.0.0.0:33557 every 8 connection(s)
W20260924 14:38:15.068174  4305 rpcz_store.cc:267] Call kudu.rpc_test.CalculatorService.Sleep from 127.0.0.1:47524 (request call id 2) took 20 ms (client timeout 20 ms). Trace:
W20260924 14:38:15.068523  4305 rpcz_store.cc:269] 0924 14:38:15.047667 (+     0us) service_pool.cc:170] Inserting onto call queue
0924 14:38:15.068037 (+ 20370us) service_pool.cc:214] Skipping call since client already timed out
0924 14:38:15.068123 (+    86us) inbound_call.cc:173] Queueing failure response
Metrics: {}
[       OK ] Parameters/TestRpc.TimedOutOnResponseMetricServiceQueue/SSL_TCP (96 ms)
[ RUN      ] Parameters/TestRpc.RpcPendingConnectionsMetric/SSL_TCP
I20260924 14:38:15.086371  4326 acceptor_pool.cc:254] collecting diagnostics on the listening RPC socket 0.0.0.0:39245 every 8 connection(s)
I20260924 14:38:15.087146  4327 acceptor_pool.cc:254] collecting diagnostics on the listening RPC socket 0.0.0.0:39245 every 8 connection(s)
W20260924 14:38:15.092428  4322 negotiation.cc:337] Failed RPC negotiation. Trace:
0924 14:38:15.091164 (+     0us) reactor.cc:625] Submitting negotiation task for server connection from 127.0.0.1:34644 (local address 127.0.0.1:39245)
0924 14:38:15.091610 (+   446us) server_negotiation.cc:206] Beginning negotiation
0924 14:38:15.091628 (+    18us) server_negotiation.cc:399] Waiting for connection header
0924 14:38:15.091873 (+   245us) negotiation.cc:327] Negotiation complete: Network error: Server connection negotiation failed: server connection from 127.0.0.1:34644: BlockingRecv error: recv got EOF from 127.0.0.1:34644 (error 108)
Metrics: {"server-negotiator.queue_time_us":130}
[       OK ] Parameters/TestRpc.RpcPendingConnectionsMetric/SSL_TCP (30 ms)
[ RUN      ] Parameters/TestRpc.TestRpcContextClientDeadline/SSL_TCP
I20260924 14:38:15.129982  4342 acceptor_pool.cc:254] collecting diagnostics on the listening RPC socket 0.0.0.0:36109 every 8 connection(s)
I20260924 14:38:15.130764  4343 acceptor_pool.cc:254] collecting diagnostics on the listening RPC socket 0.0.0.0:36109 every 8 connection(s)
[       OK ] Parameters/TestRpc.TestRpcContextClientDeadline/SSL_TCP (88 ms)
[ RUN      ] Parameters/TestRpc.TestApplicationFeatureFlagUnsupportedServer/SSL_TCP
I20260924 14:38:15.225944  4367 acceptor_pool.cc:254] collecting diagnostics on the listening RPC socket 0.0.0.0:43803 every 8 connection(s)
I20260924 14:38:15.226727  4368 acceptor_pool.cc:254] collecting diagnostics on the listening RPC socket 0.0.0.0:43803 every 8 connection(s)
[       OK ] Parameters/TestRpc.TestApplicationFeatureFlagUnsupportedServer/SSL_TCP (72 ms)
[ RUN      ] Parameters/TestRpc.TestCancellationAsync/SSL_TCP
I20260924 14:38:15.291546  4392 acceptor_pool.cc:254] collecting diagnostics on the listening RPC socket 0.0.0.0:37649 every 8 connection(s)
I20260924 14:38:15.292341  4393 acceptor_pool.cc:254] collecting diagnostics on the listening RPC socket 0.0.0.0:37649 every 8 connection(s)
I20260924 14:38:15.295473  3966 rpc-test.cc:1716] Connecting to 0.0.0.0:37649
I20260924 14:38:15.313289  3966 test_util.cc:268] Using random seed: -1932743822
I20260924 14:38:15.547456  4396 rpc-test-base.h:240] got call: sleep_micros: 500 pattern: 4294967295 num_repetitions: 2097152 sidecar_idx: 0
I20260924 14:38:15.717296  4395 rpc-test-base.h:240] got call: sleep_micros: 500 pattern: 4294967295 num_repetitions: 2097152 sidecar_idx: 0
I20260924 14:38:15.901319  4396 rpc-test-base.h:240] got call: sleep_micros: 500 pattern: 4294967295 num_repetitions: 2097152 sidecar_idx: 0
I20260924 14:38:16.094621  4395 rpc-test-base.h:240] got call: sleep_micros: 500 pattern: 4294967295 num_repetitions: 2097152 sidecar_idx: 0
I20260924 14:38:16.283597  4396 rpc-test-base.h:240] got call: sleep_micros: 500 pattern: 4294967295 num_repetitions: 2097152 sidecar_idx: 0
I20260924 14:38:16.471617  4396 rpc-test-base.h:240] got call: sleep_micros: 500 pattern: 4294967295 num_repetitions: 2097152 sidecar_idx: 0
I20260924 14:38:16.652436  4396 rpc-test-base.h:240] got call: sleep_micros: 500 pattern: 4294967295 num_repetitions: 2097152 sidecar_idx: 0
I20260924 14:38:16.835145  4396 rpc-test-base.h:240] got call: sleep_micros: 500 pattern: 4294967295 num_repetitions: 2097152 sidecar_idx: 0
W20260924 14:38:16.993288  4389 connection.cc:196] Error closing socket: Network error: TlsSocket::Close: Broken pipe
W20260924 14:38:16.993832  4389 connection.cc:441] server connection from 127.0.0.1:57274 torn down before Call kudu.rpc.GenericCalculatorService.SleepWithSidecar from 127.0.0.1:57274 (request call id 8) could send its response
[       OK ] Parameters/TestRpc.TestCancellationAsync/SSL_TCP (1737 ms)
[ RUN      ] Parameters/TestRpc.TestPerformanceBySocketType/SSL_TCP
I20260924 14:38:17.095548  4418 acceptor_pool.cc:254] collecting diagnostics on the listening RPC socket 0.0.0.0:36511 every 8 connection(s)
I20260924 14:38:17.096292  4419 acceptor_pool.cc:254] collecting diagnostics on the listening RPC socket 0.0.0.0:36511 every 8 connection(s)
I20260924 14:38:17.099622  3966 rpc-test.cc:1846] Connecting to 0.0.0.0:36511
I20260924 14:38:36.694264  3966 rpc-test.cc:1859] Sending 1024MB via ssl-enabled tcp socket: real 19.571s	user 16.756s	sys 11.091s
I20260924 14:38:55.947533  3966 rpc-test.cc:1859] Sending 1024MB via ssl-enabled tcp socket: real 19.253s	user 16.345s	sys 10.908s
I20260924 14:39:15.344444  3966 rpc-test.cc:1859] Sending 1024MB via ssl-enabled tcp socket: real 19.396s	user 16.690s	sys 10.888s
I20260924 14:39:34.676723  3966 rpc-test.cc:1859] Sending 1024MB via ssl-enabled tcp socket: real 19.332s	user 16.487s	sys 10.840s
I20260924 14:39:53.975090  3966 rpc-test.cc:1859] Sending 1024MB via ssl-enabled tcp socket: real 19.298s	user 16.511s	sys 10.804s
[       OK ] Parameters/TestRpc.TestPerformanceBySocketType/SSL_TCP (96989 ms)
[----------] 20 tests from Parameters/TestRpc (242671 ms total)

[----------] 1 test from Parameters/TestRpcSocketTxRxQueue
[ RUN      ] Parameters/TestRpcSocketTxRxQueue.OverCapacity/0
W20260924 14:39:54.443889  4445 negotiation.cc:337] Failed RPC negotiation. Trace:
0924 14:39:54.003877 (+     0us) reactor.cc:625] Submitting negotiation task for client connection to 0.0.0.0:32923 (local address 127.0.0.1:53660)
0924 14:39:54.004607 (+   730us) negotiation.cc:107] Waiting for socket to connect
0924 14:39:54.004661 (+    54us) client_negotiation.cc:174] Beginning negotiation
0924 14:39:54.005466 (+   805us) client_negotiation.cc:252] Sending NEGOTIATE NegotiatePB request
0924 14:39:54.442047 (+436581us) negotiation.cc:327] Negotiation complete: Network error: Client connection negotiation failed: client connection to 0.0.0.0:32923: BlockingRecv error: recv error from unknown peer: Transport endpoint is not connected (error 107)
Metrics: {"client-negotiator.queue_time_us":157}
W20260924 14:39:54.445483  4454 negotiation.cc:337] Failed RPC negotiation. Trace:
0924 14:39:54.011298 (+     0us) reactor.cc:625] Submitting negotiation task for client connection to 0.0.0.0:32923 (local address 127.0.0.1:53674)
0924 14:39:54.011889 (+   591us) negotiation.cc:107] Waiting for socket to connect
0924 14:39:54.011919 (+    30us) client_negotiation.cc:174] Beginning negotiation
0924 14:39:54.012152 (+   233us) client_negotiation.cc:252] Sending NEGOTIATE NegotiatePB request
0924 14:39:54.442157 (+430005us) negotiation.cc:327] Negotiation complete: Network error: Client connection negotiation failed: client connection to 0.0.0.0:32923: BlockingRecv error: recv error from unknown peer: Transport endpoint is not connected (error 107)
Metrics: {"client-negotiator.queue_time_us":163}
W20260924 14:39:54.445710  4463 negotiation.cc:337] Failed RPC negotiation. Trace:
0924 14:39:54.019450 (+     0us) reactor.cc:625] Submitting negotiation task for client connection to 0.0.0.0:32923 (local address 127.0.0.1:53678)
0924 14:39:54.020064 (+   614us) negotiation.cc:107] Waiting for socket to connect
0924 14:39:54.020095 (+    31us) client_negotiation.cc:174] Beginning negotiation
0924 14:39:54.020290 (+   195us) client_negotiation.cc:252] Sending NEGOTIATE NegotiatePB request
0924 14:39:54.442208 (+421918us) negotiation.cc:327] Negotiation complete: Network error: Client connection negotiation failed: client connection to 0.0.0.0:32923: BlockingRecv error: recv error from unknown peer: Transport endpoint is not connected (error 107)
Metrics: {"client-negotiator.queue_time_us":175}
W20260924 14:39:54.445962  4490 negotiation.cc:337] Failed RPC negotiation. Trace:
0924 14:39:54.060416 (+     0us) reactor.cc:625] Submitting negotiation task for client connection to 0.0.0.0:32923 (local address 127.0.0.1:53704)
0924 14:39:54.061005 (+   589us) negotiation.cc:107] Waiting for socket to connect
0924 14:39:54.061037 (+    32us) client_negotiation.cc:174] Beginning negotiation
0924 14:39:54.061250 (+   213us) client_negotiation.cc:252] Sending NEGOTIATE NegotiatePB request
0924 14:39:54.442942 (+381692us) negotiation.cc:327] Negotiation complete: Network error: Client connection negotiation failed: client connection to 0.0.0.0:32923: BlockingRecv error: recv error from unknown peer: Transport endpoint is not connected (error 107)
Metrics: {"client-negotiator.queue_time_us":161}
W20260924 14:39:54.446636  4472 negotiation.cc:337] Failed RPC negotiation. Trace:
0924 14:39:54.033455 (+     0us) reactor.cc:625] Submitting negotiation task for client connection to 0.0.0.0:32923 (local address 127.0.0.1:53686)
0924 14:39:54.034070 (+   615us) negotiation.cc:107] Waiting for socket to connect
0924 14:39:54.034101 (+    31us) client_negotiation.cc:174] Beginning negotiation
0924 14:39:54.034295 (+   194us) client_negotiation.cc:252] Sending NEGOTIATE NegotiatePB request
0924 14:39:54.442063 (+407768us) negotiation.cc:327] Negotiation complete: Network error: Client connection negotiation failed: client connection to 0.0.0.0:32923: BlockingRecv error: recv error from unknown peer: Transport endpoint is not connected (error 107)
Metrics: {"client-negotiator.queue_time_us":183}
W20260924 14:39:54.446391  4481 negotiation.cc:337] Failed RPC negotiation. Trace:
0924 14:39:54.047316 (+     0us) reactor.cc:625] Submitting negotiation task for client connection to 0.0.0.0:32923 (local address 127.0.0.1:53688)
0924 14:39:54.047882 (+   566us) negotiation.cc:107] Waiting for socket to connect
0924 14:39:54.047913 (+    31us) client_negotiation.cc:174] Beginning negotiation
0924 14:39:54.048113 (+   200us) client_negotiation.cc:252] Sending NEGOTIATE NegotiatePB request
0924 14:39:54.442860 (+394747us) negotiation.cc:327] Negotiation complete: Network error: Client connection negotiation failed: client connection to 0.0.0.0:32923: BlockingRecv error: recv error from unknown peer: Transport endpoint is not connected (error 107)
Metrics: {"client-negotiator.queue_time_us":164}
[       OK ] Parameters/TestRpcSocketTxRxQueue.OverCapacity/0 (1258 ms)
[----------] 1 test from Parameters/TestRpcSocketTxRxQueue (1258 ms total)

[----------] Global test environment tear-down
[==========] 21 tests from 2 test suites ran. (243931 ms total)
[  PASSED  ] 20 tests.
[  FAILED  ] 1 test, listed below:
[  FAILED  ] Parameters/TestRpc.TestCallWithChainCertAndChainCA/SSL_TCP, where GetParam() = (true, false)

 1 FAILED TEST