Diagnosed failure

Parameters/TestRpc.TestCallWithChainCertAndChainCA/SSL_TCP: /data0/somelongdirectorytoavoidrpathissues/src/kudu/src/kudu/rpc/rpc-test.cc:270: Failure
Failed
Bad status: Runtime error: could not verify certificate chain (error with cert: subject=CN = localhost, ST = sadfjas, C = AS, emailAddress = sdflkdsajf, O = lskdfjlsad, OU = sldfkja, issuer=C = AS, ST = ASDfkjdhf, L = lskdjf, O = saldfja, OU = skdjf, CN = localhost, emailAddress = sadjflkadsj): : certificate has expired
Google Test trace:
/data0/somelongdirectorytoavoidrpathissues/src/kudu/src/kudu/rpc/rpc-test.cc:267: Connecting to 0.0.0.0:35755
I20260926 17:43:01.489777   795 test_util.cc:175] -----------------------------------------------
I20260926 17:43:01.489862   795 test_util.cc:176] Had fatal failures, leaving test files at /tmp/dist-test-task1jiQal/test-tmp/rpc-test.5.Parameters_TestRpc.TestCallWithChainCertAndChainCA_SSL_TCP.1790444581419776-795-0

Full log

Note: This is test shard 6 of 8.
[==========] Running 21 tests from 2 test suites.
[----------] Global test environment set-up.
[----------] 20 tests from Parameters/TestRpc
[ RUN      ] Parameters/TestRpc.TestMessengerCreateDestroy/SSL_TCP
WARNING: Logging before InitGoogleLogging() is written to STDERR
I20260926 17:43:01.452735   795 rpc-test.cc:169] started messenger TestCreateDestroy
[       OK ] Parameters/TestRpc.TestMessengerCreateDestroy/SSL_TCP (27 ms)
[ RUN      ] Parameters/TestRpc.TestNegotiationDeadlock/SSL_TCP
I20260926 17:43:01.463594   816 acceptor_pool.cc:254] collecting diagnostics on the listening RPC socket 0.0.0.0:41181 every 8 connection(s)
I20260926 17:43:01.463680   815 acceptor_pool.cc:254] collecting diagnostics on the listening RPC socket 0.0.0.0:41181 every 8 connection(s)
[       OK ] Parameters/TestRpc.TestNegotiationDeadlock/SSL_TCP (20 ms)
[ RUN      ] Parameters/TestRpc.TestCallWithChainCertAndChainCA/SSL_TCP
I20260926 17:43:01.484537   831 acceptor_pool.cc:254] collecting diagnostics on the listening RPC socket 0.0.0.0:35755 every 8 connection(s)
I20260926 17:43:01.484596   832 acceptor_pool.cc:254] collecting diagnostics on the listening RPC socket 0.0.0.0:35755 every 8 connection(s)
/data0/somelongdirectorytoavoidrpathissues/src/kudu/src/kudu/rpc/rpc-test.cc:270: Failure
Failed
Bad status: Runtime error: could not verify certificate chain (error with cert: subject=CN = localhost, ST = sadfjas, C = AS, emailAddress = sdflkdsajf, O = lskdfjlsad, OU = sldfkja, issuer=C = AS, ST = ASDfkjdhf, L = lskdjf, O = saldfja, OU = skdjf, CN = localhost, emailAddress = sadjflkadsj): : certificate has expired
Google Test trace:
/data0/somelongdirectorytoavoidrpathissues/src/kudu/src/kudu/rpc/rpc-test.cc:267: Connecting to 0.0.0.0:35755
I20260926 17:43:01.489777   795 test_util.cc:175] -----------------------------------------------
I20260926 17:43:01.489862   795 test_util.cc:176] Had fatal failures, leaving test files at /tmp/dist-test-task1jiQal/test-tmp/rpc-test.5.Parameters_TestRpc.TestCallWithChainCertAndChainCA_SSL_TCP.1790444581419776-795-0
[  FAILED  ] Parameters/TestRpc.TestCallWithChainCertAndChainCA/SSL_TCP, where GetParam() = (true, false) (14 ms)
[ RUN      ] Parameters/TestRpc.TestCallWithPasswordProtectedKey/SSL_TCP
I20260926 17:43:01.498831   856 acceptor_pool.cc:254] collecting diagnostics on the listening RPC socket 0.0.0.0:43633 every 8 connection(s)
I20260926 17:43:01.498883   857 acceptor_pool.cc:254] collecting diagnostics on the listening RPC socket 0.0.0.0:43633 every 8 connection(s)
[       OK ] Parameters/TestRpc.TestCallWithPasswordProtectedKey/SSL_TCP (24 ms)
[ RUN      ] Parameters/TestRpc.TestCallToBadServer/SSL_TCP
I20260926 17:43:01.536980   795 rpc-test.cc:394] Status: Network error: Client connection negotiation failed: client connection to 0.0.0.0:0: connect: Connection refused (error 111)
I20260926 17:43:01.537490   795 rpc-test.cc:394] Status: Network error: Client connection negotiation failed: client connection to 0.0.0.0:0: connect: Connection refused (error 111)
I20260926 17:43:01.537933   795 rpc-test.cc:394] Status: Network error: Client connection negotiation failed: client connection to 0.0.0.0:0: connect: Connection refused (error 111)
I20260926 17:43:01.538324   795 rpc-test.cc:394] Status: Network error: Client connection negotiation failed: client connection to 0.0.0.0:0: connect: Connection refused (error 111)
I20260926 17:43:01.538745   795 rpc-test.cc:394] Status: Network error: Client connection negotiation failed: client connection to 0.0.0.0:0: connect: Connection refused (error 111)
[       OK ] Parameters/TestRpc.TestCallToBadServer/SSL_TCP (24 ms)
[ RUN      ] Parameters/TestRpc.TestWrongService/SSL_TCP
I20260926 17:43:01.557250   891 acceptor_pool.cc:254] collecting diagnostics on the listening RPC socket 0.0.0.0:45925 every 8 connection(s)
I20260926 17:43:01.557322   892 acceptor_pool.cc:254] collecting diagnostics on the listening RPC socket 0.0.0.0:45925 every 8 connection(s)
I20260926 17:43:01.584764   888 messenger.cc:345] service WrongServiceName not registered on TestServer
[       OK ] Parameters/TestRpc.TestWrongService/SSL_TCP (47 ms)
[ RUN      ] Parameters/TestRpc.TestConnectionKeepalive/SSL_TCP
I20260926 17:43:01.608136   914 acceptor_pool.cc:254] collecting diagnostics on the listening RPC socket 0.0.0.0:39585 every 8 connection(s)
I20260926 17:43:01.608163   915 acceptor_pool.cc:254] collecting diagnostics on the listening RPC socket 0.0.0.0:39585 every 8 connection(s)
I20260926 17:43:01.608434   795 rpc-test.cc:488] Connecting to 0.0.0.0:39585
[       OK ] Parameters/TestRpc.TestConnectionKeepalive/SSL_TCP (1062 ms)
[ RUN      ] Parameters/TestRpc.TestClientConnectionMetrics/SSL_TCP
I20260926 17:43:02.658363   939 acceptor_pool.cc:254] collecting diagnostics on the listening RPC socket 0.0.0.0:35571 every 8 connection(s)
I20260926 17:43:02.658524   940 acceptor_pool.cc:254] collecting diagnostics on the listening RPC socket 0.0.0.0:35571 every 8 connection(s)
I20260926 17:43:02.658763   795 rpc-test.cc:569] Connecting to 0.0.0.0:35571
[       OK ] Parameters/TestRpc.TestClientConnectionMetrics/SSL_TCP (13289 ms)
[ RUN      ] Parameters/TestRpc.TestCredentialsPolicy/SSL_TCP
I20260926 17:43:15.949923   962 acceptor_pool.cc:254] collecting diagnostics on the listening RPC socket 0.0.0.0:43199 every 8 connection(s)
I20260926 17:43:15.950084   963 acceptor_pool.cc:254] collecting diagnostics on the listening RPC socket 0.0.0.0:43199 every 8 connection(s)
I20260926 17:43:15.950338   795 rpc-test.cc:700] Connecting to 0.0.0.0:43199
[       OK ] Parameters/TestRpc.TestCredentialsPolicy/SSL_TCP (45 ms)
[ RUN      ] Parameters/TestRpc.TestCallLongerThanKeepalive/SSL_TCP
I20260926 17:43:16.005806   987 acceptor_pool.cc:254] collecting diagnostics on the listening RPC socket 0.0.0.0:40757 every 8 connection(s)
I20260926 17:43:16.005822   988 acceptor_pool.cc:254] collecting diagnostics on the listening RPC socket 0.0.0.0:40757 every 8 connection(s)
I20260926 17:43:16.017750   991 rpc-test-base.h:222] got call: sleep_micros: 3000000 deferred: true
I20260926 17:43:19.018687   991 rpcz_store.cc:275] Call kudu.rpc.GenericCalculatorService.Sleep from 127.0.0.1:33298 (request call id 0) took 3001 ms. Trace:
I20260926 17:43:19.018803   991 rpcz_store.cc:276] 0926 17:43:16.017660 (+     0us) service_pool.cc:170] Inserting onto call queue
0926 17:43:16.017715 (+    55us) service_pool.cc:227] Handling call
0926 17:43:19.018665 (+3000950us) inbound_call.cc:173] Queueing success response
Metrics: {}
[       OK ] Parameters/TestRpc.TestCallLongerThanKeepalive/SSL_TCP (3039 ms)
[ RUN      ] Parameters/TestRpc.TestRpcSidecar/SSL_TCP
I20260926 17:43:19.036065  1012 acceptor_pool.cc:254] collecting diagnostics on the listening RPC socket 0.0.0.0:36585 every 8 connection(s)
I20260926 17:43:19.036199  1013 acceptor_pool.cc:254] collecting diagnostics on the listening RPC socket 0.0.0.0:36585 every 8 connection(s)
[       OK ] Parameters/TestRpc.TestRpcSidecar/SSL_TCP (77 ms)
[ RUN      ] Parameters/TestRpc.TestRpcSidecarLimits/SSL_TCP
I20260926 17:43:20.942847  1037 acceptor_pool.cc:254] collecting diagnostics on the listening RPC socket 0.0.0.0:39645 every 8 connection(s)
I20260926 17:43:20.942862  1038 acceptor_pool.cc:254] collecting diagnostics on the listening RPC socket 0.0.0.0:39645 every 8 connection(s)
W20260926 17:43:20.956243   795 serialization.cc:72] Serialized kudu.rpc_test.PushStringsRequestPB (2147483654 bytes) is larger than the maximum configured RPC message size (52428800 bytes). Sending anyway, but peer may reject the data.
W20260926 17:43:20.960651  1035 connection.cc:535] server connection from 127.0.0.1:37694 recv error: Network error: RPC frame had a length of 2147483714, but we only support messages up to 52428800 bytes long.
W20260926 17:43:20.960743  1035 connection.cc:158] shutting down server connection from 127.0.0.1:37694 with pending inbound data: 4/2147483714 bytes received; last active 0 ns ago: status Network error: RPC frame had a length of 2147483714, but we only support messages up to 52428800 bytes long.
W20260926 17:43:20.961067  1050 connection.cc:196] Error closing socket: Network error: TlsSocket::Close: Connection reset by peer
I20260926 17:43:20.969548  1062 acceptor_pool.cc:254] collecting diagnostics on the listening RPC socket 0.0.0.0:43909 every 8 connection(s)
I20260926 17:43:20.969597  1063 acceptor_pool.cc:254] collecting diagnostics on the listening RPC socket 0.0.0.0:43909 every 8 connection(s)
W20260926 17:43:25.381271  1060 connection.cc:577] server connection from 127.0.0.1:34074: received bad data: 'Corruption: Invalid packet: message had a length of 2147483710, but we only support messages up to 2147483647 bytes
'
[       OK ] Parameters/TestRpc.TestRpcSidecarLimits/SSL_TCP (6281 ms)
[ RUN      ] Parameters/TestRpc.TestCallTimeoutDoesntAffectNegotiation/SSL_TCP
I20260926 17:43:25.400432  1087 acceptor_pool.cc:254] collecting diagnostics on the listening RPC socket 0.0.0.0:35895 every 8 connection(s)
I20260926 17:43:25.400454  1088 acceptor_pool.cc:254] collecting diagnostics on the listening RPC socket 0.0.0.0:35895 every 8 connection(s)
W20260926 17:43:25.413795  1083 negotiation.cc:266] Injecting 500ms delay in negotiation
I20260926 17:43:25.464139   795 rpc-test-base.h:595] status: Timed out: connection negotiation to 0.0.0.0:35895 for RPC Sleep timed out after 0.050s (ON_OUTBOUND_QUEUE), seconds elapsed: 0.0509133
[       OK ] Parameters/TestRpc.TestCallTimeoutDoesntAffectNegotiation/SSL_TCP (536 ms)
[ RUN      ] Parameters/TestRpc.TestRpcHandlerLatencyMetric/SSL_TCP
I20260926 17:43:25.936364  1112 acceptor_pool.cc:254] collecting diagnostics on the listening RPC socket 0.0.0.0:45955 every 8 connection(s)
I20260926 17:43:25.936389  1113 acceptor_pool.cc:254] collecting diagnostics on the listening RPC socket 0.0.0.0:45955 every 8 connection(s)
I20260926 17:43:25.970678   795 rpc-test.cc:1236] Sleep() min lat: 20394
I20260926 17:43:25.970753   795 rpc-test.cc:1237] Sleep() mean lat: 20394
I20260926 17:43:25.970782   795 rpc-test.cc:1238] Sleep() max lat: 20394
I20260926 17:43:25.970795   795 rpc-test.cc:1239] Sleep() #calls: 1
[       OK ] Parameters/TestRpc.TestRpcHandlerLatencyMetric/SSL_TCP (52 ms)
[ RUN      ] Parameters/TestRpc.TimedOutOnResponseMetricServiceQueue/SSL_TCP
I20260926 17:43:26.007395  1138 acceptor_pool.cc:254] collecting diagnostics on the listening RPC socket 0.0.0.0:41345 every 8 connection(s)
I20260926 17:43:26.007396  1139 acceptor_pool.cc:254] collecting diagnostics on the listening RPC socket 0.0.0.0:41345 every 8 connection(s)
W20260926 17:43:26.078011  1140 rpcz_store.cc:267] Call kudu.rpc_test.CalculatorService.Sleep from 127.0.0.1:34002 (request call id 2) took 20 ms (client timeout 20 ms). Trace:
W20260926 17:43:26.078130  1140 rpcz_store.cc:269] 0926 17:43:26.057635 (+     0us) service_pool.cc:170] Inserting onto call queue
0926 17:43:26.077958 (+ 20323us) service_pool.cc:214] Skipping call since client already timed out
0926 17:43:26.077993 (+    35us) inbound_call.cc:173] Queueing failure response
Metrics: {}
[       OK ] Parameters/TestRpc.TimedOutOnResponseMetricServiceQueue/SSL_TCP (106 ms)
[ RUN      ] Parameters/TestRpc.RpcPendingConnectionsMetric/SSL_TCP
I20260926 17:43:26.082914  1162 acceptor_pool.cc:254] collecting diagnostics on the listening RPC socket 0.0.0.0:39407 every 8 connection(s)
I20260926 17:43:26.083009  1161 acceptor_pool.cc:254] collecting diagnostics on the listening RPC socket 0.0.0.0:39407 every 8 connection(s)
W20260926 17:43:26.093210  1157 negotiation.cc:337] Failed RPC negotiation. Trace:
0926 17:43:26.092698 (+     0us) reactor.cc:625] Submitting negotiation task for server connection from 127.0.0.1:48766 (local address 127.0.0.1:39407)
0926 17:43:26.092847 (+   149us) server_negotiation.cc:206] Beginning negotiation
0926 17:43:26.092859 (+    12us) server_negotiation.cc:399] Waiting for connection header
0926 17:43:26.092952 (+    93us) negotiation.cc:327] Negotiation complete: Network error: Server connection negotiation failed: server connection from 127.0.0.1:48766: BlockingRecv error: recv got EOF from 127.0.0.1:48766 (error 108)
Metrics: {"server-negotiator.queue_time_us":50}
[       OK ] Parameters/TestRpc.RpcPendingConnectionsMetric/SSL_TCP (23 ms)
[ RUN      ] Parameters/TestRpc.TestRpcContextClientDeadline/SSL_TCP
I20260926 17:43:26.123404  1177 acceptor_pool.cc:254] collecting diagnostics on the listening RPC socket 0.0.0.0:37597 every 8 connection(s)
I20260926 17:43:26.123411  1178 acceptor_pool.cc:254] collecting diagnostics on the listening RPC socket 0.0.0.0:37597 every 8 connection(s)
[       OK ] Parameters/TestRpc.TestRpcContextClientDeadline/SSL_TCP (57 ms)
[ RUN      ] Parameters/TestRpc.TestApplicationFeatureFlagUnsupportedServer/SSL_TCP
I20260926 17:43:26.179291  1202 acceptor_pool.cc:254] collecting diagnostics on the listening RPC socket 0.0.0.0:45233 every 8 connection(s)
I20260926 17:43:26.179317  1203 acceptor_pool.cc:254] collecting diagnostics on the listening RPC socket 0.0.0.0:45233 every 8 connection(s)
[       OK ] Parameters/TestRpc.TestApplicationFeatureFlagUnsupportedServer/SSL_TCP (63 ms)
[ RUN      ] Parameters/TestRpc.TestCancellationAsync/SSL_TCP
I20260926 17:43:26.259218  1227 acceptor_pool.cc:254] collecting diagnostics on the listening RPC socket 0.0.0.0:34723 every 8 connection(s)
I20260926 17:43:26.259255  1228 acceptor_pool.cc:254] collecting diagnostics on the listening RPC socket 0.0.0.0:34723 every 8 connection(s)
I20260926 17:43:26.259542   795 rpc-test.cc:1716] Connecting to 0.0.0.0:34723
I20260926 17:43:26.266502   795 test_util.cc:268] Using random seed: 1589582979
I20260926 17:43:26.294811  1231 rpc-test-base.h:240] got call: sleep_micros: 500 pattern: 4294967295 num_repetitions: 2097152 sidecar_idx: 0
I20260926 17:43:26.317330  1231 rpc-test-base.h:240] got call: sleep_micros: 500 pattern: 4294967295 num_repetitions: 2097152 sidecar_idx: 0
I20260926 17:43:26.338301  1230 rpc-test-base.h:240] got call: sleep_micros: 500 pattern: 4294967295 num_repetitions: 2097152 sidecar_idx: 0
I20260926 17:43:26.355588  1231 rpc-test-base.h:240] got call: sleep_micros: 500 pattern: 4294967295 num_repetitions: 2097152 sidecar_idx: 0
I20260926 17:43:26.376309  1230 rpc-test-base.h:240] got call: sleep_micros: 500 pattern: 4294967295 num_repetitions: 2097152 sidecar_idx: 0
I20260926 17:43:26.394870  1231 rpc-test-base.h:240] got call: sleep_micros: 500 pattern: 4294967295 num_repetitions: 2097152 sidecar_idx: 0
W20260926 17:43:26.412537  1225 connection.cc:196] Error closing socket: Network error: TlsSocket::Close: Broken pipe
W20260926 17:43:26.419389  1225 connection.cc:441] server connection from 127.0.0.1:60530 torn down before Call kudu.rpc.GenericCalculatorService.SleepWithSidecar from 127.0.0.1:60530 (request call id 8) could send its response
[       OK ] Parameters/TestRpc.TestCancellationAsync/SSL_TCP (194 ms)
[ RUN      ] Parameters/TestRpc.TestPerformanceBySocketType/SSL_TCP
I20260926 17:43:26.437162  1252 acceptor_pool.cc:254] collecting diagnostics on the listening RPC socket 0.0.0.0:42379 every 8 connection(s)
I20260926 17:43:26.437172  1253 acceptor_pool.cc:254] collecting diagnostics on the listening RPC socket 0.0.0.0:42379 every 8 connection(s)
I20260926 17:43:26.437510   795 rpc-test.cc:1846] Connecting to 0.0.0.0:42379
I20260926 17:43:28.772707   795 rpc-test.cc:1859] Sending 1024MB via ssl-enabled tcp socket: real 2.329s	user 2.478s	sys 1.605s
I20260926 17:43:31.136472   795 rpc-test.cc:1859] Sending 1024MB via ssl-enabled tcp socket: real 2.364s	user 2.443s	sys 1.667s
I20260926 17:43:33.479070   795 rpc-test.cc:1859] Sending 1024MB via ssl-enabled tcp socket: real 2.342s	user 2.442s	sys 1.670s
I20260926 17:43:35.845597   795 rpc-test.cc:1859] Sending 1024MB via ssl-enabled tcp socket: real 2.366s	user 2.500s	sys 1.650s
I20260926 17:43:38.204267   795 rpc-test.cc:1859] Sending 1024MB via ssl-enabled tcp socket: real 2.359s	user 2.373s	sys 1.759s
[       OK ] Parameters/TestRpc.TestPerformanceBySocketType/SSL_TCP (11785 ms)
[----------] 20 tests from Parameters/TestRpc (36780 ms total)

[----------] 1 test from Parameters/TestRpcSocketTxRxQueue
[ RUN      ] Parameters/TestRpcSocketTxRxQueue.OverCapacity/0
W20260926 17:43:38.476861  1296 negotiation.cc:337] Failed RPC negotiation. Trace:
0926 17:43:38.212400 (+     0us) reactor.cc:625] Submitting negotiation task for client connection to 0.0.0.0:41583 (local address 127.0.0.1:41758)
0926 17:43:38.212522 (+   122us) negotiation.cc:107] Waiting for socket to connect
0926 17:43:38.212534 (+    12us) client_negotiation.cc:174] Beginning negotiation
0926 17:43:38.212657 (+   123us) client_negotiation.cc:252] Sending NEGOTIATE NegotiatePB request
0926 17:43:38.476672 (+264015us) negotiation.cc:327] Negotiation complete: Network error: Client connection negotiation failed: client connection to 0.0.0.0:41583: BlockingRecv error: recv error from unknown peer: Transport endpoint is not connected (error 107)
Metrics: {"client-negotiator.queue_time_us":26}
W20260926 17:43:38.476872  1269 negotiation.cc:337] Failed RPC negotiation. Trace:
0926 17:43:38.208837 (+     0us) reactor.cc:625] Submitting negotiation task for client connection to 0.0.0.0:41583 (local address 127.0.0.1:41726)
0926 17:43:38.208984 (+   147us) negotiation.cc:107] Waiting for socket to connect
0926 17:43:38.208997 (+    13us) client_negotiation.cc:174] Beginning negotiation
0926 17:43:38.209092 (+    95us) client_negotiation.cc:252] Sending NEGOTIATE NegotiatePB request
0926 17:43:38.476684 (+267592us) negotiation.cc:327] Negotiation complete: Network error: Client connection negotiation failed: client connection to 0.0.0.0:41583: BlockingRecv error: recv error from unknown peer: Transport endpoint is not connected (error 107)
Metrics: {"client-negotiator.queue_time_us":50}
W20260926 17:43:38.476893  1287 negotiation.cc:337] Failed RPC negotiation. Trace:
0926 17:43:38.211253 (+     0us) reactor.cc:625] Submitting negotiation task for client connection to 0.0.0.0:41583 (local address 127.0.0.1:41750)
0926 17:43:38.211361 (+   108us) negotiation.cc:107] Waiting for socket to connect
0926 17:43:38.211375 (+    14us) client_negotiation.cc:174] Beginning negotiation
0926 17:43:38.211458 (+    83us) client_negotiation.cc:252] Sending NEGOTIATE NegotiatePB request
0926 17:43:38.476672 (+265214us) negotiation.cc:327] Negotiation complete: Network error: Client connection negotiation failed: client connection to 0.0.0.0:41583: BlockingRecv error: recv error from unknown peer: Transport endpoint is not connected (error 107)
Metrics: {"client-negotiator.queue_time_us":28}
W20260926 17:43:38.477330  1305 negotiation.cc:337] Failed RPC negotiation. Trace:
0926 17:43:38.213494 (+     0us) reactor.cc:625] Submitting negotiation task for client connection to 0.0.0.0:41583 (local address 127.0.0.1:41772)
0926 17:43:38.213656 (+   162us) negotiation.cc:107] Waiting for socket to connect
0926 17:43:38.213668 (+    12us) client_negotiation.cc:174] Beginning negotiation
0926 17:43:38.213753 (+    85us) client_negotiation.cc:252] Sending NEGOTIATE NegotiatePB request
0926 17:43:38.477201 (+263448us) negotiation.cc:327] Negotiation complete: Network error: Client connection negotiation failed: client connection to 0.0.0.0:41583: BlockingRecv error: recv error from unknown peer: Transport endpoint is not connected (error 107)
Metrics: {"client-negotiator.queue_time_us":58}
W20260926 17:43:38.476871  1278 negotiation.cc:337] Failed RPC negotiation. Trace:
0926 17:43:38.210165 (+     0us) reactor.cc:625] Submitting negotiation task for client connection to 0.0.0.0:41583 (local address 127.0.0.1:41738)
0926 17:43:38.210258 (+    93us) negotiation.cc:107] Waiting for socket to connect
0926 17:43:38.210270 (+    12us) client_negotiation.cc:174] Beginning negotiation
0926 17:43:38.210350 (+    80us) client_negotiation.cc:252] Sending NEGOTIATE NegotiatePB request
0926 17:43:38.476673 (+266323us) negotiation.cc:327] Negotiation complete: Network error: Client connection negotiation failed: client connection to 0.0.0.0:41583: BlockingRecv error: recv error from unknown peer: Transport endpoint is not connected (error 107)
Metrics: {"client-negotiator.queue_time_us":24}
W20260926 17:43:38.477617  1314 negotiation.cc:337] Failed RPC negotiation. Trace:
0926 17:43:38.214655 (+     0us) reactor.cc:625] Submitting negotiation task for client connection to 0.0.0.0:41583 (local address 127.0.0.1:41774)
0926 17:43:38.214788 (+   133us) negotiation.cc:107] Waiting for socket to connect
0926 17:43:38.214806 (+    18us) client_negotiation.cc:174] Beginning negotiation
0926 17:43:38.214889 (+    83us) client_negotiation.cc:252] Sending NEGOTIATE NegotiatePB request
0926 17:43:38.477197 (+262308us) negotiation.cc:327] Negotiation complete: Network error: Client connection negotiation failed: client connection to 0.0.0.0:41583: BlockingRecv error: recv error from unknown peer: Transport endpoint is not connected (error 107)
Metrics: {"client-negotiator.queue_time_us":48}
[       OK ] Parameters/TestRpcSocketTxRxQueue.OverCapacity/0 (1039 ms)
[----------] 1 test from Parameters/TestRpcSocketTxRxQueue (1039 ms total)

[----------] Global test environment tear-down
[==========] 21 tests from 2 test suites ran. (37819 ms total)
[  PASSED  ] 20 tests.
[  FAILED  ] 1 test, listed below:
[  FAILED  ] Parameters/TestRpc.TestCallWithChainCertAndChainCA/SSL_TCP, where GetParam() = (true, false)

 1 FAILED TEST