Diagnosed failure
Parameters/TestRpc.TestCallWithChainCertAndChainCA/SSL_UnixSocket: /data0/somelongdirectorytoavoidrpathissues/src/kudu/src/kudu/rpc/rpc-test.cc:270: Failure
Failed
Bad status: Runtime error: could not verify certificate chain (error with cert: subject=CN = localhost, ST = sadfjas, C = AS, emailAddress = sdflkdsajf, O = lskdfjlsad, OU = sldfkja, issuer=C = AS, ST = ASDfkjdhf, L = lskdjf, O = saldfja, OU = skdjf, CN = localhost, emailAddress = sadjflkadsj): : certificate has expired
Google Test trace:
/data0/somelongdirectorytoavoidrpathissues/src/kudu/src/kudu/rpc/rpc-test.cc:267: Connecting to unix:/tmp/dist-test-taskOB6nYK/test-tmp/rpc-test-585b5421bb3c4793a8e08f86f11bad1c.sock
I20260926 13:39:24.260480 1181 test_util.cc:175] -----------------------------------------------
I20260926 13:39:24.260640 1181 test_util.cc:176] Had fatal failures, leaving test files at /tmp/dist-test-taskOB6nYK/test-tmp/rpc-test.6.Parameters_TestRpc.TestCallWithChainCertAndChainCA_SSL_UnixSocket.1790429964133116-1181-0
Full log
Note: This is test shard 7 of 8.
[==========] Running 21 tests from 2 test suites.
[----------] Global test environment set-up.
[----------] 20 tests from Parameters/TestRpc
[ RUN ] Parameters/TestRpc.TestMessengerCreateDestroy/SSL_UnixSocket
WARNING: Logging before InitGoogleLogging() is written to STDERR
I20260926 13:39:24.186156 1181 rpc-test.cc:169] started messenger TestCreateDestroy
[ OK ] Parameters/TestRpc.TestMessengerCreateDestroy/SSL_UnixSocket (37 ms)
[ RUN ] Parameters/TestRpc.TestNegotiationDeadlock/SSL_UnixSocket
I20260926 13:39:24.210212 1201 acceptor_pool.cc:254] collecting diagnostics on the listening RPC socket unix:/tmp/dist-test-taskOB6nYK/test-tmp/rpc-test-57c793da7378468cb1f0757a47840eb9.sock every 8 connection(s)
I20260926 13:39:24.210466 1202 acceptor_pool.cc:254] collecting diagnostics on the listening RPC socket unix:/tmp/dist-test-taskOB6nYK/test-tmp/rpc-test-57c793da7378468cb1f0757a47840eb9.sock every 8 connection(s)
[ OK ] Parameters/TestRpc.TestNegotiationDeadlock/SSL_UnixSocket (41 ms)
[ RUN ] Parameters/TestRpc.TestCallWithChainCertAndChainCA/SSL_UnixSocket
I20260926 13:39:24.248186 1217 acceptor_pool.cc:254] collecting diagnostics on the listening RPC socket unix:/tmp/dist-test-taskOB6nYK/test-tmp/rpc-test-585b5421bb3c4793a8e08f86f11bad1c.sock every 8 connection(s)
I20260926 13:39:24.248497 1218 acceptor_pool.cc:254] collecting diagnostics on the listening RPC socket unix:/tmp/dist-test-taskOB6nYK/test-tmp/rpc-test-585b5421bb3c4793a8e08f86f11bad1c.sock every 8 connection(s)
/data0/somelongdirectorytoavoidrpathissues/src/kudu/src/kudu/rpc/rpc-test.cc:270: Failure
Failed
Bad status: Runtime error: could not verify certificate chain (error with cert: subject=CN = localhost, ST = sadfjas, C = AS, emailAddress = sdflkdsajf, O = lskdfjlsad, OU = sldfkja, issuer=C = AS, ST = ASDfkjdhf, L = lskdjf, O = saldfja, OU = skdjf, CN = localhost, emailAddress = sadjflkadsj): : certificate has expired
Google Test trace:
/data0/somelongdirectorytoavoidrpathissues/src/kudu/src/kudu/rpc/rpc-test.cc:267: Connecting to unix:/tmp/dist-test-taskOB6nYK/test-tmp/rpc-test-585b5421bb3c4793a8e08f86f11bad1c.sock
I20260926 13:39:24.260480 1181 test_util.cc:175] -----------------------------------------------
I20260926 13:39:24.260640 1181 test_util.cc:176] Had fatal failures, leaving test files at /tmp/dist-test-taskOB6nYK/test-tmp/rpc-test.6.Parameters_TestRpc.TestCallWithChainCertAndChainCA_SSL_UnixSocket.1790429964133116-1181-0
[ FAILED ] Parameters/TestRpc.TestCallWithChainCertAndChainCA/SSL_UnixSocket, where GetParam() = (true, true) (29 ms)
[ RUN ] Parameters/TestRpc.TestCallWithPasswordProtectedKey/SSL_UnixSocket
I20260926 13:39:24.279101 1242 acceptor_pool.cc:254] collecting diagnostics on the listening RPC socket unix:/tmp/dist-test-taskOB6nYK/test-tmp/rpc-test-2800d79101604d97b943ef284f6a6545.sock every 8 connection(s)
I20260926 13:39:24.279356 1243 acceptor_pool.cc:254] collecting diagnostics on the listening RPC socket unix:/tmp/dist-test-taskOB6nYK/test-tmp/rpc-test-2800d79101604d97b943ef284f6a6545.sock every 8 connection(s)
W20260926 13:39:24.310294 1239 connection.cc:196] Error closing socket: Network error: TlsSocket::Close: Broken pipe
[ OK ] Parameters/TestRpc.TestCallWithPasswordProtectedKey/SSL_UnixSocket (53 ms)
[ RUN ] Parameters/TestRpc.TestCallToBadServer/SSL_UnixSocket
I20260926 13:39:24.341698 1181 rpc-test.cc:394] Status: Network error: Client connection negotiation failed: client connection to 0.0.0.0:0: connect: Connection refused (error 111)
I20260926 13:39:24.342337 1181 rpc-test.cc:394] Status: Network error: Client connection negotiation failed: client connection to 0.0.0.0:0: connect: Connection refused (error 111)
I20260926 13:39:24.342881 1181 rpc-test.cc:394] Status: Network error: Client connection negotiation failed: client connection to 0.0.0.0:0: connect: Connection refused (error 111)
I20260926 13:39:24.343430 1181 rpc-test.cc:394] Status: Network error: Client connection negotiation failed: client connection to 0.0.0.0:0: connect: Connection refused (error 111)
I20260926 13:39:24.344012 1181 rpc-test.cc:394] Status: Network error: Client connection negotiation failed: client connection to 0.0.0.0:0: connect: Connection refused (error 111)
[ OK ] Parameters/TestRpc.TestCallToBadServer/SSL_UnixSocket (32 ms)
[ RUN ] Parameters/TestRpc.TestWrongService/SSL_UnixSocket
I20260926 13:39:24.361742 1277 acceptor_pool.cc:254] collecting diagnostics on the listening RPC socket unix:/tmp/dist-test-taskOB6nYK/test-tmp/rpc-test-a3381463f9da41c2bf3bba9af3970609.sock every 8 connection(s)
I20260926 13:39:24.361992 1278 acceptor_pool.cc:254] collecting diagnostics on the listening RPC socket unix:/tmp/dist-test-taskOB6nYK/test-tmp/rpc-test-a3381463f9da41c2bf3bba9af3970609.sock every 8 connection(s)
I20260926 13:39:24.384819 1274 messenger.cc:345] service WrongServiceName not registered on TestServer
W20260926 13:39:24.386895 1274 connection.cc:196] Error closing socket: Network error: TlsSocket::Close: Broken pipe
[ OK ] Parameters/TestRpc.TestWrongService/SSL_UnixSocket (44 ms)
[ RUN ] Parameters/TestRpc.TestConnectionKeepalive/SSL_UnixSocket
I20260926 13:39:24.406870 1300 acceptor_pool.cc:254] collecting diagnostics on the listening RPC socket unix:/tmp/dist-test-taskOB6nYK/test-tmp/rpc-test-5a430d8bf918498eadfb2f8cc710abd0.sock every 8 connection(s)
I20260926 13:39:24.407162 1301 acceptor_pool.cc:254] collecting diagnostics on the listening RPC socket unix:/tmp/dist-test-taskOB6nYK/test-tmp/rpc-test-5a430d8bf918498eadfb2f8cc710abd0.sock every 8 connection(s)
I20260926 13:39:24.408073 1181 rpc-test.cc:488] Connecting to unix:/tmp/dist-test-taskOB6nYK/test-tmp/rpc-test-5a430d8bf918498eadfb2f8cc710abd0.sock
W20260926 13:39:24.892742 1313 connection.cc:196] Error closing socket: Network error: TlsSocket::Close: Broken pipe
[ OK ] Parameters/TestRpc.TestConnectionKeepalive/SSL_UnixSocket (1056 ms)
[ RUN ] Parameters/TestRpc.TestClientConnectionMetrics/SSL_UnixSocket
I20260926 13:39:25.468463 1325 acceptor_pool.cc:254] collecting diagnostics on the listening RPC socket unix:/tmp/dist-test-taskOB6nYK/test-tmp/rpc-test-2871777d6bbf4ba891c07371dd1c5157.sock every 8 connection(s)
I20260926 13:39:25.468737 1326 acceptor_pool.cc:254] collecting diagnostics on the listening RPC socket unix:/tmp/dist-test-taskOB6nYK/test-tmp/rpc-test-2871777d6bbf4ba891c07371dd1c5157.sock every 8 connection(s)
I20260926 13:39:25.469583 1181 rpc-test.cc:569] Connecting to unix:/tmp/dist-test-taskOB6nYK/test-tmp/rpc-test-2871777d6bbf4ba891c07371dd1c5157.sock
[ OK ] Parameters/TestRpc.TestClientConnectionMetrics/SSL_UnixSocket (21793 ms)
[ RUN ] Parameters/TestRpc.TestCredentialsPolicy/SSL_UnixSocket
I20260926 13:39:47.257450 1348 acceptor_pool.cc:254] collecting diagnostics on the listening RPC socket unix:/tmp/dist-test-taskOB6nYK/test-tmp/rpc-test-a4adbc1474c84f0fa36ea52833f03a89.sock every 8 connection(s)
I20260926 13:39:47.257695 1349 acceptor_pool.cc:254] collecting diagnostics on the listening RPC socket unix:/tmp/dist-test-taskOB6nYK/test-tmp/rpc-test-a4adbc1474c84f0fa36ea52833f03a89.sock every 8 connection(s)
I20260926 13:39:47.258653 1181 rpc-test.cc:700] Connecting to unix:/tmp/dist-test-taskOB6nYK/test-tmp/rpc-test-a4adbc1474c84f0fa36ea52833f03a89.sock
W20260926 13:39:47.299180 1347 connection.cc:196] Error closing socket: Network error: TlsSocket::Close: Broken pipe
[ OK ] Parameters/TestRpc.TestCredentialsPolicy/SSL_UnixSocket (69 ms)
[ RUN ] Parameters/TestRpc.TestCallLongerThanKeepalive/SSL_UnixSocket
I20260926 13:39:47.340148 1373 acceptor_pool.cc:254] collecting diagnostics on the listening RPC socket unix:/tmp/dist-test-taskOB6nYK/test-tmp/rpc-test-1e190b0b17104a789e88c7926ddc756a.sock every 8 connection(s)
I20260926 13:39:47.340415 1374 acceptor_pool.cc:254] collecting diagnostics on the listening RPC socket unix:/tmp/dist-test-taskOB6nYK/test-tmp/rpc-test-1e190b0b17104a789e88c7926ddc756a.sock every 8 connection(s)
I20260926 13:39:47.361424 1377 rpc-test-base.h:222] got call: sleep_micros: 3000000 deferred: true
I20260926 13:39:50.363181 1377 rpcz_store.cc:275] Call kudu.rpc.GenericCalculatorService.Sleep from unix:<unnamed> (request call id 0) took 3001 ms. Trace:
I20260926 13:39:50.363346 1377 rpcz_store.cc:276] 0926 13:39:47.361315 (+ 0us) service_pool.cc:170] Inserting onto call queue
0926 13:39:47.361378 (+ 63us) service_pool.cc:227] Handling call
0926 13:39:50.363133 (+3001755us) inbound_call.cc:173] Queueing success response
Metrics: {}
[ OK ] Parameters/TestRpc.TestCallLongerThanKeepalive/SSL_UnixSocket (3059 ms)
[ RUN ] Parameters/TestRpc.TestRpcSidecar/SSL_UnixSocket
I20260926 13:39:50.387254 1398 acceptor_pool.cc:254] collecting diagnostics on the listening RPC socket unix:/tmp/dist-test-taskOB6nYK/test-tmp/rpc-test-90c119b7836a4aba99807966433e1dc4.sock every 8 connection(s)
I20260926 13:39:50.387503 1399 acceptor_pool.cc:254] collecting diagnostics on the listening RPC socket unix:/tmp/dist-test-taskOB6nYK/test-tmp/rpc-test-90c119b7836a4aba99807966433e1dc4.sock every 8 connection(s)
W20260926 13:39:50.487267 1395 connection.cc:196] Error closing socket: Network error: TlsSocket::Close: Broken pipe
[ OK ] Parameters/TestRpc.TestRpcSidecar/SSL_UnixSocket (120 ms)
[ RUN ] Parameters/TestRpc.TestRpcSidecarLimits/SSL_UnixSocket
I20260926 13:39:52.673627 1423 acceptor_pool.cc:254] collecting diagnostics on the listening RPC socket unix:/tmp/dist-test-taskOB6nYK/test-tmp/rpc-test-10affbd9f03343aebbb82a77447abb59.sock every 8 connection(s)
I20260926 13:39:52.673914 1424 acceptor_pool.cc:254] collecting diagnostics on the listening RPC socket unix:/tmp/dist-test-taskOB6nYK/test-tmp/rpc-test-10affbd9f03343aebbb82a77447abb59.sock every 8 connection(s)
W20260926 13:39:52.692327 1181 serialization.cc:72] Serialized kudu.rpc_test.PushStringsRequestPB (2147483654 bytes) is larger than the maximum configured RPC message size (52428800 bytes). Sending anyway, but peer may reject the data.
W20260926 13:39:52.697836 1420 connection.cc:535] server connection from unix:<unnamed> recv error: Network error: RPC frame had a length of 2147483714, but we only support messages up to 52428800 bytes long.
W20260926 13:39:52.697944 1420 connection.cc:158] shutting down server connection from unix:<unnamed> with pending inbound data: 4/2147483714 bytes received; last active 0 ns ago: status Network error: RPC frame had a length of 2147483714, but we only support messages up to 52428800 bytes long.
W20260926 13:39:52.698410 1436 connection.cc:196] Error closing socket: Network error: TlsSocket::Close: Broken pipe
I20260926 13:39:52.721129 1448 acceptor_pool.cc:254] collecting diagnostics on the listening RPC socket unix:/tmp/dist-test-taskOB6nYK/test-tmp/rpc-test-10affbd9f03343aebbb82a77447abb59.sock every 8 connection(s)
I20260926 13:39:52.721331 1449 acceptor_pool.cc:254] collecting diagnostics on the listening RPC socket unix:/tmp/dist-test-taskOB6nYK/test-tmp/rpc-test-10affbd9f03343aebbb82a77447abb59.sock every 8 connection(s)
W20260926 13:39:58.342653 1445 connection.cc:577] server connection from unix:<unnamed>: received bad data: 'Corruption: Invalid packet: message had a length of 2147483710, but we only support messages up to 2147483647 bytes
'
W20260926 13:39:58.343255 1461 connection.cc:196] Error closing socket: Network error: TlsSocket::Close: Broken pipe
[ OK ] Parameters/TestRpc.TestRpcSidecarLimits/SSL_UnixSocket (8318 ms)
[ RUN ] Parameters/TestRpc.TestCallTimeoutDoesntAffectNegotiation/SSL_UnixSocket
I20260926 13:39:58.827131 1473 acceptor_pool.cc:254] collecting diagnostics on the listening RPC socket unix:/tmp/dist-test-taskOB6nYK/test-tmp/rpc-test-85e8bf4b35b647bf9255e4e61785a6f7.sock every 8 connection(s)
I20260926 13:39:58.827417 1474 acceptor_pool.cc:254] collecting diagnostics on the listening RPC socket unix:/tmp/dist-test-taskOB6nYK/test-tmp/rpc-test-85e8bf4b35b647bf9255e4e61785a6f7.sock every 8 connection(s)
W20260926 13:39:58.841037 1469 negotiation.cc:266] Injecting 500ms delay in negotiation
I20260926 13:39:58.891502 1181 rpc-test-base.h:595] status: Timed out: connection negotiation to unix:/tmp/dist-test-taskOB6nYK/test-tmp/rpc-test-85e8bf4b35b647bf9255e4e61785a6f7.sock for RPC Sleep timed out after 0.050s (ON_OUTBOUND_QUEUE), seconds elapsed: 0.0509877
W20260926 13:39:59.347442 1470 connection.cc:196] Error closing socket: Network error: TlsSocket::Close: Broken pipe
[ OK ] Parameters/TestRpc.TestCallTimeoutDoesntAffectNegotiation/SSL_UnixSocket (542 ms)
[ RUN ] Parameters/TestRpc.TestRpcHandlerLatencyMetric/SSL_UnixSocket
I20260926 13:39:59.369992 1498 acceptor_pool.cc:254] collecting diagnostics on the listening RPC socket unix:/tmp/dist-test-taskOB6nYK/test-tmp/rpc-test-fb0a243cec924a1e9dbc39623575bc39.sock every 8 connection(s)
I20260926 13:39:59.370201 1499 acceptor_pool.cc:254] collecting diagnostics on the listening RPC socket unix:/tmp/dist-test-taskOB6nYK/test-tmp/rpc-test-fb0a243cec924a1e9dbc39623575bc39.sock every 8 connection(s)
I20260926 13:39:59.410364 1181 rpc-test.cc:1236] Sleep() min lat: 20530
I20260926 13:39:59.410446 1181 rpc-test.cc:1237] Sleep() mean lat: 20530
I20260926 13:39:59.410483 1181 rpc-test.cc:1238] Sleep() max lat: 20530
I20260926 13:39:59.410501 1181 rpc-test.cc:1239] Sleep() #calls: 1
[ OK ] Parameters/TestRpc.TestRpcHandlerLatencyMetric/SSL_UnixSocket (64 ms)
[ RUN ] Parameters/TestRpc.TimedOutOnResponseMetricServiceQueue/SSL_UnixSocket
I20260926 13:39:59.438197 1524 acceptor_pool.cc:254] collecting diagnostics on the listening RPC socket unix:/tmp/dist-test-taskOB6nYK/test-tmp/rpc-test-edc05eb02489470cb8f7dbdc0dbfebec.sock every 8 connection(s)
I20260926 13:39:59.438406 1525 acceptor_pool.cc:254] collecting diagnostics on the listening RPC socket unix:/tmp/dist-test-taskOB6nYK/test-tmp/rpc-test-edc05eb02489470cb8f7dbdc0dbfebec.sock every 8 connection(s)
W20260926 13:39:59.497494 1526 rpcz_store.cc:267] Call kudu.rpc_test.CalculatorService.Sleep from unix:<unnamed> (request call id 2) took 20 ms (client timeout 20 ms). Trace:
W20260926 13:39:59.497659 1526 rpcz_store.cc:269] 0926 13:39:59.477130 (+ 0us) service_pool.cc:170] Inserting onto call queue
0926 13:39:59.497428 (+ 20298us) service_pool.cc:214] Skipping call since client already timed out
0926 13:39:59.497478 (+ 50us) inbound_call.cc:173] Queueing failure response
Metrics: {}
W20260926 13:39:59.498857 1521 connection.cc:196] Error closing socket: Network error: TlsSocket::Close: Broken pipe
[ OK ] Parameters/TestRpc.TimedOutOnResponseMetricServiceQueue/SSL_UnixSocket (86 ms)
[ RUN ] Parameters/TestRpc.RpcPendingConnectionsMetric/SSL_UnixSocket
I20260926 13:39:59.506764 1547 acceptor_pool.cc:254] collecting diagnostics on the listening RPC socket 0.0.0.0:36097 every 8 connection(s)
I20260926 13:39:59.506958 1548 acceptor_pool.cc:254] collecting diagnostics on the listening RPC socket 0.0.0.0:36097 every 8 connection(s)
W20260926 13:39:59.517149 1543 negotiation.cc:337] Failed RPC negotiation. Trace:
0926 13:39:59.516496 (+ 0us) reactor.cc:625] Submitting negotiation task for server connection from 127.0.0.1:41750 (local address 127.0.0.1:36097)
0926 13:39:59.516663 (+ 167us) server_negotiation.cc:206] Beginning negotiation
0926 13:39:59.516667 (+ 4us) server_negotiation.cc:399] Waiting for connection header
0926 13:39:59.516793 (+ 126us) negotiation.cc:327] Negotiation complete: Network error: Server connection negotiation failed: server connection from 127.0.0.1:41750: BlockingRecv error: recv got EOF from 127.0.0.1:41750 (error 108)
Metrics: {"server-negotiator.queue_time_us":61}
[ OK ] Parameters/TestRpc.RpcPendingConnectionsMetric/SSL_UnixSocket (27 ms)
[ RUN ] Parameters/TestRpc.TestRpcContextClientDeadline/SSL_UnixSocket
I20260926 13:39:59.550366 1563 acceptor_pool.cc:254] collecting diagnostics on the listening RPC socket unix:/tmp/dist-test-taskOB6nYK/test-tmp/rpc-test-6a74e77fa5be402b9be6c86425eef860.sock every 8 connection(s)
I20260926 13:39:59.550545 1564 acceptor_pool.cc:254] collecting diagnostics on the listening RPC socket unix:/tmp/dist-test-taskOB6nYK/test-tmp/rpc-test-6a74e77fa5be402b9be6c86425eef860.sock every 8 connection(s)
[ OK ] Parameters/TestRpc.TestRpcContextClientDeadline/SSL_UnixSocket (65 ms)
[ RUN ] Parameters/TestRpc.TestApplicationFeatureFlagUnsupportedServer/SSL_UnixSocket
I20260926 13:39:59.615018 1588 acceptor_pool.cc:254] collecting diagnostics on the listening RPC socket unix:/tmp/dist-test-taskOB6nYK/test-tmp/rpc-test-e48427a2958242cc9c253961b6f3e99f.sock every 8 connection(s)
I20260926 13:39:59.615247 1589 acceptor_pool.cc:254] collecting diagnostics on the listening RPC socket unix:/tmp/dist-test-taskOB6nYK/test-tmp/rpc-test-e48427a2958242cc9c253961b6f3e99f.sock every 8 connection(s)
[ OK ] Parameters/TestRpc.TestApplicationFeatureFlagUnsupportedServer/SSL_UnixSocket (47 ms)
[ RUN ] Parameters/TestRpc.TestCancellationAsync/SSL_UnixSocket
I20260926 13:39:59.658093 1613 acceptor_pool.cc:254] collecting diagnostics on the listening RPC socket unix:/tmp/dist-test-taskOB6nYK/test-tmp/rpc-test-90821841b0cb48b5ba732d89a6bb15c4.sock every 8 connection(s)
I20260926 13:39:59.658347 1614 acceptor_pool.cc:254] collecting diagnostics on the listening RPC socket unix:/tmp/dist-test-taskOB6nYK/test-tmp/rpc-test-90821841b0cb48b5ba732d89a6bb15c4.sock every 8 connection(s)
I20260926 13:39:59.659169 1181 rpc-test.cc:1716] Connecting to unix:/tmp/dist-test-taskOB6nYK/test-tmp/rpc-test-90821841b0cb48b5ba732d89a6bb15c4.sock
I20260926 13:39:59.679340 1181 test_util.cc:268] Using random seed: -132102311
I20260926 13:39:59.718484 1617 rpc-test-base.h:240] got call: sleep_micros: 500 pattern: 4294967295 num_repetitions: 2097152 sidecar_idx: 0
I20260926 13:39:59.738272 1616 rpc-test-base.h:240] got call: sleep_micros: 500 pattern: 4294967295 num_repetitions: 2097152 sidecar_idx: 0
I20260926 13:39:59.766074 1615 rpc-test-base.h:240] got call: sleep_micros: 500 pattern: 4294967295 num_repetitions: 2097152 sidecar_idx: 0
I20260926 13:39:59.793061 1617 rpc-test-base.h:240] got call: sleep_micros: 500 pattern: 4294967295 num_repetitions: 2097152 sidecar_idx: 0
I20260926 13:39:59.824855 1616 rpc-test-base.h:240] got call: sleep_micros: 500 pattern: 4294967295 num_repetitions: 2097152 sidecar_idx: 0
I20260926 13:39:59.855093 1617 rpc-test-base.h:240] got call: sleep_micros: 500 pattern: 4294967295 num_repetitions: 2097152 sidecar_idx: 0
I20260926 13:39:59.888116 1616 rpc-test-base.h:240] got call: sleep_micros: 500 pattern: 4294967295 num_repetitions: 2097152 sidecar_idx: 0
W20260926 13:39:59.889905 1610 connection.cc:196] Error closing socket: Network error: TlsSocket::Close: Broken pipe
W20260926 13:39:59.913466 1610 connection.cc:441] server connection from unix:<unnamed> torn down before Call kudu.rpc.GenericCalculatorService.SleepWithSidecar from unix:<unnamed> (request call id 8) could send its response
W20260926 13:39:59.933981 1610 connection.cc:441] server connection from unix:<unnamed> torn down before Call kudu.rpc.GenericCalculatorService.SleepWithSidecar from unix:<unnamed> (request call id 9) could send its response
[ OK ] Parameters/TestRpc.TestCancellationAsync/SSL_UnixSocket (294 ms)
[ RUN ] Parameters/TestRpc.TestPerformanceBySocketType/SSL_UnixSocket
I20260926 13:39:59.960850 1638 acceptor_pool.cc:254] collecting diagnostics on the listening RPC socket unix:/tmp/dist-test-taskOB6nYK/test-tmp/rpc-test-9de96394b5f64ad08db300dd75f88df1.sock every 8 connection(s)
I20260926 13:39:59.961064 1639 acceptor_pool.cc:254] collecting diagnostics on the listening RPC socket unix:/tmp/dist-test-taskOB6nYK/test-tmp/rpc-test-9de96394b5f64ad08db300dd75f88df1.sock every 8 connection(s)
I20260926 13:39:59.961897 1181 rpc-test.cc:1846] Connecting to unix:/tmp/dist-test-taskOB6nYK/test-tmp/rpc-test-9de96394b5f64ad08db300dd75f88df1.sock
I20260926 13:40:03.220896 1181 rpc-test.cc:1859] Sending 1024MB via ssl-enabled unix socket: real 3.240s user 3.330s sys 2.215s
I20260926 13:40:06.377882 1181 rpc-test.cc:1859] Sending 1024MB via ssl-enabled unix socket: real 3.157s user 3.065s sys 2.346s
I20260926 13:40:09.580225 1181 rpc-test.cc:1859] Sending 1024MB via ssl-enabled unix socket: real 3.202s user 3.192s sys 2.260s
I20260926 13:40:12.794035 1181 rpc-test.cc:1859] Sending 1024MB via ssl-enabled unix socket: real 3.214s user 3.162s sys 2.298s
I20260926 13:40:15.885437 1181 rpc-test.cc:1859] Sending 1024MB via ssl-enabled unix socket: real 3.091s user 3.055s sys 2.200s
W20260926 13:40:15.887765 1635 connection.cc:196] Error closing socket: Network error: TlsSocket::Close: Broken pipe
[ OK ] Parameters/TestRpc.TestPerformanceBySocketType/SSL_UnixSocket (15957 ms)
[----------] 20 tests from Parameters/TestRpc (51742 ms total)
[----------] 1 test from Parameters/TestRpcSocketTxRxQueue
[ RUN ] Parameters/TestRpcSocketTxRxQueue.AcceptorRxQueueSizeMetric/0
I20260926 13:40:15.899173 1663 acceptor_pool.cc:254] collecting diagnostics on the listening RPC socket 0.0.0.0:42233 every 1 connection(s)
I20260926 13:40:15.899444 1664 acceptor_pool.cc:254] collecting diagnostics on the listening RPC socket 0.0.0.0:42233 every 1 connection(s)
W20260926 13:40:15.901214 1659 negotiation.cc:337] Failed RPC negotiation. Trace:
0926 13:40:15.900835 (+ 0us) reactor.cc:625] Submitting negotiation task for server connection from 127.0.0.1:33212 (local address 127.0.0.1:42233)
0926 13:40:15.900983 (+ 148us) server_negotiation.cc:206] Beginning negotiation
0926 13:40:15.900987 (+ 4us) server_negotiation.cc:399] Waiting for connection header
0926 13:40:15.901108 (+ 121us) negotiation.cc:327] Negotiation complete: Network error: Server connection negotiation failed: server connection from 127.0.0.1:33212: BlockingRecv error: recv got EOF from 127.0.0.1:33212 (error 108)
Metrics: {"server-negotiator.queue_time_us":55}
[ OK ] Parameters/TestRpcSocketTxRxQueue.AcceptorRxQueueSizeMetric/0 (10 ms)
[----------] 1 test from Parameters/TestRpcSocketTxRxQueue (10 ms total)
[----------] Global test environment tear-down
[==========] 21 tests from 2 test suites ran. (51753 ms total)
[ PASSED ] 20 tests.
[ FAILED ] 1 test, listed below:
[ FAILED ] Parameters/TestRpc.TestCallWithChainCertAndChainCA/SSL_UnixSocket, where GetParam() = (true, true)
1 FAILED TEST