Diagnosed failure
Parameters/TestRpc.TestCallWithChainCertAndChainCA/SSL_UnixSocket: /data0/somelongdirectorytoavoidrpathissues/src/kudu/src/kudu/rpc/rpc-test.cc:270: Failure
Failed
Bad status: Runtime error: could not verify certificate chain (error with cert: subject=CN = localhost, ST = sadfjas, C = AS, emailAddress = sdflkdsajf, O = lskdfjlsad, OU = sldfkja, issuer=C = AS, ST = ASDfkjdhf, L = lskdjf, O = saldfja, OU = skdjf, CN = localhost, emailAddress = sadjflkadsj): : certificate has expired
Google Test trace:
/data0/somelongdirectorytoavoidrpathissues/src/kudu/src/kudu/rpc/rpc-test.cc:267: Connecting to unix:/tmp/dist-test-taskwN9Ibr/test-tmp/rpc-test-b943b7a6a03a4573a7f276e5f8680238.sock
I20260926 19:30:10.407989 379 test_util.cc:175] -----------------------------------------------
I20260926 19:30:10.408087 379 test_util.cc:176] Had fatal failures, leaving test files at /tmp/dist-test-taskwN9Ibr/test-tmp/rpc-test.6.Parameters_TestRpc.TestCallWithChainCertAndChainCA_SSL_UnixSocket.1790451010278249-379-0
Full log
Note: This is test shard 7 of 8.
[==========] Running 21 tests from 2 test suites.
[----------] Global test environment set-up.
[----------] 20 tests from Parameters/TestRpc
[ RUN ] Parameters/TestRpc.TestMessengerCreateDestroy/SSL_UnixSocket
WARNING: Logging before InitGoogleLogging() is written to STDERR
I20260926 19:30:10.330268 379 rpc-test.cc:169] started messenger TestCreateDestroy
[ OK ] Parameters/TestRpc.TestMessengerCreateDestroy/SSL_UnixSocket (35 ms)
[ RUN ] Parameters/TestRpc.TestNegotiationDeadlock/SSL_UnixSocket
I20260926 19:30:10.346661 399 acceptor_pool.cc:254] collecting diagnostics on the listening RPC socket unix:/tmp/dist-test-taskwN9Ibr/test-tmp/rpc-test-82627202a6c34f128cbecf55e1f17e26.sock every 8 connection(s)
I20260926 19:30:10.346958 400 acceptor_pool.cc:254] collecting diagnostics on the listening RPC socket unix:/tmp/dist-test-taskwN9Ibr/test-tmp/rpc-test-82627202a6c34f128cbecf55e1f17e26.sock every 8 connection(s)
[ OK ] Parameters/TestRpc.TestNegotiationDeadlock/SSL_UnixSocket (33 ms)
[ RUN ] Parameters/TestRpc.TestCallWithChainCertAndChainCA/SSL_UnixSocket
I20260926 19:30:10.392169 415 acceptor_pool.cc:254] collecting diagnostics on the listening RPC socket unix:/tmp/dist-test-taskwN9Ibr/test-tmp/rpc-test-b943b7a6a03a4573a7f276e5f8680238.sock every 8 connection(s)
I20260926 19:30:10.392607 416 acceptor_pool.cc:254] collecting diagnostics on the listening RPC socket unix:/tmp/dist-test-taskwN9Ibr/test-tmp/rpc-test-b943b7a6a03a4573a7f276e5f8680238.sock every 8 connection(s)
/data0/somelongdirectorytoavoidrpathissues/src/kudu/src/kudu/rpc/rpc-test.cc:270: Failure
Failed
Bad status: Runtime error: could not verify certificate chain (error with cert: subject=CN = localhost, ST = sadfjas, C = AS, emailAddress = sdflkdsajf, O = lskdfjlsad, OU = sldfkja, issuer=C = AS, ST = ASDfkjdhf, L = lskdjf, O = saldfja, OU = skdjf, CN = localhost, emailAddress = sadjflkadsj): : certificate has expired
Google Test trace:
/data0/somelongdirectorytoavoidrpathissues/src/kudu/src/kudu/rpc/rpc-test.cc:267: Connecting to unix:/tmp/dist-test-taskwN9Ibr/test-tmp/rpc-test-b943b7a6a03a4573a7f276e5f8680238.sock
I20260926 19:30:10.407989 379 test_util.cc:175] -----------------------------------------------
I20260926 19:30:10.408087 379 test_util.cc:176] Had fatal failures, leaving test files at /tmp/dist-test-taskwN9Ibr/test-tmp/rpc-test.6.Parameters_TestRpc.TestCallWithChainCertAndChainCA_SSL_UnixSocket.1790451010278249-379-0
[ FAILED ] Parameters/TestRpc.TestCallWithChainCertAndChainCA/SSL_UnixSocket, where GetParam() = (true, true) (41 ms)
[ RUN ] Parameters/TestRpc.TestCallWithPasswordProtectedKey/SSL_UnixSocket
I20260926 19:30:10.421914 440 acceptor_pool.cc:254] collecting diagnostics on the listening RPC socket unix:/tmp/dist-test-taskwN9Ibr/test-tmp/rpc-test-2f6a86d8948546faa16f0b33cc19138f.sock every 8 connection(s)
I20260926 19:30:10.422098 441 acceptor_pool.cc:254] collecting diagnostics on the listening RPC socket unix:/tmp/dist-test-taskwN9Ibr/test-tmp/rpc-test-2f6a86d8948546faa16f0b33cc19138f.sock every 8 connection(s)
W20260926 19:30:10.455222 437 connection.cc:196] Error closing socket: Network error: TlsSocket::Close: Broken pipe
[ OK ] Parameters/TestRpc.TestCallWithPasswordProtectedKey/SSL_UnixSocket (52 ms)
[ RUN ] Parameters/TestRpc.TestCallToBadServer/SSL_UnixSocket
I20260926 19:30:10.476104 379 rpc-test.cc:394] Status: Network error: Client connection negotiation failed: client connection to 0.0.0.0:0: connect: Connection refused (error 111)
I20260926 19:30:10.476881 379 rpc-test.cc:394] Status: Network error: Client connection negotiation failed: client connection to 0.0.0.0:0: connect: Connection refused (error 111)
I20260926 19:30:10.477500 379 rpc-test.cc:394] Status: Network error: Client connection negotiation failed: client connection to 0.0.0.0:0: connect: Connection refused (error 111)
I20260926 19:30:10.478092 379 rpc-test.cc:394] Status: Network error: Client connection negotiation failed: client connection to 0.0.0.0:0: connect: Connection refused (error 111)
I20260926 19:30:10.478669 379 rpc-test.cc:394] Status: Network error: Client connection negotiation failed: client connection to 0.0.0.0:0: connect: Connection refused (error 111)
[ OK ] Parameters/TestRpc.TestCallToBadServer/SSL_UnixSocket (19 ms)
[ RUN ] Parameters/TestRpc.TestWrongService/SSL_UnixSocket
I20260926 19:30:10.496364 475 acceptor_pool.cc:254] collecting diagnostics on the listening RPC socket unix:/tmp/dist-test-taskwN9Ibr/test-tmp/rpc-test-1727af94d8df4589b437ad04032c346c.sock every 8 connection(s)
I20260926 19:30:10.496652 476 acceptor_pool.cc:254] collecting diagnostics on the listening RPC socket unix:/tmp/dist-test-taskwN9Ibr/test-tmp/rpc-test-1727af94d8df4589b437ad04032c346c.sock every 8 connection(s)
I20260926 19:30:10.528021 472 messenger.cc:345] service WrongServiceName not registered on TestServer
[ OK ] Parameters/TestRpc.TestWrongService/SSL_UnixSocket (53 ms)
[ RUN ] Parameters/TestRpc.TestConnectionKeepalive/SSL_UnixSocket
I20260926 19:30:10.541831 498 acceptor_pool.cc:254] collecting diagnostics on the listening RPC socket unix:/tmp/dist-test-taskwN9Ibr/test-tmp/rpc-test-2c6693bb77a740b3bed14142df9524e1.sock every 8 connection(s)
I20260926 19:30:10.542023 499 acceptor_pool.cc:254] collecting diagnostics on the listening RPC socket unix:/tmp/dist-test-taskwN9Ibr/test-tmp/rpc-test-2c6693bb77a740b3bed14142df9524e1.sock every 8 connection(s)
I20260926 19:30:10.542943 379 rpc-test.cc:488] Connecting to unix:/tmp/dist-test-taskwN9Ibr/test-tmp/rpc-test-2c6693bb77a740b3bed14142df9524e1.sock
W20260926 19:30:11.035936 511 connection.cc:196] Error closing socket: Network error: TlsSocket::Close: Broken pipe
[ OK ] Parameters/TestRpc.TestConnectionKeepalive/SSL_UnixSocket (1053 ms)
[ RUN ] Parameters/TestRpc.TestClientConnectionMetrics/SSL_UnixSocket
I20260926 19:30:11.600425 523 acceptor_pool.cc:254] collecting diagnostics on the listening RPC socket unix:/tmp/dist-test-taskwN9Ibr/test-tmp/rpc-test-2b0f211b41a54fa0b39b8478833200d2.sock every 8 connection(s)
I20260926 19:30:11.600747 524 acceptor_pool.cc:254] collecting diagnostics on the listening RPC socket unix:/tmp/dist-test-taskwN9Ibr/test-tmp/rpc-test-2b0f211b41a54fa0b39b8478833200d2.sock every 8 connection(s)
I20260926 19:30:11.601743 379 rpc-test.cc:569] Connecting to unix:/tmp/dist-test-taskwN9Ibr/test-tmp/rpc-test-2b0f211b41a54fa0b39b8478833200d2.sock
W20260926 19:30:32.630383 520 connection.cc:196] Error closing socket: Network error: TlsSocket::Close: Broken pipe
[ OK ] Parameters/TestRpc.TestClientConnectionMetrics/SSL_UnixSocket (21049 ms)
[ RUN ] Parameters/TestRpc.TestCredentialsPolicy/SSL_UnixSocket
I20260926 19:30:32.650660 546 acceptor_pool.cc:254] collecting diagnostics on the listening RPC socket unix:/tmp/dist-test-taskwN9Ibr/test-tmp/rpc-test-1c835b9ea5884a5b8eee86a5ea60a8e3.sock every 8 connection(s)
I20260926 19:30:32.650894 547 acceptor_pool.cc:254] collecting diagnostics on the listening RPC socket unix:/tmp/dist-test-taskwN9Ibr/test-tmp/rpc-test-1c835b9ea5884a5b8eee86a5ea60a8e3.sock every 8 connection(s)
I20260926 19:30:32.651774 379 rpc-test.cc:700] Connecting to unix:/tmp/dist-test-taskwN9Ibr/test-tmp/rpc-test-1c835b9ea5884a5b8eee86a5ea60a8e3.sock
W20260926 19:30:32.674839 545 connection.cc:196] Error closing socket: Network error: TlsSocket::Close: Broken pipe
W20260926 19:30:32.681324 545 connection.cc:196] Error closing socket: Network error: TlsSocket::Close: Broken pipe
[ OK ] Parameters/TestRpc.TestCredentialsPolicy/SSL_UnixSocket (48 ms)
[ RUN ] Parameters/TestRpc.TestCallLongerThanKeepalive/SSL_UnixSocket
I20260926 19:30:32.710711 571 acceptor_pool.cc:254] collecting diagnostics on the listening RPC socket unix:/tmp/dist-test-taskwN9Ibr/test-tmp/rpc-test-b0e2188b404246c187f87736706874ed.sock every 8 connection(s)
I20260926 19:30:32.710963 572 acceptor_pool.cc:254] collecting diagnostics on the listening RPC socket unix:/tmp/dist-test-taskwN9Ibr/test-tmp/rpc-test-b0e2188b404246c187f87736706874ed.sock every 8 connection(s)
I20260926 19:30:32.730016 575 rpc-test-base.h:222] got call: sleep_micros: 3000000 deferred: true
I20260926 19:30:35.731727 575 rpcz_store.cc:275] Call kudu.rpc.GenericCalculatorService.Sleep from unix:<unnamed> (request call id 0) took 3001 ms. Trace:
I20260926 19:30:35.731922 575 rpcz_store.cc:276] 0926 19:30:32.729886 (+ 0us) service_pool.cc:170] Inserting onto call queue
0926 19:30:32.729965 (+ 79us) service_pool.cc:227] Handling call
0926 19:30:35.731687 (+3001722us) inbound_call.cc:173] Queueing success response
Metrics: {}
[ OK ] Parameters/TestRpc.TestCallLongerThanKeepalive/SSL_UnixSocket (3052 ms)
[ RUN ] Parameters/TestRpc.TestRpcSidecar/SSL_UnixSocket
I20260926 19:30:35.774106 596 acceptor_pool.cc:254] collecting diagnostics on the listening RPC socket unix:/tmp/dist-test-taskwN9Ibr/test-tmp/rpc-test-4caad99b4ed34c0c9f4d980f625233e5.sock every 8 connection(s)
I20260926 19:30:35.774322 597 acceptor_pool.cc:254] collecting diagnostics on the listening RPC socket unix:/tmp/dist-test-taskwN9Ibr/test-tmp/rpc-test-4caad99b4ed34c0c9f4d980f625233e5.sock every 8 connection(s)
W20260926 19:30:35.877962 593 connection.cc:196] Error closing socket: Network error: TlsSocket::Close: Broken pipe
[ OK ] Parameters/TestRpc.TestRpcSidecar/SSL_UnixSocket (143 ms)
[ RUN ] Parameters/TestRpc.TestRpcSidecarLimits/SSL_UnixSocket
I20260926 19:30:37.993657 621 acceptor_pool.cc:254] collecting diagnostics on the listening RPC socket unix:/tmp/dist-test-taskwN9Ibr/test-tmp/rpc-test-03e3beb2a3e0467da49acadca5be9eb3.sock every 8 connection(s)
I20260926 19:30:37.993891 622 acceptor_pool.cc:254] collecting diagnostics on the listening RPC socket unix:/tmp/dist-test-taskwN9Ibr/test-tmp/rpc-test-03e3beb2a3e0467da49acadca5be9eb3.sock every 8 connection(s)
W20260926 19:30:38.018391 379 serialization.cc:72] Serialized kudu.rpc_test.PushStringsRequestPB (2147483654 bytes) is larger than the maximum configured RPC message size (52428800 bytes). Sending anyway, but peer may reject the data.
W20260926 19:30:38.023957 618 connection.cc:535] server connection from unix:<unnamed> recv error: Network error: RPC frame had a length of 2147483714, but we only support messages up to 52428800 bytes long.
W20260926 19:30:38.024068 618 connection.cc:158] shutting down server connection from unix:<unnamed> with pending inbound data: 4/2147483714 bytes received; last active 0 ns ago: status Network error: RPC frame had a length of 2147483714, but we only support messages up to 52428800 bytes long.
W20260926 19:30:38.024878 634 connection.cc:196] Error closing socket: Network error: TlsSocket::Close: Broken pipe
I20260926 19:30:38.053294 646 acceptor_pool.cc:254] collecting diagnostics on the listening RPC socket unix:/tmp/dist-test-taskwN9Ibr/test-tmp/rpc-test-03e3beb2a3e0467da49acadca5be9eb3.sock every 8 connection(s)
I20260926 19:30:38.053511 647 acceptor_pool.cc:254] collecting diagnostics on the listening RPC socket unix:/tmp/dist-test-taskwN9Ibr/test-tmp/rpc-test-03e3beb2a3e0467da49acadca5be9eb3.sock every 8 connection(s)
W20260926 19:30:43.825582 643 connection.cc:577] server connection from unix:<unnamed>: received bad data: 'Corruption: Invalid packet: message had a length of 2147483710, but we only support messages up to 2147483647 bytes
'
W20260926 19:30:43.826164 659 connection.cc:196] Error closing socket: Network error: TlsSocket::Close: Broken pipe
[ OK ] Parameters/TestRpc.TestRpcSidecarLimits/SSL_UnixSocket (8394 ms)
[ RUN ] Parameters/TestRpc.TestCallTimeoutDoesntAffectNegotiation/SSL_UnixSocket
I20260926 19:30:44.307524 671 acceptor_pool.cc:254] collecting diagnostics on the listening RPC socket unix:/tmp/dist-test-taskwN9Ibr/test-tmp/rpc-test-e7ef3b6d51ab4642976f687240cc3482.sock every 8 connection(s)
I20260926 19:30:44.307813 672 acceptor_pool.cc:254] collecting diagnostics on the listening RPC socket unix:/tmp/dist-test-taskwN9Ibr/test-tmp/rpc-test-e7ef3b6d51ab4642976f687240cc3482.sock every 8 connection(s)
W20260926 19:30:44.322548 667 negotiation.cc:266] Injecting 500ms delay in negotiation
I20260926 19:30:44.373147 379 rpc-test-base.h:595] status: Timed out: connection negotiation to unix:/tmp/dist-test-taskwN9Ibr/test-tmp/rpc-test-e7ef3b6d51ab4642976f687240cc3482.sock for RPC Sleep timed out after 0.050s (ON_OUTBOUND_QUEUE), seconds elapsed: 0.0511506
[ OK ] Parameters/TestRpc.TestCallTimeoutDoesntAffectNegotiation/SSL_UnixSocket (557 ms)
[ RUN ] Parameters/TestRpc.TestRpcHandlerLatencyMetric/SSL_UnixSocket
I20260926 19:30:44.856662 696 acceptor_pool.cc:254] collecting diagnostics on the listening RPC socket unix:/tmp/dist-test-taskwN9Ibr/test-tmp/rpc-test-54922654ffb84f97b071061719abf79d.sock every 8 connection(s)
I20260926 19:30:44.856920 697 acceptor_pool.cc:254] collecting diagnostics on the listening RPC socket unix:/tmp/dist-test-taskwN9Ibr/test-tmp/rpc-test-54922654ffb84f97b071061719abf79d.sock every 8 connection(s)
I20260926 19:30:44.894773 379 rpc-test.cc:1236] Sleep() min lat: 20563
I20260926 19:30:44.894869 379 rpc-test.cc:1237] Sleep() mean lat: 20563
I20260926 19:30:44.894909 379 rpc-test.cc:1238] Sleep() max lat: 20563
I20260926 19:30:44.894927 379 rpc-test.cc:1239] Sleep() #calls: 1
[ OK ] Parameters/TestRpc.TestRpcHandlerLatencyMetric/SSL_UnixSocket (66 ms)
[ RUN ] Parameters/TestRpc.TimedOutOnResponseMetricServiceQueue/SSL_UnixSocket
I20260926 19:30:44.909917 722 acceptor_pool.cc:254] collecting diagnostics on the listening RPC socket unix:/tmp/dist-test-taskwN9Ibr/test-tmp/rpc-test-d440faf235994415a63e145b793cf7bb.sock every 8 connection(s)
I20260926 19:30:44.910140 723 acceptor_pool.cc:254] collecting diagnostics on the listening RPC socket unix:/tmp/dist-test-taskwN9Ibr/test-tmp/rpc-test-d440faf235994415a63e145b793cf7bb.sock every 8 connection(s)
W20260926 19:30:44.968191 724 rpcz_store.cc:267] Call kudu.rpc_test.CalculatorService.Sleep from unix:<unnamed> (request call id 2) took 20 ms (client timeout 20 ms). Trace:
W20260926 19:30:44.968361 724 rpcz_store.cc:269] 0926 19:30:44.947774 (+ 0us) service_pool.cc:170] Inserting onto call queue
0926 19:30:44.968135 (+ 20361us) service_pool.cc:214] Skipping call since client already timed out
0926 19:30:44.968174 (+ 39us) inbound_call.cc:173] Queueing failure response
Metrics: {}
W20260926 19:30:44.969807 719 connection.cc:196] Error closing socket: Network error: TlsSocket::Close: Broken pipe
[ OK ] Parameters/TestRpc.TimedOutOnResponseMetricServiceQueue/SSL_UnixSocket (73 ms)
[ RUN ] Parameters/TestRpc.RpcPendingConnectionsMetric/SSL_UnixSocket
I20260926 19:30:44.977753 745 acceptor_pool.cc:254] collecting diagnostics on the listening RPC socket 0.0.0.0:40153 every 8 connection(s)
I20260926 19:30:44.978003 746 acceptor_pool.cc:254] collecting diagnostics on the listening RPC socket 0.0.0.0:40153 every 8 connection(s)
W20260926 19:30:44.987879 741 negotiation.cc:337] Failed RPC negotiation. Trace:
0926 19:30:44.987262 (+ 0us) reactor.cc:625] Submitting negotiation task for server connection from 127.0.0.1:41180 (local address 127.0.0.1:40153)
0926 19:30:44.987437 (+ 175us) server_negotiation.cc:206] Beginning negotiation
0926 19:30:44.987441 (+ 4us) server_negotiation.cc:399] Waiting for connection header
0926 19:30:44.987580 (+ 139us) negotiation.cc:327] Negotiation complete: Network error: Server connection negotiation failed: server connection from 127.0.0.1:41180: BlockingRecv error: recv got EOF from 127.0.0.1:41180 (error 108)
Metrics: {"server-negotiator.queue_time_us":66}
[ OK ] Parameters/TestRpc.RpcPendingConnectionsMetric/SSL_UnixSocket (27 ms)
[ RUN ] Parameters/TestRpc.TestRpcContextClientDeadline/SSL_UnixSocket
I20260926 19:30:45.017760 761 acceptor_pool.cc:254] collecting diagnostics on the listening RPC socket unix:/tmp/dist-test-taskwN9Ibr/test-tmp/rpc-test-7229ea04361241029997d6f617abbbc0.sock every 8 connection(s)
I20260926 19:30:45.017972 762 acceptor_pool.cc:254] collecting diagnostics on the listening RPC socket unix:/tmp/dist-test-taskwN9Ibr/test-tmp/rpc-test-7229ea04361241029997d6f617abbbc0.sock every 8 connection(s)
[ OK ] Parameters/TestRpc.TestRpcContextClientDeadline/SSL_UnixSocket (58 ms)
[ RUN ] Parameters/TestRpc.TestApplicationFeatureFlagUnsupportedServer/SSL_UnixSocket
I20260926 19:30:45.069679 786 acceptor_pool.cc:254] collecting diagnostics on the listening RPC socket unix:/tmp/dist-test-taskwN9Ibr/test-tmp/rpc-test-c248951b5d7e4111aa9af45c15dd8ccf.sock every 8 connection(s)
I20260926 19:30:45.069944 787 acceptor_pool.cc:254] collecting diagnostics on the listening RPC socket unix:/tmp/dist-test-taskwN9Ibr/test-tmp/rpc-test-c248951b5d7e4111aa9af45c15dd8ccf.sock every 8 connection(s)
[ OK ] Parameters/TestRpc.TestApplicationFeatureFlagUnsupportedServer/SSL_UnixSocket (62 ms)
[ RUN ] Parameters/TestRpc.TestCancellationAsync/SSL_UnixSocket
I20260926 19:30:45.136834 811 acceptor_pool.cc:254] collecting diagnostics on the listening RPC socket unix:/tmp/dist-test-taskwN9Ibr/test-tmp/rpc-test-21f6296c732f4306af8611815bd14623.sock every 8 connection(s)
I20260926 19:30:45.137071 812 acceptor_pool.cc:254] collecting diagnostics on the listening RPC socket unix:/tmp/dist-test-taskwN9Ibr/test-tmp/rpc-test-21f6296c732f4306af8611815bd14623.sock every 8 connection(s)
I20260926 19:30:45.137876 379 rpc-test.cc:1716] Connecting to unix:/tmp/dist-test-taskwN9Ibr/test-tmp/rpc-test-21f6296c732f4306af8611815bd14623.sock
I20260926 19:30:45.159073 379 test_util.cc:268] Using random seed: -561459061
I20260926 19:30:45.205227 815 rpc-test-base.h:240] got call: sleep_micros: 500 pattern: 4294967295 num_repetitions: 2097152 sidecar_idx: 0
I20260926 19:30:45.237377 815 rpc-test-base.h:240] got call: sleep_micros: 500 pattern: 4294967295 num_repetitions: 2097152 sidecar_idx: 0
I20260926 19:30:45.269127 815 rpc-test-base.h:240] got call: sleep_micros: 500 pattern: 4294967295 num_repetitions: 2097152 sidecar_idx: 0
I20260926 19:30:45.301302 815 rpc-test-base.h:240] got call: sleep_micros: 500 pattern: 4294967295 num_repetitions: 2097152 sidecar_idx: 0
I20260926 19:30:45.333519 815 rpc-test-base.h:240] got call: sleep_micros: 500 pattern: 4294967295 num_repetitions: 2097152 sidecar_idx: 0
I20260926 19:30:45.366303 815 rpc-test-base.h:240] got call: sleep_micros: 500 pattern: 4294967295 num_repetitions: 2097152 sidecar_idx: 0
I20260926 19:30:45.398646 815 rpc-test-base.h:240] got call: sleep_micros: 500 pattern: 4294967295 num_repetitions: 2097152 sidecar_idx: 0
W20260926 19:30:45.400835 808 connection.cc:196] Error closing socket: Network error: TlsSocket::Close: Broken pipe
W20260926 19:30:45.431049 808 connection.cc:441] server connection from unix:<unnamed> torn down before Call kudu.rpc.GenericCalculatorService.SleepWithSidecar from unix:<unnamed> (request call id 9) could send its response
[ OK ] Parameters/TestRpc.TestCancellationAsync/SSL_UnixSocket (312 ms)
[ RUN ] Parameters/TestRpc.TestPerformanceBySocketType/SSL_UnixSocket
I20260926 19:30:45.472416 836 acceptor_pool.cc:254] collecting diagnostics on the listening RPC socket unix:/tmp/dist-test-taskwN9Ibr/test-tmp/rpc-test-11412d43b46d4752836aa843fd299d47.sock every 8 connection(s)
I20260926 19:30:45.472676 837 acceptor_pool.cc:254] collecting diagnostics on the listening RPC socket unix:/tmp/dist-test-taskwN9Ibr/test-tmp/rpc-test-11412d43b46d4752836aa843fd299d47.sock every 8 connection(s)
I20260926 19:30:45.473615 379 rpc-test.cc:1846] Connecting to unix:/tmp/dist-test-taskwN9Ibr/test-tmp/rpc-test-11412d43b46d4752836aa843fd299d47.sock
I20260926 19:30:48.686230 379 rpc-test.cc:1859] Sending 1024MB via ssl-enabled unix socket: real 3.193s user 3.058s sys 2.369s
I20260926 19:30:51.835480 379 rpc-test.cc:1859] Sending 1024MB via ssl-enabled unix socket: real 3.149s user 2.977s sys 2.341s
I20260926 19:30:54.888588 379 rpc-test.cc:1859] Sending 1024MB via ssl-enabled unix socket: real 3.053s user 3.065s sys 2.094s
I20260926 19:30:57.957587 379 rpc-test.cc:1859] Sending 1024MB via ssl-enabled unix socket: real 3.069s user 2.948s sys 2.253s
I20260926 19:31:01.066287 379 rpc-test.cc:1859] Sending 1024MB via ssl-enabled unix socket: real 3.109s user 2.999s sys 2.254s
W20260926 19:31:01.068413 833 connection.cc:196] Error closing socket: Network error: TlsSocket::Close: Broken pipe
[ OK ] Parameters/TestRpc.TestPerformanceBySocketType/SSL_UnixSocket (15642 ms)
[----------] 20 tests from Parameters/TestRpc (50779 ms total)
[----------] 1 test from Parameters/TestRpcSocketTxRxQueue
[ RUN ] Parameters/TestRpcSocketTxRxQueue.AcceptorRxQueueSizeMetric/0
I20260926 19:31:01.082269 861 acceptor_pool.cc:254] collecting diagnostics on the listening RPC socket 0.0.0.0:36037 every 1 connection(s)
I20260926 19:31:01.082542 862 acceptor_pool.cc:254] collecting diagnostics on the listening RPC socket 0.0.0.0:36037 every 1 connection(s)
W20260926 19:31:01.084276 857 negotiation.cc:337] Failed RPC negotiation. Trace:
0926 19:31:01.083919 (+ 0us) reactor.cc:625] Submitting negotiation task for server connection from 127.0.0.1:36814 (local address 127.0.0.1:36037)
0926 19:31:01.084057 (+ 138us) server_negotiation.cc:206] Beginning negotiation
0926 19:31:01.084061 (+ 4us) server_negotiation.cc:399] Waiting for connection header
0926 19:31:01.084172 (+ 111us) negotiation.cc:327] Negotiation complete: Network error: Server connection negotiation failed: server connection from 127.0.0.1:36814: BlockingRecv error: recv got EOF from 127.0.0.1:36814 (error 108)
Metrics: {"server-negotiator.queue_time_us":42}
[ OK ] Parameters/TestRpcSocketTxRxQueue.AcceptorRxQueueSizeMetric/0 (10 ms)
[----------] 1 test from Parameters/TestRpcSocketTxRxQueue (10 ms total)
[----------] Global test environment tear-down
[==========] 21 tests from 2 test suites ran. (50790 ms total)
[ PASSED ] 20 tests.
[ FAILED ] 1 test, listed below:
[ FAILED ] Parameters/TestRpc.TestCallWithChainCertAndChainCA/SSL_UnixSocket, where GetParam() = (true, true)
1 FAILED TEST