Diagnosed failure

Parameters/TestRpc.TestCallWithChainCertAndChainCA/SSL_TCP: /data0/somelongdirectorytoavoidrpathissues/src/kudu/src/kudu/rpc/rpc-test.cc:270: Failure
Failed
Bad status: Runtime error: could not verify certificate chain (error with cert: subject=CN = localhost, ST = sadfjas, C = AS, emailAddress = sdflkdsajf, O = lskdfjlsad, OU = sldfkja, issuer=C = AS, ST = ASDfkjdhf, L = lskdjf, O = saldfja, OU = skdjf, CN = localhost, emailAddress = sadjflkadsj): : certificate has expired
Google Test trace:
/data0/somelongdirectorytoavoidrpathissues/src/kudu/src/kudu/rpc/rpc-test.cc:267: Connecting to 0.0.0.0:39605
I20260929 02:19:45.059975  7416 test_util.cc:175] -----------------------------------------------
I20260929 02:19:45.060148  7416 test_util.cc:176] Had fatal failures, leaving test files at /tmp/dist-test-taskYCLdOx/test-tmp/rpc-test.5.Parameters_TestRpc.TestCallWithChainCertAndChainCA_SSL_TCP.1790648383612808-7416-0

Full log

Note: This is test shard 6 of 8.
[==========] Running 21 tests from 2 test suites.
[----------] Global test environment set-up.
[----------] 20 tests from Parameters/TestRpc
[ RUN      ] Parameters/TestRpc.TestMessengerCreateDestroy/SSL_TCP
WARNING: Logging before InitGoogleLogging() is written to STDERR
I20260929 02:19:43.743698  7416 rpc-test.cc:169] started messenger TestCreateDestroy
[       OK ] Parameters/TestRpc.TestMessengerCreateDestroy/SSL_TCP (1244 ms)
[ RUN      ] Parameters/TestRpc.TestNegotiationDeadlock/SSL_TCP
I20260929 02:19:44.940697  7438 acceptor_pool.cc:254] collecting diagnostics on the listening RPC socket 0.0.0.0:39471 every 8 connection(s)
I20260929 02:19:44.942269  7439 acceptor_pool.cc:254] collecting diagnostics on the listening RPC socket 0.0.0.0:39471 every 8 connection(s)
[       OK ] Parameters/TestRpc.TestNegotiationDeadlock/SSL_TCP (89 ms)
[ RUN      ] Parameters/TestRpc.TestCallWithChainCertAndChainCA/SSL_TCP
I20260929 02:19:45.029626  7454 acceptor_pool.cc:254] collecting diagnostics on the listening RPC socket 0.0.0.0:39605 every 8 connection(s)
I20260929 02:19:45.031955  7455 acceptor_pool.cc:254] collecting diagnostics on the listening RPC socket 0.0.0.0:39605 every 8 connection(s)
/data0/somelongdirectorytoavoidrpathissues/src/kudu/src/kudu/rpc/rpc-test.cc:270: Failure
Failed
Bad status: Runtime error: could not verify certificate chain (error with cert: subject=CN = localhost, ST = sadfjas, C = AS, emailAddress = sdflkdsajf, O = lskdfjlsad, OU = sldfkja, issuer=C = AS, ST = ASDfkjdhf, L = lskdjf, O = saldfja, OU = skdjf, CN = localhost, emailAddress = sadjflkadsj): : certificate has expired
Google Test trace:
/data0/somelongdirectorytoavoidrpathissues/src/kudu/src/kudu/rpc/rpc-test.cc:267: Connecting to 0.0.0.0:39605
I20260929 02:19:45.059975  7416 test_util.cc:175] -----------------------------------------------
I20260929 02:19:45.060148  7416 test_util.cc:176] Had fatal failures, leaving test files at /tmp/dist-test-taskYCLdOx/test-tmp/rpc-test.5.Parameters_TestRpc.TestCallWithChainCertAndChainCA_SSL_TCP.1790648383612808-7416-0
[  FAILED  ] Parameters/TestRpc.TestCallWithChainCertAndChainCA/SSL_TCP, where GetParam() = (true, false) (58 ms)
[ RUN      ] Parameters/TestRpc.TestCallWithPasswordProtectedKey/SSL_TCP
I20260929 02:19:45.083734  7479 acceptor_pool.cc:254] collecting diagnostics on the listening RPC socket 0.0.0.0:36771 every 8 connection(s)
I20260929 02:19:45.084475  7480 acceptor_pool.cc:254] collecting diagnostics on the listening RPC socket 0.0.0.0:36771 every 8 connection(s)
[       OK ] Parameters/TestRpc.TestCallWithPasswordProtectedKey/SSL_TCP (75 ms)
[ RUN      ] Parameters/TestRpc.TestCallToBadServer/SSL_TCP
I20260929 02:19:45.164255  7416 rpc-test.cc:394] Status: Network error: Client connection negotiation failed: client connection to 0.0.0.0:0: connect: Connection refused (error 111)
I20260929 02:19:45.165738  7416 rpc-test.cc:394] Status: Network error: Client connection negotiation failed: client connection to 0.0.0.0:0: connect: Connection refused (error 111)
I20260929 02:19:45.167033  7416 rpc-test.cc:394] Status: Network error: Client connection negotiation failed: client connection to 0.0.0.0:0: connect: Connection refused (error 111)
I20260929 02:19:45.168442  7416 rpc-test.cc:394] Status: Network error: Client connection negotiation failed: client connection to 0.0.0.0:0: connect: Connection refused (error 111)
I20260929 02:19:45.169881  7416 rpc-test.cc:394] Status: Network error: Client connection negotiation failed: client connection to 0.0.0.0:0: connect: Connection refused (error 111)
[       OK ] Parameters/TestRpc.TestCallToBadServer/SSL_TCP (37 ms)
[ RUN      ] Parameters/TestRpc.TestWrongService/SSL_TCP
I20260929 02:19:45.189566  7514 acceptor_pool.cc:254] collecting diagnostics on the listening RPC socket 0.0.0.0:35481 every 8 connection(s)
I20260929 02:19:45.190502  7515 acceptor_pool.cc:254] collecting diagnostics on the listening RPC socket 0.0.0.0:35481 every 8 connection(s)
I20260929 02:19:45.229758  7511 messenger.cc:345] service WrongServiceName not registered on TestServer
[       OK ] Parameters/TestRpc.TestWrongService/SSL_TCP (65 ms)
[ RUN      ] Parameters/TestRpc.TestConnectionKeepalive/SSL_TCP
I20260929 02:19:45.257943  7538 acceptor_pool.cc:254] collecting diagnostics on the listening RPC socket 0.0.0.0:35107 every 8 connection(s)
I20260929 02:19:45.258683  7539 acceptor_pool.cc:254] collecting diagnostics on the listening RPC socket 0.0.0.0:35107 every 8 connection(s)
I20260929 02:19:45.261992  7416 rpc-test.cc:488] Connecting to 0.0.0.0:35107
[       OK ] Parameters/TestRpc.TestConnectionKeepalive/SSL_TCP (1060 ms)
[ RUN      ] Parameters/TestRpc.TestClientConnectionMetrics/SSL_TCP
I20260929 02:19:46.330973  7563 acceptor_pool.cc:254] collecting diagnostics on the listening RPC socket 0.0.0.0:40377 every 8 connection(s)
I20260929 02:19:46.331734  7564 acceptor_pool.cc:254] collecting diagnostics on the listening RPC socket 0.0.0.0:40377 every 8 connection(s)
I20260929 02:19:46.335585  7416 rpc-test.cc:569] Connecting to 0.0.0.0:40377
[       OK ] Parameters/TestRpc.TestClientConnectionMetrics/SSL_TCP (117355 ms)
[ RUN      ] Parameters/TestRpc.TestCredentialsPolicy/SSL_TCP
I20260929 02:21:43.682793  7597 acceptor_pool.cc:254] collecting diagnostics on the listening RPC socket 0.0.0.0:40017 every 8 connection(s)
I20260929 02:21:43.683627  7598 acceptor_pool.cc:254] collecting diagnostics on the listening RPC socket 0.0.0.0:40017 every 8 connection(s)
I20260929 02:21:43.687052  7416 rpc-test.cc:700] Connecting to 0.0.0.0:40017
[       OK ] Parameters/TestRpc.TestCredentialsPolicy/SSL_TCP (95 ms)
[ RUN      ] Parameters/TestRpc.TestCallLongerThanKeepalive/SSL_TCP
I20260929 02:21:43.792609  7622 acceptor_pool.cc:254] collecting diagnostics on the listening RPC socket 0.0.0.0:38969 every 8 connection(s)
I20260929 02:21:43.793362  7623 acceptor_pool.cc:254] collecting diagnostics on the listening RPC socket 0.0.0.0:38969 every 8 connection(s)
I20260929 02:21:43.826383  7626 rpc-test-base.h:222] got call: sleep_micros: 3000000 deferred: true
I20260929 02:21:46.831275  7626 rpcz_store.cc:275] Call kudu.rpc.GenericCalculatorService.Sleep from 127.0.0.1:54782 (request call id 0) took 3005 ms. Trace:
I20260929 02:21:46.831818  7626 rpcz_store.cc:276] 0929 02:21:43.826127 (+     0us) service_pool.cc:170] Inserting onto call queue
0929 02:21:43.826233 (+   106us) service_pool.cc:227] Handling call
0929 02:21:46.831090 (+3004857us) inbound_call.cc:173] Queueing success response
Metrics: {}
[       OK ] Parameters/TestRpc.TestCallLongerThanKeepalive/SSL_TCP (3094 ms)
[ RUN      ] Parameters/TestRpc.TestRpcSidecar/SSL_TCP
I20260929 02:21:46.868620  7648 acceptor_pool.cc:254] collecting diagnostics on the listening RPC socket 0.0.0.0:38923 every 8 connection(s)
I20260929 02:21:46.869424  7649 acceptor_pool.cc:254] collecting diagnostics on the listening RPC socket 0.0.0.0:38923 every 8 connection(s)
[       OK ] Parameters/TestRpc.TestRpcSidecar/SSL_TCP (538 ms)
[ RUN      ] Parameters/TestRpc.TestRpcSidecarLimits/SSL_TCP
I20260929 02:22:06.330394  7675 acceptor_pool.cc:254] collecting diagnostics on the listening RPC socket 0.0.0.0:34723 every 8 connection(s)
I20260929 02:22:06.331494  7676 acceptor_pool.cc:254] collecting diagnostics on the listening RPC socket 0.0.0.0:34723 every 8 connection(s)
W20260929 02:22:06.362560  7416 serialization.cc:72] Serialized kudu.rpc_test.PushStringsRequestPB (2147483654 bytes) is larger than the maximum configured RPC message size (52428800 bytes). Sending anyway, but peer may reject the data.
W20260929 02:22:06.377813  7673 connection.cc:535] server connection from 127.0.0.1:43150 recv error: Network error: RPC frame had a length of 2147483714, but we only support messages up to 52428800 bytes long.
W20260929 02:22:06.378127  7673 connection.cc:158] shutting down server connection from 127.0.0.1:43150 with pending inbound data: 4/2147483714 bytes received; last active 0 ns ago: status Network error: RPC frame had a length of 2147483714, but we only support messages up to 52428800 bytes long.
W20260929 02:22:06.378986  7688 connection.cc:698] client connection to 0.0.0.0:34723 send error: Network error: failed to write to TLS socket: Connection reset by peer
W20260929 02:22:06.379698  7688 connection.cc:196] Error closing socket: Network error: TlsSocket::Close: Success
[       OK ] Parameters/TestRpc.TestRpcSidecarLimits/SSL_TCP (19651 ms)
[ RUN      ] Parameters/TestRpc.TestCallTimeoutDoesntAffectNegotiation/SSL_TCP
I20260929 02:22:07.053170  7700 acceptor_pool.cc:254] collecting diagnostics on the listening RPC socket 0.0.0.0:37275 every 8 connection(s)
I20260929 02:22:07.053951  7701 acceptor_pool.cc:254] collecting diagnostics on the listening RPC socket 0.0.0.0:37275 every 8 connection(s)
W20260929 02:22:07.072947  7696 negotiation.cc:266] Injecting 500ms delay in negotiation
I20260929 02:22:07.122488  7416 rpc-test-base.h:595] status: Timed out: connection negotiation to 0.0.0.0:37275 for RPC Sleep timed out after 0.050s (ON_OUTBOUND_QUEUE), seconds elapsed: 0.0506237
[       OK ] Parameters/TestRpc.TestCallTimeoutDoesntAffectNegotiation/SSL_TCP (556 ms)
[ RUN      ] Parameters/TestRpc.TestRpcHandlerLatencyMetric/SSL_TCP
I20260929 02:22:07.612344  7725 acceptor_pool.cc:254] collecting diagnostics on the listening RPC socket 0.0.0.0:39437 every 8 connection(s)
I20260929 02:22:07.613077  7726 acceptor_pool.cc:254] collecting diagnostics on the listening RPC socket 0.0.0.0:39437 every 8 connection(s)
I20260929 02:22:07.673499  7416 rpc-test.cc:1236] Sleep() min lat: 21686
I20260929 02:22:07.673750  7416 rpc-test.cc:1237] Sleep() mean lat: 21686
I20260929 02:22:07.673950  7416 rpc-test.cc:1238] Sleep() max lat: 21686
I20260929 02:22:07.674119  7416 rpc-test.cc:1239] Sleep() #calls: 1
[       OK ] Parameters/TestRpc.TestRpcHandlerLatencyMetric/SSL_TCP (90 ms)
[ RUN      ] Parameters/TestRpc.TimedOutOnResponseMetricServiceQueue/SSL_TCP
I20260929 02:22:07.706656  7751 acceptor_pool.cc:254] collecting diagnostics on the listening RPC socket 0.0.0.0:43245 every 8 connection(s)
I20260929 02:22:07.707444  7752 acceptor_pool.cc:254] collecting diagnostics on the listening RPC socket 0.0.0.0:43245 every 8 connection(s)
W20260929 02:22:07.778100  7753 rpcz_store.cc:267] Call kudu.rpc_test.CalculatorService.Sleep from 127.0.0.1:36370 (request call id 2) took 20 ms (client timeout 20 ms). Trace:
W20260929 02:22:07.778456  7753 rpcz_store.cc:269] 0929 02:22:07.757503 (+     0us) service_pool.cc:170] Inserting onto call queue
0929 02:22:07.777846 (+ 20343us) service_pool.cc:214] Skipping call since client already timed out
0929 02:22:07.778025 (+   179us) inbound_call.cc:173] Queueing failure response
Metrics: {}
[       OK ] Parameters/TestRpc.TimedOutOnResponseMetricServiceQueue/SSL_TCP (102 ms)
[ RUN      ] Parameters/TestRpc.RpcPendingConnectionsMetric/SSL_TCP
I20260929 02:22:07.795440  7774 acceptor_pool.cc:254] collecting diagnostics on the listening RPC socket 0.0.0.0:36619 every 8 connection(s)
I20260929 02:22:07.796203  7775 acceptor_pool.cc:254] collecting diagnostics on the listening RPC socket 0.0.0.0:36619 every 8 connection(s)
W20260929 02:22:07.801445  7770 negotiation.cc:337] Failed RPC negotiation. Trace:
0929 02:22:07.800060 (+     0us) reactor.cc:625] Submitting negotiation task for server connection from 127.0.0.1:47038 (local address 127.0.0.1:36619)
0929 02:22:07.800485 (+   425us) server_negotiation.cc:206] Beginning negotiation
0929 02:22:07.800503 (+    18us) server_negotiation.cc:399] Waiting for connection header
0929 02:22:07.800747 (+   244us) negotiation.cc:327] Negotiation complete: Network error: Server connection negotiation failed: server connection from 127.0.0.1:47038: BlockingRecv error: recv got EOF from 127.0.0.1:47038 (error 108)
Metrics: {"server-negotiator.queue_time_us":118}
[       OK ] Parameters/TestRpc.RpcPendingConnectionsMetric/SSL_TCP (29 ms)
[ RUN      ] Parameters/TestRpc.TestRpcContextClientDeadline/SSL_TCP
I20260929 02:22:07.845546  7790 acceptor_pool.cc:254] collecting diagnostics on the listening RPC socket 0.0.0.0:43497 every 8 connection(s)
I20260929 02:22:07.846386  7791 acceptor_pool.cc:254] collecting diagnostics on the listening RPC socket 0.0.0.0:43497 every 8 connection(s)
[       OK ] Parameters/TestRpc.TestRpcContextClientDeadline/SSL_TCP (100 ms)
[ RUN      ] Parameters/TestRpc.TestApplicationFeatureFlagUnsupportedServer/SSL_TCP
I20260929 02:22:07.934126  7815 acceptor_pool.cc:254] collecting diagnostics on the listening RPC socket 0.0.0.0:44369 every 8 connection(s)
I20260929 02:22:07.934870  7816 acceptor_pool.cc:254] collecting diagnostics on the listening RPC socket 0.0.0.0:44369 every 8 connection(s)
[       OK ] Parameters/TestRpc.TestApplicationFeatureFlagUnsupportedServer/SSL_TCP (57 ms)
[ RUN      ] Parameters/TestRpc.TestCancellationAsync/SSL_TCP
I20260929 02:22:07.988879  7840 acceptor_pool.cc:254] collecting diagnostics on the listening RPC socket 0.0.0.0:36239 every 8 connection(s)
I20260929 02:22:07.989688  7841 acceptor_pool.cc:254] collecting diagnostics on the listening RPC socket 0.0.0.0:36239 every 8 connection(s)
I20260929 02:22:07.992909  7416 rpc-test.cc:1716] Connecting to 0.0.0.0:36239
I20260929 02:22:08.017427  7416 test_util.cc:268] Using random seed: -647096330
I20260929 02:22:08.265275  7844 rpc-test-base.h:240] got call: sleep_micros: 500 pattern: 4294967295 num_repetitions: 2097152 sidecar_idx: 0
I20260929 02:22:08.438640  7843 rpc-test-base.h:240] got call: sleep_micros: 500 pattern: 4294967295 num_repetitions: 2097152 sidecar_idx: 0
I20260929 02:22:08.635878  7844 rpc-test-base.h:240] got call: sleep_micros: 500 pattern: 4294967295 num_repetitions: 2097152 sidecar_idx: 0
I20260929 02:22:08.827072  7843 rpc-test-base.h:240] got call: sleep_micros: 500 pattern: 4294967295 num_repetitions: 2097152 sidecar_idx: 0
I20260929 02:22:09.014228  7844 rpc-test-base.h:240] got call: sleep_micros: 500 pattern: 4294967295 num_repetitions: 2097152 sidecar_idx: 0
I20260929 02:22:09.201505  7844 rpc-test-base.h:240] got call: sleep_micros: 500 pattern: 4294967295 num_repetitions: 2097152 sidecar_idx: 0
I20260929 02:22:09.383823  7844 rpc-test-base.h:240] got call: sleep_micros: 500 pattern: 4294967295 num_repetitions: 2097152 sidecar_idx: 0
I20260929 02:22:09.567643  7844 rpc-test-base.h:240] got call: sleep_micros: 500 pattern: 4294967295 num_repetitions: 2097152 sidecar_idx: 0
W20260929 02:22:09.728406  7839 connection.cc:196] Error closing socket: Network error: TlsSocket::Close: Broken pipe
W20260929 02:22:09.729861  7839 connection.cc:441] server connection from 127.0.0.1:42306 torn down before Call kudu.rpc.GenericCalculatorService.SleepWithSidecar from 127.0.0.1:42306 (request call id 8) could send its response
[       OK ] Parameters/TestRpc.TestCancellationAsync/SSL_TCP (1766 ms)
[ RUN      ] Parameters/TestRpc.TestPerformanceBySocketType/SSL_TCP
I20260929 02:22:09.844758  7865 acceptor_pool.cc:254] collecting diagnostics on the listening RPC socket 0.0.0.0:33389 every 8 connection(s)
I20260929 02:22:09.845496  7866 acceptor_pool.cc:254] collecting diagnostics on the listening RPC socket 0.0.0.0:33389 every 8 connection(s)
I20260929 02:22:09.848699  7416 rpc-test.cc:1846] Connecting to 0.0.0.0:33389
I20260929 02:22:29.386777  7416 rpc-test.cc:1859] Sending 1024MB via ssl-enabled tcp socket: real 19.517s	user 16.451s	sys 11.244s
I20260929 02:22:48.658540  7416 rpc-test.cc:1859] Sending 1024MB via ssl-enabled tcp socket: real 19.271s	user 16.413s	sys 10.876s
I20260929 02:23:08.107378  7416 rpc-test.cc:1859] Sending 1024MB via ssl-enabled tcp socket: real 19.448s	user 16.474s	sys 11.135s
I20260929 02:23:27.412475  7416 rpc-test.cc:1859] Sending 1024MB via ssl-enabled tcp socket: real 19.305s	user 16.414s	sys 10.956s
I20260929 02:23:46.881916  7416 rpc-test.cc:1859] Sending 1024MB via ssl-enabled tcp socket: real 19.469s	user 16.656s	sys 10.987s
[       OK ] Parameters/TestRpc.TestPerformanceBySocketType/SSL_TCP (97161 ms)
[----------] 20 tests from Parameters/TestRpc (243233 ms total)

[----------] 1 test from Parameters/TestRpcSocketTxRxQueue
[ RUN      ] Parameters/TestRpcSocketTxRxQueue.OverCapacity/0
W20260929 02:23:47.357033  7929 negotiation.cc:337] Failed RPC negotiation. Trace:
0929 02:23:46.956613 (+     0us) reactor.cc:625] Submitting negotiation task for client connection to 0.0.0.0:41727 (local address 127.0.0.1:48566)
0929 02:23:46.957392 (+   779us) negotiation.cc:107] Waiting for socket to connect
0929 02:23:46.957446 (+    54us) client_negotiation.cc:174] Beginning negotiation
0929 02:23:46.957738 (+   292us) client_negotiation.cc:252] Sending NEGOTIATE NegotiatePB request
0929 02:23:47.355756 (+398018us) negotiation.cc:327] Negotiation complete: Network error: Client connection negotiation failed: client connection to 0.0.0.0:41727: BlockingRecv error: recv error from unknown peer: Transport endpoint is not connected (error 107)
Metrics: {"client-negotiator.queue_time_us":262}
W20260929 02:23:47.356922  7901 negotiation.cc:337] Failed RPC negotiation. Trace:
0929 02:23:46.924571 (+     0us) reactor.cc:625] Submitting negotiation task for client connection to 0.0.0.0:41727 (local address 127.0.0.1:48532)
0929 02:23:46.925225 (+   654us) negotiation.cc:107] Waiting for socket to connect
0929 02:23:46.925264 (+    39us) client_negotiation.cc:174] Beginning negotiation
0929 02:23:46.925529 (+   265us) client_negotiation.cc:252] Sending NEGOTIATE NegotiatePB request
0929 02:23:47.355003 (+429474us) negotiation.cc:327] Negotiation complete: Network error: Client connection negotiation failed: client connection to 0.0.0.0:41727: BlockingRecv error: recv error from unknown peer: Transport endpoint is not connected (error 107)
Metrics: {"client-negotiator.queue_time_us":179}
W20260929 02:23:47.358672  7938 negotiation.cc:337] Failed RPC negotiation. Trace:
0929 02:23:46.969072 (+     0us) reactor.cc:625] Submitting negotiation task for client connection to 0.0.0.0:41727 (local address 127.0.0.1:48570)
0929 02:23:46.969894 (+   822us) negotiation.cc:107] Waiting for socket to connect
0929 02:23:46.969944 (+    50us) client_negotiation.cc:174] Beginning negotiation
0929 02:23:46.970247 (+   303us) client_negotiation.cc:252] Sending NEGOTIATE NegotiatePB request
0929 02:23:47.356585 (+386338us) negotiation.cc:327] Negotiation complete: Network error: Client connection negotiation failed: client connection to 0.0.0.0:41727: BlockingRecv error: recv error from unknown peer: Transport endpoint is not connected (error 107)
Metrics: {"client-negotiator.queue_time_us":190}
W20260929 02:23:47.361040  7920 negotiation.cc:337] Failed RPC negotiation. Trace:
0929 02:23:46.944140 (+     0us) reactor.cc:625] Submitting negotiation task for client connection to 0.0.0.0:41727 (local address 127.0.0.1:48556)
0929 02:23:46.944772 (+   632us) negotiation.cc:107] Waiting for socket to connect
0929 02:23:46.944824 (+    52us) client_negotiation.cc:174] Beginning negotiation
0929 02:23:46.945131 (+   307us) client_negotiation.cc:252] Sending NEGOTIATE NegotiatePB request
0929 02:23:47.355003 (+409872us) negotiation.cc:327] Negotiation complete: Network error: Client connection negotiation failed: client connection to 0.0.0.0:41727: BlockingRecv error: recv error from unknown peer: Transport endpoint is not connected (error 107)
Metrics: {"client-negotiator.queue_time_us":149}
W20260929 02:23:47.361377  7892 negotiation.cc:337] Failed RPC negotiation. Trace:
0929 02:23:46.917757 (+     0us) reactor.cc:625] Submitting negotiation task for client connection to 0.0.0.0:41727 (local address 127.0.0.1:48526)
0929 02:23:46.918458 (+   701us) negotiation.cc:107] Waiting for socket to connect
0929 02:23:46.918510 (+    52us) client_negotiation.cc:174] Beginning negotiation
0929 02:23:46.919018 (+   508us) client_negotiation.cc:252] Sending NEGOTIATE NegotiatePB request
0929 02:23:47.355077 (+436059us) negotiation.cc:327] Negotiation complete: Network error: Client connection negotiation failed: client connection to 0.0.0.0:41727: BlockingRecv error: recv error from unknown peer: Transport endpoint is not connected (error 107)
Metrics: {"client-negotiator.queue_time_us":173}
W20260929 02:23:47.361079  7911 negotiation.cc:337] Failed RPC negotiation. Trace:
0929 02:23:46.931779 (+     0us) reactor.cc:625] Submitting negotiation task for client connection to 0.0.0.0:41727 (local address 127.0.0.1:48540)
0929 02:23:46.932231 (+   452us) negotiation.cc:107] Waiting for socket to connect
0929 02:23:46.932260 (+    29us) client_negotiation.cc:174] Beginning negotiation
0929 02:23:46.932448 (+   188us) client_negotiation.cc:252] Sending NEGOTIATE NegotiatePB request
0929 02:23:47.355084 (+422636us) negotiation.cc:327] Negotiation complete: Network error: Client connection negotiation failed: client connection to 0.0.0.0:41727: BlockingRecv error: recv error from unknown peer: Transport endpoint is not connected (error 107)
Metrics: {"client-negotiator.queue_time_us":124}
[       OK ] Parameters/TestRpcSocketTxRxQueue.OverCapacity/0 (1256 ms)
[----------] 1 test from Parameters/TestRpcSocketTxRxQueue (1256 ms total)

[----------] Global test environment tear-down
[==========] 21 tests from 2 test suites ran. (244491 ms total)
[  PASSED  ] 20 tests.
[  FAILED  ] 1 test, listed below:
[  FAILED  ] Parameters/TestRpc.TestCallWithChainCertAndChainCA/SSL_TCP, where GetParam() = (true, false)

 1 FAILED TEST