Diagnosed failure
Parameters/TestRpc.TestCallWithChainCertAndChainCA/SSL_UnixSocket: /data0/somelongdirectorytoavoidrpathissues/src/kudu/src/kudu/rpc/rpc-test.cc:270: Failure
Failed
Bad status: Runtime error: could not verify certificate chain (error with cert: subject=CN = localhost, ST = sadfjas, C = AS, emailAddress = sdflkdsajf, O = lskdfjlsad, OU = sldfkja, issuer=C = AS, ST = ASDfkjdhf, L = lskdjf, O = saldfja, OU = skdjf, CN = localhost, emailAddress = sadjflkadsj): : certificate has expired
Google Test trace:
/data0/somelongdirectorytoavoidrpathissues/src/kudu/src/kudu/rpc/rpc-test.cc:267: Connecting to unix:/tmp/dist-test-taskH7srHI/test-tmp/rpc-test-4f4e0452243245d98c5f497c534f2218.sock
I20260924 00:30:38.448995 2072 test_util.cc:175] -----------------------------------------------
I20260924 00:30:38.449208 2072 test_util.cc:176] Had fatal failures, leaving test files at /tmp/dist-test-taskH7srHI/test-tmp/rpc-test.6.Parameters_TestRpc.TestCallWithChainCertAndChainCA_SSL_UnixSocket.1790209837082961-2072-0
Full log
Note: This is test shard 7 of 8.
[==========] Running 21 tests from 2 test suites.
[----------] Global test environment set-up.
[----------] 20 tests from Parameters/TestRpc
[ RUN ] Parameters/TestRpc.TestMessengerCreateDestroy/SSL_UnixSocket
WARNING: Logging before InitGoogleLogging() is written to STDERR
I20260924 00:30:37.194448 2072 rpc-test.cc:169] started messenger TestCreateDestroy
[ OK ] Parameters/TestRpc.TestMessengerCreateDestroy/SSL_UnixSocket (1189 ms)
[ RUN ] Parameters/TestRpc.TestNegotiationDeadlock/SSL_UnixSocket
I20260924 00:30:38.346566 2094 acceptor_pool.cc:254] collecting diagnostics on the listening RPC socket unix:/tmp/dist-test-taskH7srHI/test-tmp/rpc-test-cb1909c34ae141809d2bcd9b5dfb5a5d.sock every 8 connection(s)
I20260924 00:30:38.348148 2095 acceptor_pool.cc:254] collecting diagnostics on the listening RPC socket unix:/tmp/dist-test-taskH7srHI/test-tmp/rpc-test-cb1909c34ae141809d2bcd9b5dfb5a5d.sock every 8 connection(s)
[ OK ] Parameters/TestRpc.TestNegotiationDeadlock/SSL_UnixSocket (73 ms)
[ RUN ] Parameters/TestRpc.TestCallWithChainCertAndChainCA/SSL_UnixSocket
I20260924 00:30:38.419446 2110 acceptor_pool.cc:254] collecting diagnostics on the listening RPC socket unix:/tmp/dist-test-taskH7srHI/test-tmp/rpc-test-4f4e0452243245d98c5f497c534f2218.sock every 8 connection(s)
I20260924 00:30:38.421628 2111 acceptor_pool.cc:254] collecting diagnostics on the listening RPC socket unix:/tmp/dist-test-taskH7srHI/test-tmp/rpc-test-4f4e0452243245d98c5f497c534f2218.sock every 8 connection(s)
/data0/somelongdirectorytoavoidrpathissues/src/kudu/src/kudu/rpc/rpc-test.cc:270: Failure
Failed
Bad status: Runtime error: could not verify certificate chain (error with cert: subject=CN = localhost, ST = sadfjas, C = AS, emailAddress = sdflkdsajf, O = lskdfjlsad, OU = sldfkja, issuer=C = AS, ST = ASDfkjdhf, L = lskdjf, O = saldfja, OU = skdjf, CN = localhost, emailAddress = sadjflkadsj): : certificate has expired
Google Test trace:
/data0/somelongdirectorytoavoidrpathissues/src/kudu/src/kudu/rpc/rpc-test.cc:267: Connecting to unix:/tmp/dist-test-taskH7srHI/test-tmp/rpc-test-4f4e0452243245d98c5f497c534f2218.sock
I20260924 00:30:38.448995 2072 test_util.cc:175] -----------------------------------------------
I20260924 00:30:38.449208 2072 test_util.cc:176] Had fatal failures, leaving test files at /tmp/dist-test-taskH7srHI/test-tmp/rpc-test.6.Parameters_TestRpc.TestCallWithChainCertAndChainCA_SSL_UnixSocket.1790209837082961-2072-0
[ FAILED ] Parameters/TestRpc.TestCallWithChainCertAndChainCA/SSL_UnixSocket, where GetParam() = (true, true) (49 ms)
[ RUN ] Parameters/TestRpc.TestCallWithPasswordProtectedKey/SSL_UnixSocket
I20260924 00:30:38.501657 2135 acceptor_pool.cc:254] collecting diagnostics on the listening RPC socket unix:/tmp/dist-test-taskH7srHI/test-tmp/rpc-test-3aae0b9bbb9f4984860227478aedfb26.sock every 8 connection(s)
I20260924 00:30:38.502318 2136 acceptor_pool.cc:254] collecting diagnostics on the listening RPC socket unix:/tmp/dist-test-taskH7srHI/test-tmp/rpc-test-3aae0b9bbb9f4984860227478aedfb26.sock every 8 connection(s)
[ OK ] Parameters/TestRpc.TestCallWithPasswordProtectedKey/SSL_UnixSocket (102 ms)
[ RUN ] Parameters/TestRpc.TestCallToBadServer/SSL_UnixSocket
I20260924 00:30:38.592468 2072 rpc-test.cc:394] Status: Network error: Client connection negotiation failed: client connection to 0.0.0.0:0: connect: Connection refused (error 111)
I20260924 00:30:38.593907 2072 rpc-test.cc:394] Status: Network error: Client connection negotiation failed: client connection to 0.0.0.0:0: connect: Connection refused (error 111)
I20260924 00:30:38.595287 2072 rpc-test.cc:394] Status: Network error: Client connection negotiation failed: client connection to 0.0.0.0:0: connect: Connection refused (error 111)
I20260924 00:30:38.596606 2072 rpc-test.cc:394] Status: Network error: Client connection negotiation failed: client connection to 0.0.0.0:0: connect: Connection refused (error 111)
I20260924 00:30:38.597872 2072 rpc-test.cc:394] Status: Network error: Client connection negotiation failed: client connection to 0.0.0.0:0: connect: Connection refused (error 111)
[ OK ] Parameters/TestRpc.TestCallToBadServer/SSL_UnixSocket (48 ms)
[ RUN ] Parameters/TestRpc.TestWrongService/SSL_UnixSocket
I20260924 00:30:38.616813 2170 acceptor_pool.cc:254] collecting diagnostics on the listening RPC socket unix:/tmp/dist-test-taskH7srHI/test-tmp/rpc-test-de42985ece9f458f9bdc570181c75ae7.sock every 8 connection(s)
I20260924 00:30:38.617616 2171 acceptor_pool.cc:254] collecting diagnostics on the listening RPC socket unix:/tmp/dist-test-taskH7srHI/test-tmp/rpc-test-de42985ece9f458f9bdc570181c75ae7.sock every 8 connection(s)
I20260924 00:30:38.654816 2167 messenger.cc:345] service WrongServiceName not registered on TestServer
W20260924 00:30:38.657567 2167 connection.cc:196] Error closing socket: Network error: TlsSocket::Close: Broken pipe
[ OK ] Parameters/TestRpc.TestWrongService/SSL_UnixSocket (62 ms)
[ RUN ] Parameters/TestRpc.TestConnectionKeepalive/SSL_UnixSocket
I20260924 00:30:38.684407 2193 acceptor_pool.cc:254] collecting diagnostics on the listening RPC socket unix:/tmp/dist-test-taskH7srHI/test-tmp/rpc-test-67d6c027f9414d9d9063a60fc6c83869.sock every 8 connection(s)
I20260924 00:30:38.685099 2194 acceptor_pool.cc:254] collecting diagnostics on the listening RPC socket unix:/tmp/dist-test-taskH7srHI/test-tmp/rpc-test-67d6c027f9414d9d9063a60fc6c83869.sock every 8 connection(s)
I20260924 00:30:38.688371 2072 rpc-test.cc:488] Connecting to unix:/tmp/dist-test-taskH7srHI/test-tmp/rpc-test-67d6c027f9414d9d9063a60fc6c83869.sock
W20260924 00:30:39.166033 2206 connection.cc:196] Error closing socket: Network error: TlsSocket::Close: Broken pipe
[ OK ] Parameters/TestRpc.TestConnectionKeepalive/SSL_UnixSocket (1062 ms)
[ RUN ] Parameters/TestRpc.TestClientConnectionMetrics/SSL_UnixSocket
I20260924 00:30:39.750918 2218 acceptor_pool.cc:254] collecting diagnostics on the listening RPC socket unix:/tmp/dist-test-taskH7srHI/test-tmp/rpc-test-dc6a93d038424b7e976a66e963b0bdab.sock every 8 connection(s)
I20260924 00:30:39.751703 2219 acceptor_pool.cc:254] collecting diagnostics on the listening RPC socket unix:/tmp/dist-test-taskH7srHI/test-tmp/rpc-test-dc6a93d038424b7e976a66e963b0bdab.sock every 8 connection(s)
I20260924 00:30:39.754864 2072 rpc-test.cc:569] Connecting to unix:/tmp/dist-test-taskH7srHI/test-tmp/rpc-test-dc6a93d038424b7e976a66e963b0bdab.sock
W20260924 00:32:58.548645 2215 connection.cc:196] Error closing socket: Network error: TlsSocket::Close: Broken pipe
[ OK ] Parameters/TestRpc.TestClientConnectionMetrics/SSL_UnixSocket (138831 ms)
[ RUN ] Parameters/TestRpc.TestCredentialsPolicy/SSL_UnixSocket
I20260924 00:32:58.572808 2255 acceptor_pool.cc:254] collecting diagnostics on the listening RPC socket unix:/tmp/dist-test-taskH7srHI/test-tmp/rpc-test-bd21eaf84b964da7997acc17463ec6b5.sock every 8 connection(s)
I20260924 00:32:58.573654 2256 acceptor_pool.cc:254] collecting diagnostics on the listening RPC socket unix:/tmp/dist-test-taskH7srHI/test-tmp/rpc-test-bd21eaf84b964da7997acc17463ec6b5.sock every 8 connection(s)
I20260924 00:32:58.576782 2072 rpc-test.cc:700] Connecting to unix:/tmp/dist-test-taskH7srHI/test-tmp/rpc-test-bd21eaf84b964da7997acc17463ec6b5.sock
W20260924 00:32:58.608805 2254 connection.cc:196] Error closing socket: Network error: TlsSocket::Close: Broken pipe
[ OK ] Parameters/TestRpc.TestCredentialsPolicy/SSL_UnixSocket (71 ms)
[ RUN ] Parameters/TestRpc.TestCallLongerThanKeepalive/SSL_UnixSocket
I20260924 00:32:58.659773 2280 acceptor_pool.cc:254] collecting diagnostics on the listening RPC socket unix:/tmp/dist-test-taskH7srHI/test-tmp/rpc-test-b74276c7429b4150b991d9fdb43b8b74.sock every 8 connection(s)
I20260924 00:32:58.660483 2281 acceptor_pool.cc:254] collecting diagnostics on the listening RPC socket unix:/tmp/dist-test-taskH7srHI/test-tmp/rpc-test-b74276c7429b4150b991d9fdb43b8b74.sock every 8 connection(s)
I20260924 00:32:58.690297 2284 rpc-test-base.h:222] got call: sleep_micros: 3000000 deferred: true
I20260924 00:33:01.694806 2284 rpcz_store.cc:275] Call kudu.rpc.GenericCalculatorService.Sleep from unix:<unnamed> (request call id 0) took 3004 ms. Trace:
I20260924 00:33:01.695139 2284 rpcz_store.cc:276] 0924 00:32:58.690138 (+ 0us) service_pool.cc:170] Inserting onto call queue
0924 00:32:58.690239 (+ 101us) service_pool.cc:227] Handling call
0924 00:33:01.694736 (+3004497us) inbound_call.cc:173] Queueing success response
Metrics: {}
W20260924 00:33:01.699949 2277 connection.cc:196] Error closing socket: Network error: TlsSocket::Close: Broken pipe
[ OK ] Parameters/TestRpc.TestCallLongerThanKeepalive/SSL_UnixSocket (3075 ms)
[ RUN ] Parameters/TestRpc.TestRpcSidecar/SSL_UnixSocket
I20260924 00:33:01.736490 2305 acceptor_pool.cc:254] collecting diagnostics on the listening RPC socket unix:/tmp/dist-test-taskH7srHI/test-tmp/rpc-test-c09b39216f5e4edb84fe10ca834f8586.sock every 8 connection(s)
I20260924 00:33:01.737278 2306 acceptor_pool.cc:254] collecting diagnostics on the listening RPC socket unix:/tmp/dist-test-taskH7srHI/test-tmp/rpc-test-c09b39216f5e4edb84fe10ca834f8586.sock every 8 connection(s)
W20260924 00:33:02.294070 2302 connection.cc:196] Error closing socket: Network error: TlsSocket::Close: Broken pipe
[ OK ] Parameters/TestRpc.TestRpcSidecar/SSL_UnixSocket (594 ms)
[ RUN ] Parameters/TestRpc.TestRpcSidecarLimits/SSL_UnixSocket
I20260924 00:33:19.508669 2332 acceptor_pool.cc:254] collecting diagnostics on the listening RPC socket unix:/tmp/dist-test-taskH7srHI/test-tmp/rpc-test-486112b2b245455fb0aaed45e9b589c7.sock every 8 connection(s)
I20260924 00:33:19.509519 2333 acceptor_pool.cc:254] collecting diagnostics on the listening RPC socket unix:/tmp/dist-test-taskH7srHI/test-tmp/rpc-test-486112b2b245455fb0aaed45e9b589c7.sock every 8 connection(s)
W20260924 00:33:19.526729 2072 serialization.cc:72] Serialized kudu.rpc_test.PushStringsRequestPB (2147483654 bytes) is larger than the maximum configured RPC message size (52428800 bytes). Sending anyway, but peer may reject the data.
W20260924 00:33:19.537282 2329 connection.cc:535] server connection from unix:<unnamed> recv error: Network error: RPC frame had a length of 2147483714, but we only support messages up to 52428800 bytes long.
W20260924 00:33:19.537628 2329 connection.cc:158] shutting down server connection from unix:<unnamed> with pending inbound data: 4/2147483714 bytes received; last active 0 ns ago: status Network error: RPC frame had a length of 2147483714, but we only support messages up to 52428800 bytes long.
W20260924 00:33:19.538535 2345 connection.cc:698] client connection to unix:/tmp/dist-test-taskH7srHI/test-tmp/rpc-test-486112b2b245455fb0aaed45e9b589c7.sock send error: Network error: failed to write to TLS socket: Broken pipe
W20260924 00:33:19.539301 2345 connection.cc:196] Error closing socket: Network error: TlsSocket::Close: Success
[ OK ] Parameters/TestRpc.TestRpcSidecarLimits/SSL_UnixSocket (17858 ms)
[ RUN ] Parameters/TestRpc.TestCallTimeoutDoesntAffectNegotiation/SSL_UnixSocket
I20260924 00:33:20.189851 2357 acceptor_pool.cc:254] collecting diagnostics on the listening RPC socket unix:/tmp/dist-test-taskH7srHI/test-tmp/rpc-test-ce42f496f380488987c189a1b553e830.sock every 8 connection(s)
I20260924 00:33:20.190580 2358 acceptor_pool.cc:254] collecting diagnostics on the listening RPC socket unix:/tmp/dist-test-taskH7srHI/test-tmp/rpc-test-ce42f496f380488987c189a1b553e830.sock every 8 connection(s)
W20260924 00:33:20.221290 2353 negotiation.cc:266] Injecting 500ms delay in negotiation
I20260924 00:33:20.271903 2072 rpc-test-base.h:595] status: Timed out: connection negotiation to unix:/tmp/dist-test-taskH7srHI/test-tmp/rpc-test-ce42f496f380488987c189a1b553e830.sock for RPC Sleep timed out after 0.050s (ON_OUTBOUND_QUEUE), seconds elapsed: 0.0515994
W20260924 00:33:20.733995 2354 connection.cc:196] Error closing socket: Network error: TlsSocket::Close: Broken pipe
[ OK ] Parameters/TestRpc.TestCallTimeoutDoesntAffectNegotiation/SSL_UnixSocket (579 ms)
[ RUN ] Parameters/TestRpc.TestRpcHandlerLatencyMetric/SSL_UnixSocket
I20260924 00:33:20.764098 2382 acceptor_pool.cc:254] collecting diagnostics on the listening RPC socket unix:/tmp/dist-test-taskH7srHI/test-tmp/rpc-test-2aa93ca5ea3648d59536d51a2e56d804.sock every 8 connection(s)
I20260924 00:33:20.764886 2383 acceptor_pool.cc:254] collecting diagnostics on the listening RPC socket unix:/tmp/dist-test-taskH7srHI/test-tmp/rpc-test-2aa93ca5ea3648d59536d51a2e56d804.sock every 8 connection(s)
I20260924 00:33:20.821820 2072 rpc-test.cc:1236] Sleep() min lat: 21665
I20260924 00:33:20.822070 2072 rpc-test.cc:1237] Sleep() mean lat: 21665
I20260924 00:33:20.822266 2072 rpc-test.cc:1238] Sleep() max lat: 21665
I20260924 00:33:20.822429 2072 rpc-test.cc:1239] Sleep() #calls: 1
W20260924 00:33:20.825016 2379 connection.cc:196] Error closing socket: Network error: TlsSocket::Close: Broken pipe
[ OK ] Parameters/TestRpc.TestRpcHandlerLatencyMetric/SSL_UnixSocket (91 ms)
[ RUN ] Parameters/TestRpc.TimedOutOnResponseMetricServiceQueue/SSL_UnixSocket
I20260924 00:33:20.847039 2408 acceptor_pool.cc:254] collecting diagnostics on the listening RPC socket unix:/tmp/dist-test-taskH7srHI/test-tmp/rpc-test-92747258033147779a73f3c57bc9a710.sock every 8 connection(s)
I20260924 00:33:20.847770 2409 acceptor_pool.cc:254] collecting diagnostics on the listening RPC socket unix:/tmp/dist-test-taskH7srHI/test-tmp/rpc-test-92747258033147779a73f3c57bc9a710.sock every 8 connection(s)
W20260924 00:33:20.917307 2410 rpcz_store.cc:267] Call kudu.rpc_test.CalculatorService.Sleep from unix:<unnamed> (request call id 2) took 20 ms (client timeout 20 ms). Trace:
W20260924 00:33:20.917730 2410 rpcz_store.cc:269] 0924 00:33:20.896771 (+ 0us) service_pool.cc:170] Inserting onto call queue
0924 00:33:20.917156 (+ 20385us) service_pool.cc:214] Skipping call since client already timed out
0924 00:33:20.917236 (+ 80us) inbound_call.cc:173] Queueing failure response
Metrics: {}
W20260924 00:33:20.920150 2405 connection.cc:196] Error closing socket: Network error: TlsSocket::Close: Broken pipe
[ OK ] Parameters/TestRpc.TimedOutOnResponseMetricServiceQueue/SSL_UnixSocket (94 ms)
[ RUN ] Parameters/TestRpc.RpcPendingConnectionsMetric/SSL_UnixSocket
I20260924 00:33:20.934363 2431 acceptor_pool.cc:254] collecting diagnostics on the listening RPC socket 0.0.0.0:42779 every 8 connection(s)
I20260924 00:33:20.935091 2432 acceptor_pool.cc:254] collecting diagnostics on the listening RPC socket 0.0.0.0:42779 every 8 connection(s)
W20260924 00:33:20.940156 2427 negotiation.cc:337] Failed RPC negotiation. Trace:
0924 00:33:20.938883 (+ 0us) reactor.cc:625] Submitting negotiation task for server connection from 127.0.0.1:40484 (local address 127.0.0.1:42779)
0924 00:33:20.939320 (+ 437us) server_negotiation.cc:206] Beginning negotiation
0924 00:33:20.939338 (+ 18us) server_negotiation.cc:399] Waiting for connection header
0924 00:33:20.939579 (+ 241us) negotiation.cc:327] Negotiation complete: Network error: Server connection negotiation failed: server connection from 127.0.0.1:40484: BlockingRecv error: recv got EOF from 127.0.0.1:40484 (error 108)
Metrics: {"server-negotiator.queue_time_us":94}
[ OK ] Parameters/TestRpc.RpcPendingConnectionsMetric/SSL_UnixSocket (29 ms)
[ RUN ] Parameters/TestRpc.TestRpcContextClientDeadline/SSL_UnixSocket
I20260924 00:33:20.988978 2447 acceptor_pool.cc:254] collecting diagnostics on the listening RPC socket unix:/tmp/dist-test-taskH7srHI/test-tmp/rpc-test-08c74f1d18f8417194bab31c173fe82b.sock every 8 connection(s)
I20260924 00:33:20.989758 2448 acceptor_pool.cc:254] collecting diagnostics on the listening RPC socket unix:/tmp/dist-test-taskH7srHI/test-tmp/rpc-test-08c74f1d18f8417194bab31c173fe82b.sock every 8 connection(s)
W20260924 00:33:21.049762 2444 connection.cc:196] Error closing socket: Network error: TlsSocket::Close: Broken pipe
[ OK ] Parameters/TestRpc.TestRpcContextClientDeadline/SSL_UnixSocket (100 ms)
[ RUN ] Parameters/TestRpc.TestApplicationFeatureFlagUnsupportedServer/SSL_UnixSocket
I20260924 00:33:21.078719 2472 acceptor_pool.cc:254] collecting diagnostics on the listening RPC socket unix:/tmp/dist-test-taskH7srHI/test-tmp/rpc-test-fe7ee82ca4304a73936f2a25ca87ecb8.sock every 8 connection(s)
I20260924 00:33:21.079481 2473 acceptor_pool.cc:254] collecting diagnostics on the listening RPC socket unix:/tmp/dist-test-taskH7srHI/test-tmp/rpc-test-fe7ee82ca4304a73936f2a25ca87ecb8.sock every 8 connection(s)
[ OK ] Parameters/TestRpc.TestApplicationFeatureFlagUnsupportedServer/SSL_UnixSocket (63 ms)
[ RUN ] Parameters/TestRpc.TestCancellationAsync/SSL_UnixSocket
I20260924 00:33:21.144536 2497 acceptor_pool.cc:254] collecting diagnostics on the listening RPC socket unix:/tmp/dist-test-taskH7srHI/test-tmp/rpc-test-0c362fdc1ac04f569ee2fe4568bf5159.sock every 8 connection(s)
I20260924 00:33:21.145296 2498 acceptor_pool.cc:254] collecting diagnostics on the listening RPC socket unix:/tmp/dist-test-taskH7srHI/test-tmp/rpc-test-0c362fdc1ac04f569ee2fe4568bf5159.sock every 8 connection(s)
I20260924 00:33:21.148512 2072 rpc-test.cc:1716] Connecting to unix:/tmp/dist-test-taskH7srHI/test-tmp/rpc-test-0c362fdc1ac04f569ee2fe4568bf5159.sock
I20260924 00:33:21.168169 2072 test_util.cc:268] Using random seed: -1087281390
I20260924 00:33:21.408309 2501 rpc-test-base.h:240] got call: sleep_micros: 500 pattern: 4294967295 num_repetitions: 2097152 sidecar_idx: 0
I20260924 00:33:21.612687 2500 rpc-test-base.h:240] got call: sleep_micros: 500 pattern: 4294967295 num_repetitions: 2097152 sidecar_idx: 0
I20260924 00:33:21.856748 2500 rpc-test-base.h:240] got call: sleep_micros: 500 pattern: 4294967295 num_repetitions: 2097152 sidecar_idx: 0
I20260924 00:33:22.063944 2500 rpc-test-base.h:240] got call: sleep_micros: 500 pattern: 4294967295 num_repetitions: 2097152 sidecar_idx: 0
I20260924 00:33:22.279783 2501 rpc-test-base.h:240] got call: sleep_micros: 500 pattern: 4294967295 num_repetitions: 2097152 sidecar_idx: 0
I20260924 00:33:22.508071 2501 rpc-test-base.h:240] got call: sleep_micros: 500 pattern: 4294967295 num_repetitions: 2097152 sidecar_idx: 0
I20260924 00:33:22.703115 2500 rpc-test-base.h:240] got call: sleep_micros: 500 pattern: 4294967295 num_repetitions: 2097152 sidecar_idx: 0
I20260924 00:33:22.917263 2500 rpc-test-base.h:240] got call: sleep_micros: 500 pattern: 4294967295 num_repetitions: 2097152 sidecar_idx: 0
I20260924 00:33:23.106045 2501 rpc-test-base.h:240] got call: sleep_micros: 500 pattern: 4294967295 num_repetitions: 2097152 sidecar_idx: 0
W20260924 00:33:23.130442 2494 connection.cc:196] Error closing socket: Network error: TlsSocket::Close: Broken pipe
W20260924 00:33:23.170552 2494 connection.cc:441] server connection from unix:<unnamed> torn down before Call kudu.rpc.GenericCalculatorService.SleepWithSidecar from unix:<unnamed> (request call id 8) could send its response
W20260924 00:33:23.246615 2494 connection.cc:441] server connection from unix:<unnamed> torn down before Call kudu.rpc.GenericCalculatorService.SleepWithSidecar from unix:<unnamed> (request call id 9) could send its response
[ OK ] Parameters/TestRpc.TestCancellationAsync/SSL_UnixSocket (2138 ms)
[ RUN ] Parameters/TestRpc.TestPerformanceBySocketType/SSL_UnixSocket
I20260924 00:33:23.354054 2522 acceptor_pool.cc:254] collecting diagnostics on the listening RPC socket unix:/tmp/dist-test-taskH7srHI/test-tmp/rpc-test-bd30f55795ad45618af70dc8d01bb331.sock every 8 connection(s)
I20260924 00:33:23.354768 2523 acceptor_pool.cc:254] collecting diagnostics on the listening RPC socket unix:/tmp/dist-test-taskH7srHI/test-tmp/rpc-test-bd30f55795ad45618af70dc8d01bb331.sock every 8 connection(s)
I20260924 00:33:23.357998 2072 rpc-test.cc:1846] Connecting to unix:/tmp/dist-test-taskH7srHI/test-tmp/rpc-test-bd30f55795ad45618af70dc8d01bb331.sock
I20260924 00:33:45.085173 2072 rpc-test.cc:1859] Sending 1024MB via ssl-enabled unix socket: real 21.708s user 19.875s sys 12.889s
I20260924 00:34:06.785848 2072 rpc-test.cc:1859] Sending 1024MB via ssl-enabled unix socket: real 21.700s user 19.751s sys 13.192s
I20260924 00:34:28.453182 2072 rpc-test.cc:1859] Sending 1024MB via ssl-enabled unix socket: real 21.667s user 19.616s sys 13.107s
I20260924 00:34:50.102739 2072 rpc-test.cc:1859] Sending 1024MB via ssl-enabled unix socket: real 21.649s user 19.846s sys 13.020s
I20260924 00:35:11.715541 2072 rpc-test.cc:1859] Sending 1024MB via ssl-enabled unix socket: real 21.612s user 19.780s sys 12.874s
W20260924 00:35:11.722254 2519 connection.cc:196] Error closing socket: Network error: TlsSocket::Close: Broken pipe
[ OK ] Parameters/TestRpc.TestPerformanceBySocketType/SSL_UnixSocket (108476 ms)
[----------] 20 tests from Parameters/TestRpc (274597 ms total)
[----------] 1 test from Parameters/TestRpcSocketTxRxQueue
[ RUN ] Parameters/TestRpcSocketTxRxQueue.AcceptorRxQueueSizeMetric/0
I20260924 00:35:11.748625 2558 acceptor_pool.cc:254] collecting diagnostics on the listening RPC socket 0.0.0.0:45421 every 1 connection(s)
I20260924 00:35:11.749481 2559 acceptor_pool.cc:254] collecting diagnostics on the listening RPC socket 0.0.0.0:45421 every 1 connection(s)
W20260924 00:35:11.755251 2554 negotiation.cc:337] Failed RPC negotiation. Trace:
0924 00:35:11.753496 (+ 0us) reactor.cc:625] Submitting negotiation task for server connection from 127.0.0.1:60394 (local address 127.0.0.1:45421)
0924 00:35:11.753971 (+ 475us) server_negotiation.cc:206] Beginning negotiation
0924 00:35:11.753995 (+ 24us) server_negotiation.cc:399] Waiting for connection header
0924 00:35:11.754233 (+ 238us) negotiation.cc:327] Negotiation complete: Network error: Server connection negotiation failed: server connection from 127.0.0.1:60394: BlockingRecv error: recv got EOF from 127.0.0.1:60394 (error 108)
Metrics: {"server-negotiator.queue_time_us":124}
[ OK ] Parameters/TestRpcSocketTxRxQueue.AcceptorRxQueueSizeMetric/0 (28 ms)
[----------] 1 test from Parameters/TestRpcSocketTxRxQueue (28 ms total)
[----------] Global test environment tear-down
[==========] 21 tests from 2 test suites ran. (274626 ms total)
[ PASSED ] 20 tests.
[ FAILED ] 1 test, listed below:
[ FAILED ] Parameters/TestRpc.TestCallWithChainCertAndChainCA/SSL_UnixSocket, where GetParam() = (true, true)
1 FAILED TEST