Parameters/TestRpc.TestCallWithChainCertAndRootCA/SSL_TCP: /data0/somelongdirectorytoavoidrpathissues/src/kudu/src/kudu/rpc/rpc-test.cc:303: Failure
Failed
Bad status: Runtime error: could not verify certificate chain (error with cert: subject=CN = localhost, ST = sadfjas, C = AS, emailAddress = sdflkdsajf, O = lskdfjlsad, OU = sldfkja, issuer=C = AS, ST = ASDfkjdhf, L = lskdjf, O = saldfja, OU = skdjf, CN = localhost, emailAddress = sadjflkadsj): : certificate has expired
Google Test trace:
/data0/somelongdirectorytoavoidrpathissues/src/kudu/src/kudu/rpc/rpc-test.cc:300: Connecting to 0.0.0.0:33793
I20260924 22:17:23.445349 390 test_util.cc:175] -----------------------------------------------
I20260924 22:17:23.445542 390 test_util.cc:176] Had fatal failures, leaving test files at /tmp/dist-test-task9HYHpE/test-tmp/rpc-test.1.Parameters_TestRpc.TestCallWithChainCertAndRootCA_SSL_TCP.1790288241837901-390-0
Note: This is test shard 2 of 8.
[==========] Running 21 tests from 2 test suites.
[----------] Global test environment set-up.
[----------] 1 test from TestRpc
[ RUN ] TestRpc.TestMethodsByName
[ OK ] TestRpc.TestMethodsByName (6 ms)
[----------] 1 test from TestRpc (6 ms total)
[----------] 20 tests from Parameters/TestRpc
[ RUN ] Parameters/TestRpc.TestAcceptorPoolStartStop/SSL_TCP
WARNING: Logging before InitGoogleLogging() is written to STDERR
I20260924 22:17:21.942220 405 acceptor_pool.cc:254] collecting diagnostics on the listening RPC socket 0.0.0.0:37255 every 8 connection(s)
I20260924 22:17:21.943768 406 acceptor_pool.cc:254] collecting diagnostics on the listening RPC socket 0.0.0.0:37255 every 8 connection(s)
I20260924 22:17:23.177879 417 acceptor_pool.cc:254] collecting diagnostics on the listening RPC socket 0.0.0.0:35181 every 8 connection(s)
I20260924 22:17:23.179842 418 acceptor_pool.cc:254] collecting diagnostics on the listening RPC socket 0.0.0.0:35181 every 8 connection(s)
I20260924 22:17:23.205470 428 acceptor_pool.cc:254] collecting diagnostics on the listening RPC socket 0.0.0.0:43753 every 8 connection(s)
I20260924 22:17:23.206826 429 acceptor_pool.cc:254] collecting diagnostics on the listening RPC socket 0.0.0.0:43753 every 8 connection(s)
I20260924 22:17:23.228416 439 acceptor_pool.cc:254] collecting diagnostics on the listening RPC socket 0.0.0.0:42453 every 8 connection(s)
I20260924 22:17:23.229101 440 acceptor_pool.cc:254] collecting diagnostics on the listening RPC socket 0.0.0.0:42453 every 8 connection(s)
I20260924 22:17:23.261034 450 acceptor_pool.cc:254] collecting diagnostics on the listening RPC socket 0.0.0.0:45193 every 8 connection(s)
I20260924 22:17:23.261741 451 acceptor_pool.cc:254] collecting diagnostics on the listening RPC socket 0.0.0.0:45193 every 8 connection(s)
[ OK ] Parameters/TestRpc.TestAcceptorPoolStartStop/SSL_TCP (1366 ms)
[ RUN ] Parameters/TestRpc.TestCall/SSL_TCP
I20260924 22:17:23.298858 463 acceptor_pool.cc:254] collecting diagnostics on the listening RPC socket 0.0.0.0:44047 every 8 connection(s)
I20260924 22:17:23.300467 464 acceptor_pool.cc:254] collecting diagnostics on the listening RPC socket 0.0.0.0:44047 every 8 connection(s)
I20260924 22:17:23.307092 390 rpc-test.cc:234] Connecting to 0.0.0.0:44047
[ OK ] Parameters/TestRpc.TestCall/SSL_TCP (137 ms)
[ RUN ] Parameters/TestRpc.TestCallWithChainCertAndRootCA/SSL_TCP
I20260924 22:17:23.424469 488 acceptor_pool.cc:254] collecting diagnostics on the listening RPC socket 0.0.0.0:33793 every 8 connection(s)
I20260924 22:17:23.425216 489 acceptor_pool.cc:254] collecting diagnostics on the listening RPC socket 0.0.0.0:33793 every 8 connection(s)
/data0/somelongdirectorytoavoidrpathissues/src/kudu/src/kudu/rpc/rpc-test.cc:303: Failure
Failed
Bad status: Runtime error: could not verify certificate chain (error with cert: subject=CN = localhost, ST = sadfjas, C = AS, emailAddress = sdflkdsajf, O = lskdfjlsad, OU = sldfkja, issuer=C = AS, ST = ASDfkjdhf, L = lskdjf, O = saldfja, OU = skdjf, CN = localhost, emailAddress = sadjflkadsj): : certificate has expired
Google Test trace:
/data0/somelongdirectorytoavoidrpathissues/src/kudu/src/kudu/rpc/rpc-test.cc:300: Connecting to 0.0.0.0:33793
I20260924 22:17:23.445349 390 test_util.cc:175] -----------------------------------------------
I20260924 22:17:23.445542 390 test_util.cc:176] Had fatal failures, leaving test files at /tmp/dist-test-task9HYHpE/test-tmp/rpc-test.1.Parameters_TestRpc.TestCallWithChainCertAndRootCA_SSL_TCP.1790288241837901-390-0
[ FAILED ] Parameters/TestRpc.TestCallWithChainCertAndRootCA/SSL_TCP, where GetParam() = (true, false) (41 ms)
[ RUN ] Parameters/TestRpc.TestCallWithBadPasswordProtectedKey/SSL_TCP
[ OK ] Parameters/TestRpc.TestCallWithBadPasswordProtectedKey/SSL_TCP (97 ms)
[ RUN ] Parameters/TestRpc.TestInvalidMethodCall/SSL_TCP
I20260924 22:17:23.573117 525 acceptor_pool.cc:254] collecting diagnostics on the listening RPC socket 0.0.0.0:38611 every 8 connection(s)
I20260924 22:17:23.573958 526 acceptor_pool.cc:254] collecting diagnostics on the listening RPC socket 0.0.0.0:38611 every 8 connection(s)
I20260924 22:17:23.577335 390 rpc-test.cc:406] Connecting to 0.0.0.0:38611
[ OK ] Parameters/TestRpc.TestInvalidMethodCall/SSL_TCP (79 ms)
[ RUN ] Parameters/TestRpc.TestHighFDs/SSL_TCP
I20260924 22:17:23.831523 550 acceptor_pool.cc:254] collecting diagnostics on the listening RPC socket 0.0.0.0:43271 every 8 connection(s)
I20260924 22:17:23.832258 551 acceptor_pool.cc:254] collecting diagnostics on the listening RPC socket 0.0.0.0:43271 every 8 connection(s)
[ OK ] Parameters/TestRpc.TestHighFDs/SSL_TCP (256 ms)
[ RUN ] Parameters/TestRpc.TestConnectionAlwaysKeepalive/SSL_TCP
I20260924 22:17:23.904127 573 acceptor_pool.cc:254] collecting diagnostics on the listening RPC socket 0.0.0.0:40577 every 8 connection(s)
I20260924 22:17:23.904994 574 acceptor_pool.cc:254] collecting diagnostics on the listening RPC socket 0.0.0.0:40577 every 8 connection(s)
I20260924 22:17:23.908097 390 rpc-test.cc:532] Connecting to 0.0.0.0:40577
[ OK ] Parameters/TestRpc.TestConnectionAlwaysKeepalive/SSL_TCP (3064 ms)
[ RUN ] Parameters/TestRpc.TestReopenOutboundConnections/SSL_TCP
I20260924 22:17:26.973675 596 acceptor_pool.cc:254] collecting diagnostics on the listening RPC socket 0.0.0.0:39053 every 8 connection(s)
I20260924 22:17:26.974409 597 acceptor_pool.cc:254] collecting diagnostics on the listening RPC socket 0.0.0.0:39053 every 8 connection(s)
I20260924 22:17:26.977502 390 rpc-test.cc:658] Connecting to 0.0.0.0:39053
[ OK ] Parameters/TestRpc.TestReopenOutboundConnections/SSL_TCP (433 ms)
[ RUN ] Parameters/TestRpc.TestConnectionNetworkPlane/SSL_TCP
I20260924 22:17:27.395478 619 acceptor_pool.cc:254] collecting diagnostics on the listening RPC socket 0.0.0.0:42851 every 8 connection(s)
I20260924 22:17:27.396234 620 acceptor_pool.cc:254] collecting diagnostics on the listening RPC socket 0.0.0.0:42851 every 8 connection(s)
I20260924 22:17:27.399574 390 rpc-test.cc:772] Connecting to 0.0.0.0:42851
[ OK ] Parameters/TestRpc.TestConnectionNetworkPlane/SSL_TCP (86 ms)
[ RUN ] Parameters/TestRpc.TestTCPKeepalive/SSL_TCP
I20260924 22:17:27.501825 644 acceptor_pool.cc:254] collecting diagnostics on the listening RPC socket 0.0.0.0:42829 every 8 connection(s)
I20260924 22:17:27.502851 645 acceptor_pool.cc:254] collecting diagnostics on the listening RPC socket 0.0.0.0:42829 every 8 connection(s)
I20260924 22:17:27.529415 648 rpc-test-base.h:222] got call: sleep_micros: 8000000 deferred: true
I20260924 22:17:35.533676 648 rpcz_store.cc:275] Call kudu.rpc.GenericCalculatorService.Sleep from 127.0.0.1:40732 (request call id 0) took 8004 ms. Trace:
I20260924 22:17:35.534122 648 rpcz_store.cc:276] 0924 22:17:27.529112 (+ 0us) service_pool.cc:170] Inserting onto call queue
0924 22:17:27.529249 (+ 137us) service_pool.cc:227] Handling call
0924 22:17:35.533512 (+8004263us) inbound_call.cc:173] Queueing success response
Metrics: {}
[ OK ] Parameters/TestRpc.TestTCPKeepalive/SSL_TCP (8083 ms)
[ RUN ] Parameters/TestRpc.TestMaxSmallSidecars/SSL_TCP
I20260924 22:17:35.574434 670 acceptor_pool.cc:254] collecting diagnostics on the listening RPC socket 0.0.0.0:40883 every 8 connection(s)
I20260924 22:17:35.575259 671 acceptor_pool.cc:254] collecting diagnostics on the listening RPC socket 0.0.0.0:40883 every 8 connection(s)
[ OK ] Parameters/TestRpc.TestMaxSmallSidecars/SSL_TCP (195 ms)
[ RUN ] Parameters/TestRpc.TestCallTimeout/SSL_TCP
I20260924 22:17:35.760939 695 acceptor_pool.cc:254] collecting diagnostics on the listening RPC socket 0.0.0.0:44805 every 8 connection(s)
I20260924 22:17:35.761685 696 acceptor_pool.cc:254] collecting diagnostics on the listening RPC socket 0.0.0.0:44805 every 8 connection(s)
I20260924 22:17:35.784358 390 rpc-test-base.h:595] status: Timed out: connection negotiation to 0.0.0.0:44805 for RPC Sleep timed out after 0.000s (ON_OUTBOUND_QUEUE), seconds elapsed: 0.0024368
I20260924 22:17:35.792536 699 rpc-test-base.h:222] got call: sleep_micros: 700000
I20260924 22:17:35.986375 390 rpc-test-base.h:595] status: Timed out: Sleep RPC to 0.0.0.0:44805 timed out after 0.200s (SENT), seconds elapsed: 0.201581
I20260924 22:17:35.987933 698 rpc-test-base.h:222] got call: sleep_micros: 2000000
W20260924 22:17:36.493213 699 rpcz_store.cc:267] Call kudu.rpc.GenericCalculatorService.Sleep from 127.0.0.1:57806 (request call id 1) took 700 ms (client timeout 200 ms). Trace:
W20260924 22:17:36.493572 699 rpcz_store.cc:269] 0924 22:17:35.792335 (+ 0us) service_pool.cc:170] Inserting onto call queue
0924 22:17:35.792475 (+ 140us) service_pool.cc:227] Handling call
0924 22:17:36.493149 (+700674us) inbound_call.cc:173] Queueing success response
Metrics: {}
I20260924 22:17:37.488168 390 rpc-test-base.h:595] status: Timed out: Sleep RPC to 0.0.0.0:44805 timed out after 1.500s (SENT), seconds elapsed: 1.50147
W20260924 22:17:37.988483 698 rpcz_store.cc:267] Call kudu.rpc.GenericCalculatorService.Sleep from 127.0.0.1:57806 (request call id 2) took 2000 ms (client timeout 1500 ms). Trace:
W20260924 22:17:37.988794 698 rpcz_store.cc:269] 0924 22:17:35.987632 (+ 0us) service_pool.cc:170] Inserting onto call queue
0924 22:17:35.987772 (+ 140us) service_pool.cc:227] Handling call
0924 22:17:37.988429 (+2000657us) inbound_call.cc:173] Queueing success response
Metrics: {}
W20260924 22:17:37.989435 694 connection.cc:441] server connection from 127.0.0.1:57806 torn down before Call kudu.rpc.GenericCalculatorService.Sleep from 127.0.0.1:57806 (request call id 2) could send its response
[ OK ] Parameters/TestRpc.TestCallTimeout/SSL_TCP (2251 ms)
[ RUN ] Parameters/TestRpc.TestServerShutsDown/SSL_TCP
I20260924 22:17:37.997786 390 rpc-test.cc:1125] Connecting to 0.0.0.0:40485
W20260924 22:17:38.009136 712 negotiation.cc:337] Failed RPC negotiation. Trace:
0924 22:17:38.007162 (+ 0us) reactor.cc:625] Submitting negotiation task for client connection to 0.0.0.0:40485 (local address 127.0.0.1:52954)
0924 22:17:38.007654 (+ 492us) negotiation.cc:107] Waiting for socket to connect
0924 22:17:38.007688 (+ 34us) client_negotiation.cc:174] Beginning negotiation
0924 22:17:38.007925 (+ 237us) client_negotiation.cc:252] Sending NEGOTIATE NegotiatePB request
0924 22:17:38.008197 (+ 272us) negotiation.cc:327] Negotiation complete: Network error: Client connection negotiation failed: client connection to 0.0.0.0:40485: BlockingWrite error: write error: Broken pipe (error 32)
Metrics: {"client-negotiator.queue_time_us":140}
[ OK ] Parameters/TestRpc.TestServerShutsDown/SSL_TCP (16 ms)
[ RUN ] Parameters/TestRpc.TimedOutOnResponseMetric/SSL_TCP
I20260924 22:17:38.040988 729 acceptor_pool.cc:254] collecting diagnostics on the listening RPC socket 0.0.0.0:37745 every 8 connection(s)
I20260924 22:17:38.041914 730 acceptor_pool.cc:254] collecting diagnostics on the listening RPC socket 0.0.0.0:37745 every 8 connection(s)
W20260924 22:17:38.293484 733 rpcz_store.cc:267] Call kudu.rpc_test.CalculatorService.Sleep from 127.0.0.1:46320 (request call id 3) took 50 ms (client timeout 25 ms). Trace:
W20260924 22:17:38.293839 733 rpcz_store.cc:269] 0924 22:17:38.242801 (+ 0us) service_pool.cc:170] Inserting onto call queue
0924 22:17:38.242962 (+ 161us) service_pool.cc:227] Handling call
0924 22:17:38.293409 (+ 50447us) inbound_call.cc:173] Queueing success response
Related trace 'test_child':
Metrics: {"test_sleep_us":50000,"child_traces":[["test_child",{"related_trace_metric":1}]]}
W20260924 22:17:38.352926 733 rpcz_store.cc:267] Call kudu.rpc_test.CalculatorService.Sleep from 127.0.0.1:46320 (request call id 4) took 50 ms (client timeout 50 ms). Trace:
W20260924 22:17:38.353430 733 rpcz_store.cc:269] 0924 22:17:38.302255 (+ 0us) service_pool.cc:170] Inserting onto call queue
0924 22:17:38.302440 (+ 185us) service_pool.cc:227] Handling call
0924 22:17:38.352865 (+ 50425us) inbound_call.cc:173] Queueing success response
Related trace 'test_child':
Metrics: {"test_sleep_us":50000,"child_traces":[["test_child",{"related_trace_metric":1}]]}
W20260924 22:17:38.355705 728 connection.cc:441] server connection from 127.0.0.1:46320 torn down before Call kudu.rpc_test.CalculatorService.Sleep from 127.0.0.1:46320 (request call id 4) could send its response
[ OK ] Parameters/TestRpc.TimedOutOnResponseMetric/SSL_TCP (349 ms)
[ RUN ] Parameters/TestRpc.AcceptorDispatchingTimesMetric/SSL_TCP
I20260924 22:17:38.373989 754 acceptor_pool.cc:254] collecting diagnostics on the listening RPC socket 0.0.0.0:43917 every 8 connection(s)
I20260924 22:17:38.374737 755 acceptor_pool.cc:254] collecting diagnostics on the listening RPC socket 0.0.0.0:43917 every 8 connection(s)
W20260924 22:17:38.381346 750 negotiation.cc:337] Failed RPC negotiation. Trace:
0924 22:17:38.379049 (+ 0us) reactor.cc:625] Submitting negotiation task for server connection from 127.0.0.1:58430 (local address 127.0.0.1:43917)
0924 22:17:38.379673 (+ 624us) server_negotiation.cc:206] Beginning negotiation
0924 22:17:38.379696 (+ 23us) server_negotiation.cc:399] Waiting for connection header
0924 22:17:38.380221 (+ 525us) negotiation.cc:327] Negotiation complete: Network error: Server connection negotiation failed: server connection from 127.0.0.1:58430: BlockingRecv error: recv got EOF from 127.0.0.1:58430 (error 108)
Metrics: {"server-negotiator.queue_time_us":146}
[ OK ] Parameters/TestRpc.AcceptorDispatchingTimesMetric/SSL_TCP (23 ms)
[ RUN ] Parameters/TestRpc.TestRpcCallbackDestroysMessenger/SSL_TCP
[ OK ] Parameters/TestRpc.TestRpcCallbackDestroysMessenger/SSL_TCP (23 ms)
[ RUN ] Parameters/TestRpc.TestApplicationFeatureFlag/SSL_TCP
I20260924 22:17:38.429492 779 acceptor_pool.cc:254] collecting diagnostics on the listening RPC socket 0.0.0.0:46105 every 8 connection(s)
I20260924 22:17:38.430223 780 acceptor_pool.cc:254] collecting diagnostics on the listening RPC socket 0.0.0.0:46105 every 8 connection(s)
W20260924 22:17:38.461653 778 messenger.cc:357] Unable to handle RPC call: Not implemented: call requires unsupported application feature flags: 99
[ OK ] Parameters/TestRpc.TestApplicationFeatureFlag/SSL_TCP (61 ms)
[ RUN ] Parameters/TestRpc.TestCancellation/SSL_TCP
I20260924 22:17:38.489873 804 acceptor_pool.cc:254] collecting diagnostics on the listening RPC socket 0.0.0.0:44651 every 8 connection(s)
I20260924 22:17:38.490662 805 acceptor_pool.cc:254] collecting diagnostics on the listening RPC socket 0.0.0.0:44651 every 8 connection(s)
I20260924 22:17:38.494259 390 rpc-test.cc:1648] Connecting to 0.0.0.0:44651
I20260924 22:17:38.599901 390 rpc-test-base.h:595] status: Aborted: Sleep RPC to 0.0.0.0:44651 is cancelled in state READY, seconds elapsed: 0.000417968
I20260924 22:17:38.750264 390 rpc-test-base.h:595] status: Aborted: Sleep RPC to 0.0.0.0:44651 is cancelled in state SENT, seconds elapsed: 0.000831781
I20260924 22:17:38.792346 807 rpc-test-base.h:222] got call: sleep_micros: 510000
I20260924 22:17:38.919214 390 rpc-test-base.h:595] status: Aborted: Sleep RPC to 0.0.0.0:44651 is cancelled in state SENT, seconds elapsed: 0.000876145
I20260924 22:17:38.968168 806 rpc-test-base.h:222] got call: sleep_micros: 510000
I20260924 22:17:39.089074 390 rpc-test-base.h:595] status: Aborted: Sleep RPC to 0.0.0.0:44651 is cancelled in state SENT, seconds elapsed: 0.000850191
W20260924 22:17:39.134706 808 rpcz_store.cc:267] Call kudu.rpc.GenericCalculatorService.Sleep from 127.0.0.1:50160 (request call id 11) took 16 ms (client timeout 10 ms). Trace:
W20260924 22:17:39.135033 808 rpcz_store.cc:269] 0924 22:17:39.117658 (+ 0us) service_pool.cc:170] Inserting onto call queue
0924 22:17:39.134381 (+ 16723us) service_pool.cc:214] Skipping call since client already timed out
0924 22:17:39.134506 (+ 125us) inbound_call.cc:173] Queueing failure response
Metrics: {}
I20260924 22:17:39.135607 808 rpc-test-base.h:222] got call: sleep_micros: 1500000
W20260924 22:17:39.303053 807 rpcz_store.cc:267] Call kudu.rpc.GenericCalculatorService.Sleep from 127.0.0.1:50160 (request call id 3) took 511 ms (client timeout 10 ms). Trace:
W20260924 22:17:39.303396 807 rpcz_store.cc:269] 0924 22:17:38.792027 (+ 0us) service_pool.cc:170] Inserting onto call queue
0924 22:17:38.792249 (+ 222us) service_pool.cc:227] Handling call
0924 22:17:39.302997 (+510748us) inbound_call.cc:173] Queueing success response
Metrics: {}
W20260924 22:17:39.478922 806 rpcz_store.cc:267] Call kudu.rpc.GenericCalculatorService.Sleep from 127.0.0.1:50160 (request call id 7) took 511 ms (client timeout 10 ms). Trace:
W20260924 22:17:39.479290 806 rpcz_store.cc:269] 0924 22:17:38.967872 (+ 0us) service_pool.cc:170] Inserting onto call queue
0924 22:17:38.968074 (+ 202us) service_pool.cc:227] Handling call
0924 22:17:39.478866 (+510792us) inbound_call.cc:173] Queueing success response
Metrics: {}
I20260924 22:17:40.091349 390 rpc-test-base.h:595] status: Timed out: Sleep RPC to 0.0.0.0:44651 timed out after 1.000s (SENT), seconds elapsed: 1.00189
I20260924 22:17:40.092718 806 rpc-test-base.h:222] got call: sleep_micros: 1500000
W20260924 22:17:40.636214 808 rpcz_store.cc:267] Call kudu.rpc.GenericCalculatorService.Sleep from 127.0.0.1:50160 (request call id 12) took 1518 ms (client timeout 1000 ms). Trace:
W20260924 22:17:40.636972 808 rpcz_store.cc:269] 0924 22:17:39.118030 (+ 0us) service_pool.cc:170] Inserting onto call queue
0924 22:17:39.135564 (+ 17534us) service_pool.cc:227] Handling call
0924 22:17:40.636159 (+1500595us) inbound_call.cc:173] Queueing success response
Metrics: {}
I20260924 22:17:41.093532 390 rpc-test-base.h:595] status: Timed out: Sleep RPC to 0.0.0.0:44651 timed out after 1.000s (SENT), seconds elapsed: 1.00185
W20260924 22:17:41.095003 803 messenger.cc:357] Unable to handle RPC call: Not implemented: call requires unsupported application feature flags: 99, 1
W20260924 22:17:41.096668 803 messenger.cc:357] Unable to handle RPC call: Not implemented: call requires unsupported application feature flags: 99, 1
W20260924 22:17:41.593243 806 rpcz_store.cc:267] Call kudu.rpc.GenericCalculatorService.Sleep from 127.0.0.1:50160 (request call id 13) took 1500 ms (client timeout 1000 ms). Trace:
W20260924 22:17:41.593588 806 rpcz_store.cc:269] 0924 22:17:40.092510 (+ 0us) service_pool.cc:170] Inserting onto call queue
0924 22:17:40.092673 (+ 163us) service_pool.cc:227] Handling call
0924 22:17:41.593189 (+1500516us) inbound_call.cc:173] Queueing success response
Metrics: {}
W20260924 22:17:41.594177 803 connection.cc:441] server connection from 127.0.0.1:50160 torn down before Call kudu.rpc.GenericCalculatorService.Sleep from 127.0.0.1:50160 (request call id 13) could send its response
[ OK ] Parameters/TestRpc.TestCancellation/SSL_TCP (3130 ms)
[ RUN ] Parameters/TestRpc.TestCancellationMultiThreads/SSL_TCP
I20260924 22:17:41.649505 829 acceptor_pool.cc:254] collecting diagnostics on the listening RPC socket 0.0.0.0:33297 every 8 connection(s)
I20260924 22:17:41.650282 830 acceptor_pool.cc:254] collecting diagnostics on the listening RPC socket 0.0.0.0:33297 every 8 connection(s)
I20260924 22:17:41.653412 390 rpc-test.cc:1808] Connecting to 0.0.0.0:33297
I20260924 22:17:41.800179 843 test_util.cc:268] Using random seed: -136060716
I20260924 22:17:41.801779 844 test_util.cc:268] Using random seed: -136059116
I20260924 22:17:41.803182 845 test_util.cc:268] Using random seed: -136057707
I20260924 22:17:41.804729 846 test_util.cc:268] Using random seed: -136056180
I20260924 22:17:41.806135 847 test_util.cc:268] Using random seed: -136054856
I20260924 22:17:41.808182 848 test_util.cc:268] Using random seed: -136053373
I20260924 22:17:41.809095 849 test_util.cc:268] Using random seed: -136051920
I20260924 22:17:41.811815 850 test_util.cc:268] Using random seed: -136050370
I20260924 22:17:41.812424 851 test_util.cc:268] Using random seed: -136048636
I20260924 22:17:41.814152 852 test_util.cc:268] Using random seed: -136046863
I20260924 22:17:41.815804 853 test_util.cc:268] Using random seed: -136045173
I20260924 22:17:41.817144 854 test_util.cc:268] Using random seed: -136043834
I20260924 22:17:41.818789 855 test_util.cc:268] Using random seed: -136042190
I20260924 22:17:41.820708 856 test_util.cc:268] Using random seed: -136040308
I20260924 22:17:41.823088 857 test_util.cc:268] Using random seed: -136038457
I20260924 22:17:41.825474 858 test_util.cc:268] Using random seed: -136035600
I20260924 22:17:41.827942 859 test_util.cc:268] Using random seed: -136033089
I20260924 22:17:41.829772 860 test_util.cc:268] Using random seed: -136031241
I20260924 22:17:41.833204 861 test_util.cc:268] Using random seed: -136027870
I20260924 22:17:41.835821 862 test_util.cc:268] Using random seed: -136025237
I20260924 22:17:41.837818 863 test_util.cc:268] Using random seed: -136023186
I20260924 22:17:41.840055 864 test_util.cc:268] Using random seed: -136021016
I20260924 22:17:41.845327 865 test_util.cc:268] Using random seed: -136015702
I20260924 22:17:41.848611 866 test_util.cc:268] Using random seed: -136012493
I20260924 22:17:41.852607 867 test_util.cc:268] Using random seed: -136008467
I20260924 22:17:41.854773 868 test_util.cc:268] Using random seed: -136006280
I20260924 22:17:41.856873 869 test_util.cc:268] Using random seed: -136004149
I20260924 22:17:41.859092 870 test_util.cc:268] Using random seed: -136001965
I20260924 22:17:41.861397 871 test_util.cc:268] Using random seed: -135999697
I20260924 22:17:41.863631 872 test_util.cc:268] Using random seed: -135997881
[ OK ] Parameters/TestRpc.TestCancellationMultiThreads/SSL_TCP (18162 ms)
[ RUN ] Parameters/TestRpc.TestCallId/SSL_TCP
I20260924 22:17:59.807626 886 acceptor_pool.cc:254] collecting diagnostics on the listening RPC socket 0.0.0.0:45423 every 8 connection(s)
I20260924 22:17:59.808471 887 acceptor_pool.cc:254] collecting diagnostics on the listening RPC socket 0.0.0.0:45423 every 8 connection(s)
[ OK ] Parameters/TestRpc.TestCallId/SSL_TCP (117 ms)
[----------] 20 tests from Parameters/TestRpc (37981 ms total)
[----------] Global test environment tear-down
[==========] 21 tests from 2 test suites ran. (37989 ms total)
[ PASSED ] 20 tests.
[ FAILED ] 1 test, listed below:
[ FAILED ] Parameters/TestRpc.TestCallWithChainCertAndRootCA/SSL_TCP, where GetParam() = (true, false)
1 FAILED TEST