Diagnosed failure

Parameters/TestRpc.TestCallWithChainCertAndChainCA/SSL_TCP: /data0/somelongdirectorytoavoidrpathissues/src/kudu/src/kudu/rpc/rpc-test.cc:270: Failure
Failed
Bad status: Runtime error: could not verify certificate chain (error with cert: subject=CN = localhost, ST = sadfjas, C = AS, emailAddress = sdflkdsajf, O = lskdfjlsad, OU = sldfkja, issuer=C = AS, ST = ASDfkjdhf, L = lskdjf, O = saldfja, OU = skdjf, CN = localhost, emailAddress = sadjflkadsj): : certificate has expired
Google Test trace:
/data0/somelongdirectorytoavoidrpathissues/src/kudu/src/kudu/rpc/rpc-test.cc:267: Connecting to 0.0.0.0:39089
I20260927 23:29:04.581312   390 test_util.cc:175] -----------------------------------------------
I20260927 23:29:04.581532   390 test_util.cc:176] Had fatal failures, leaving test files at /tmp/dist-test-taskzP7PzB/test-tmp/rpc-test.5.Parameters_TestRpc.TestCallWithChainCertAndChainCA_SSL_TCP.1790551743262067-390-0

Full log

Note: This is test shard 6 of 8.
[==========] Running 21 tests from 2 test suites.
[----------] Global test environment set-up.
[----------] 20 tests from Parameters/TestRpc
[ RUN      ] Parameters/TestRpc.TestMessengerCreateDestroy/SSL_TCP
WARNING: Logging before InitGoogleLogging() is written to STDERR
I20260927 23:29:03.365384   390 rpc-test.cc:169] started messenger TestCreateDestroy
[       OK ] Parameters/TestRpc.TestMessengerCreateDestroy/SSL_TCP (1117 ms)
[ RUN      ] Parameters/TestRpc.TestNegotiationDeadlock/SSL_TCP
I20260927 23:29:04.465170   412 acceptor_pool.cc:254] collecting diagnostics on the listening RPC socket 0.0.0.0:33675 every 8 connection(s)
I20260927 23:29:04.466503   413 acceptor_pool.cc:254] collecting diagnostics on the listening RPC socket 0.0.0.0:33675 every 8 connection(s)
[       OK ] Parameters/TestRpc.TestNegotiationDeadlock/SSL_TCP (88 ms)
[ RUN      ] Parameters/TestRpc.TestCallWithChainCertAndChainCA/SSL_TCP
I20260927 23:29:04.547917   428 acceptor_pool.cc:254] collecting diagnostics on the listening RPC socket 0.0.0.0:39089 every 8 connection(s)
I20260927 23:29:04.550138   429 acceptor_pool.cc:254] collecting diagnostics on the listening RPC socket 0.0.0.0:39089 every 8 connection(s)
/data0/somelongdirectorytoavoidrpathissues/src/kudu/src/kudu/rpc/rpc-test.cc:270: Failure
Failed
Bad status: Runtime error: could not verify certificate chain (error with cert: subject=CN = localhost, ST = sadfjas, C = AS, emailAddress = sdflkdsajf, O = lskdfjlsad, OU = sldfkja, issuer=C = AS, ST = ASDfkjdhf, L = lskdjf, O = saldfja, OU = skdjf, CN = localhost, emailAddress = sadjflkadsj): : certificate has expired
Google Test trace:
/data0/somelongdirectorytoavoidrpathissues/src/kudu/src/kudu/rpc/rpc-test.cc:267: Connecting to 0.0.0.0:39089
I20260927 23:29:04.581312   390 test_util.cc:175] -----------------------------------------------
I20260927 23:29:04.581532   390 test_util.cc:176] Had fatal failures, leaving test files at /tmp/dist-test-taskzP7PzB/test-tmp/rpc-test.5.Parameters_TestRpc.TestCallWithChainCertAndChainCA_SSL_TCP.1790551743262067-390-0
[  FAILED  ] Parameters/TestRpc.TestCallWithChainCertAndChainCA/SSL_TCP, where GetParam() = (true, false) (57 ms)
[ RUN      ] Parameters/TestRpc.TestCallWithPasswordProtectedKey/SSL_TCP
I20260927 23:29:04.616696   453 acceptor_pool.cc:254] collecting diagnostics on the listening RPC socket 0.0.0.0:33295 every 8 connection(s)
I20260927 23:29:04.617439   454 acceptor_pool.cc:254] collecting diagnostics on the listening RPC socket 0.0.0.0:33295 every 8 connection(s)
[       OK ] Parameters/TestRpc.TestCallWithPasswordProtectedKey/SSL_TCP (85 ms)
[ RUN      ] Parameters/TestRpc.TestCallToBadServer/SSL_TCP
I20260927 23:29:04.696695   390 rpc-test.cc:394] Status: Network error: Client connection negotiation failed: client connection to 0.0.0.0:0: connect: Connection refused (error 111)
I20260927 23:29:04.698118   390 rpc-test.cc:394] Status: Network error: Client connection negotiation failed: client connection to 0.0.0.0:0: connect: Connection refused (error 111)
I20260927 23:29:04.699319   390 rpc-test.cc:394] Status: Network error: Client connection negotiation failed: client connection to 0.0.0.0:0: connect: Connection refused (error 111)
I20260927 23:29:04.700538   390 rpc-test.cc:394] Status: Network error: Client connection negotiation failed: client connection to 0.0.0.0:0: connect: Connection refused (error 111)
I20260927 23:29:04.701771   390 rpc-test.cc:394] Status: Network error: Client connection negotiation failed: client connection to 0.0.0.0:0: connect: Connection refused (error 111)
[       OK ] Parameters/TestRpc.TestCallToBadServer/SSL_TCP (37 ms)
[ RUN      ] Parameters/TestRpc.TestWrongService/SSL_TCP
I20260927 23:29:04.726955   488 acceptor_pool.cc:254] collecting diagnostics on the listening RPC socket 0.0.0.0:46719 every 8 connection(s)
I20260927 23:29:04.727752   489 acceptor_pool.cc:254] collecting diagnostics on the listening RPC socket 0.0.0.0:46719 every 8 connection(s)
I20260927 23:29:04.762912   486 messenger.cc:345] service WrongServiceName not registered on TestServer
[       OK ] Parameters/TestRpc.TestWrongService/SSL_TCP (66 ms)
[ RUN      ] Parameters/TestRpc.TestConnectionKeepalive/SSL_TCP
I20260927 23:29:04.785705   511 acceptor_pool.cc:254] collecting diagnostics on the listening RPC socket 0.0.0.0:32943 every 8 connection(s)
I20260927 23:29:04.786451   512 acceptor_pool.cc:254] collecting diagnostics on the listening RPC socket 0.0.0.0:32943 every 8 connection(s)
I20260927 23:29:04.789816   390 rpc-test.cc:488] Connecting to 0.0.0.0:32943
[       OK ] Parameters/TestRpc.TestConnectionKeepalive/SSL_TCP (1060 ms)
[ RUN      ] Parameters/TestRpc.TestClientConnectionMetrics/SSL_TCP
I20260927 23:29:05.855566   536 acceptor_pool.cc:254] collecting diagnostics on the listening RPC socket 0.0.0.0:43593 every 8 connection(s)
I20260927 23:29:05.856292   537 acceptor_pool.cc:254] collecting diagnostics on the listening RPC socket 0.0.0.0:43593 every 8 connection(s)
I20260927 23:29:05.859545   390 rpc-test.cc:569] Connecting to 0.0.0.0:43593
[       OK ] Parameters/TestRpc.TestClientConnectionMetrics/SSL_TCP (119454 ms)
[ RUN      ] Parameters/TestRpc.TestCredentialsPolicy/SSL_TCP
I20260927 23:31:05.311591   571 acceptor_pool.cc:254] collecting diagnostics on the listening RPC socket 0.0.0.0:45307 every 8 connection(s)
I20260927 23:31:05.312400   572 acceptor_pool.cc:254] collecting diagnostics on the listening RPC socket 0.0.0.0:45307 every 8 connection(s)
I20260927 23:31:05.315795   390 rpc-test.cc:700] Connecting to 0.0.0.0:45307
[       OK ] Parameters/TestRpc.TestCredentialsPolicy/SSL_TCP (84 ms)
[ RUN      ] Parameters/TestRpc.TestCallLongerThanKeepalive/SSL_TCP
I20260927 23:31:05.389606   596 acceptor_pool.cc:254] collecting diagnostics on the listening RPC socket 0.0.0.0:39599 every 8 connection(s)
I20260927 23:31:05.390323   597 acceptor_pool.cc:254] collecting diagnostics on the listening RPC socket 0.0.0.0:39599 every 8 connection(s)
I20260927 23:31:05.416373   600 rpc-test-base.h:222] got call: sleep_micros: 3000000 deferred: true
I20260927 23:31:08.421005   600 rpcz_store.cc:275] Call kudu.rpc.GenericCalculatorService.Sleep from 127.0.0.1:37274 (request call id 0) took 3004 ms. Trace:
I20260927 23:31:08.421344   600 rpcz_store.cc:276] 0927 23:31:05.416100 (+     0us) service_pool.cc:170] Inserting onto call queue
0927 23:31:05.416212 (+   112us) service_pool.cc:227] Handling call
0927 23:31:08.420937 (+3004725us) inbound_call.cc:173] Queueing success response
Metrics: {}
[       OK ] Parameters/TestRpc.TestCallLongerThanKeepalive/SSL_TCP (3059 ms)
[ RUN      ] Parameters/TestRpc.TestRpcSidecar/SSL_TCP
I20260927 23:31:08.447845   621 acceptor_pool.cc:254] collecting diagnostics on the listening RPC socket 0.0.0.0:41277 every 8 connection(s)
I20260927 23:31:08.448588   622 acceptor_pool.cc:254] collecting diagnostics on the listening RPC socket 0.0.0.0:41277 every 8 connection(s)
[       OK ] Parameters/TestRpc.TestRpcSidecar/SSL_TCP (552 ms)
[ RUN      ] Parameters/TestRpc.TestRpcSidecarLimits/SSL_TCP
I20260927 23:31:26.965054   648 acceptor_pool.cc:254] collecting diagnostics on the listening RPC socket 0.0.0.0:41743 every 8 connection(s)
I20260927 23:31:26.965821   649 acceptor_pool.cc:254] collecting diagnostics on the listening RPC socket 0.0.0.0:41743 every 8 connection(s)
W20260927 23:31:26.999833   390 serialization.cc:72] Serialized kudu.rpc_test.PushStringsRequestPB (2147483654 bytes) is larger than the maximum configured RPC message size (52428800 bytes). Sending anyway, but peer may reject the data.
W20260927 23:31:27.011193   646 connection.cc:535] server connection from 127.0.0.1:44120 recv error: Network error: RPC frame had a length of 2147483714, but we only support messages up to 52428800 bytes long.
W20260927 23:31:27.011525   646 connection.cc:158] shutting down server connection from 127.0.0.1:44120 with pending inbound data: 4/2147483714 bytes received; last active 0 ns ago: status Network error: RPC frame had a length of 2147483714, but we only support messages up to 52428800 bytes long.
W20260927 23:31:27.012521   661 connection.cc:698] client connection to 0.0.0.0:41743 send error: Network error: failed to write to TLS socket: Connection reset by peer
W20260927 23:31:27.013144   661 connection.cc:196] Error closing socket: Network error: TlsSocket::Close: Success
[       OK ] Parameters/TestRpc.TestRpcSidecarLimits/SSL_TCP (18622 ms)
[ RUN      ] Parameters/TestRpc.TestCallTimeoutDoesntAffectNegotiation/SSL_TCP
I20260927 23:31:27.625366   673 acceptor_pool.cc:254] collecting diagnostics on the listening RPC socket 0.0.0.0:43707 every 8 connection(s)
I20260927 23:31:27.626204   674 acceptor_pool.cc:254] collecting diagnostics on the listening RPC socket 0.0.0.0:43707 every 8 connection(s)
W20260927 23:31:27.655766   669 negotiation.cc:266] Injecting 500ms delay in negotiation
I20260927 23:31:27.705412   390 rpc-test-base.h:595] status: Timed out: connection negotiation to 0.0.0.0:43707 for RPC Sleep timed out after 0.050s (ON_OUTBOUND_QUEUE), seconds elapsed: 0.0507779
[       OK ] Parameters/TestRpc.TestCallTimeoutDoesntAffectNegotiation/SSL_TCP (568 ms)
[ RUN      ] Parameters/TestRpc.TestRpcHandlerLatencyMetric/SSL_TCP
I20260927 23:31:28.194564   698 acceptor_pool.cc:254] collecting diagnostics on the listening RPC socket 0.0.0.0:43473 every 8 connection(s)
I20260927 23:31:28.195389   699 acceptor_pool.cc:254] collecting diagnostics on the listening RPC socket 0.0.0.0:43473 every 8 connection(s)
I20260927 23:31:28.245172   390 rpc-test.cc:1236] Sleep() min lat: 21786
I20260927 23:31:28.245396   390 rpc-test.cc:1237] Sleep() mean lat: 21786
I20260927 23:31:28.245589   390 rpc-test.cc:1238] Sleep() max lat: 21786
I20260927 23:31:28.245754   390 rpc-test.cc:1239] Sleep() #calls: 1
[       OK ] Parameters/TestRpc.TestRpcHandlerLatencyMetric/SSL_TCP (79 ms)
[ RUN      ] Parameters/TestRpc.TimedOutOnResponseMetricServiceQueue/SSL_TCP
I20260927 23:31:28.281080   724 acceptor_pool.cc:254] collecting diagnostics on the listening RPC socket 0.0.0.0:38189 every 8 connection(s)
I20260927 23:31:28.281847   725 acceptor_pool.cc:254] collecting diagnostics on the listening RPC socket 0.0.0.0:38189 every 8 connection(s)
W20260927 23:31:28.356040   726 rpcz_store.cc:267] Call kudu.rpc_test.CalculatorService.Sleep from 127.0.0.1:36386 (request call id 2) took 20 ms (client timeout 20 ms). Trace:
W20260927 23:31:28.356420   726 rpcz_store.cc:269] 0927 23:31:28.335421 (+     0us) service_pool.cc:170] Inserting onto call queue
0927 23:31:28.355844 (+ 20423us) service_pool.cc:214] Skipping call since client already timed out
0927 23:31:28.355962 (+   118us) inbound_call.cc:173] Queueing failure response
Metrics: {}
[       OK ] Parameters/TestRpc.TimedOutOnResponseMetricServiceQueue/SSL_TCP (109 ms)
[ RUN      ] Parameters/TestRpc.RpcPendingConnectionsMetric/SSL_TCP
I20260927 23:31:28.374240   747 acceptor_pool.cc:254] collecting diagnostics on the listening RPC socket 0.0.0.0:34703 every 8 connection(s)
I20260927 23:31:28.374964   748 acceptor_pool.cc:254] collecting diagnostics on the listening RPC socket 0.0.0.0:34703 every 8 connection(s)
W20260927 23:31:28.389201   743 negotiation.cc:337] Failed RPC negotiation. Trace:
0927 23:31:28.387373 (+     0us) reactor.cc:625] Submitting negotiation task for server connection from 127.0.0.1:43460 (local address 127.0.0.1:34703)
0927 23:31:28.387984 (+   611us) server_negotiation.cc:206] Beginning negotiation
0927 23:31:28.388012 (+    28us) server_negotiation.cc:399] Waiting for connection header
0927 23:31:28.388381 (+   369us) negotiation.cc:327] Negotiation complete: Network error: Server connection negotiation failed: server connection from 127.0.0.1:43460: BlockingRecv error: recv got EOF from 127.0.0.1:43460 (error 108)
Metrics: {"server-negotiator.queue_time_us":133}
[       OK ] Parameters/TestRpc.RpcPendingConnectionsMetric/SSL_TCP (38 ms)
[ RUN      ] Parameters/TestRpc.TestRpcContextClientDeadline/SSL_TCP
I20260927 23:31:28.421630   763 acceptor_pool.cc:254] collecting diagnostics on the listening RPC socket 0.0.0.0:33513 every 8 connection(s)
I20260927 23:31:28.422379   764 acceptor_pool.cc:254] collecting diagnostics on the listening RPC socket 0.0.0.0:33513 every 8 connection(s)
[       OK ] Parameters/TestRpc.TestRpcContextClientDeadline/SSL_TCP (82 ms)
[ RUN      ] Parameters/TestRpc.TestApplicationFeatureFlagUnsupportedServer/SSL_TCP
I20260927 23:31:28.502775   788 acceptor_pool.cc:254] collecting diagnostics on the listening RPC socket 0.0.0.0:36999 every 8 connection(s)
I20260927 23:31:28.503575   789 acceptor_pool.cc:254] collecting diagnostics on the listening RPC socket 0.0.0.0:36999 every 8 connection(s)
[       OK ] Parameters/TestRpc.TestApplicationFeatureFlagUnsupportedServer/SSL_TCP (64 ms)
[ RUN      ] Parameters/TestRpc.TestCancellationAsync/SSL_TCP
I20260927 23:31:28.572140   813 acceptor_pool.cc:254] collecting diagnostics on the listening RPC socket 0.0.0.0:43791 every 8 connection(s)
I20260927 23:31:28.572947   814 acceptor_pool.cc:254] collecting diagnostics on the listening RPC socket 0.0.0.0:43791 every 8 connection(s)
I20260927 23:31:28.576231   390 rpc-test.cc:1716] Connecting to 0.0.0.0:43791
I20260927 23:31:28.611284   390 test_util.cc:268] Using random seed: 1497745329
I20260927 23:31:28.857033   817 rpc-test-base.h:240] got call: sleep_micros: 500 pattern: 4294967295 num_repetitions: 2097152 sidecar_idx: 0
I20260927 23:31:29.031040   816 rpc-test-base.h:240] got call: sleep_micros: 500 pattern: 4294967295 num_repetitions: 2097152 sidecar_idx: 0
I20260927 23:31:29.224478   817 rpc-test-base.h:240] got call: sleep_micros: 500 pattern: 4294967295 num_repetitions: 2097152 sidecar_idx: 0
I20260927 23:31:29.416671   816 rpc-test-base.h:240] got call: sleep_micros: 500 pattern: 4294967295 num_repetitions: 2097152 sidecar_idx: 0
I20260927 23:31:29.607928   817 rpc-test-base.h:240] got call: sleep_micros: 500 pattern: 4294967295 num_repetitions: 2097152 sidecar_idx: 0
I20260927 23:31:29.786577   816 rpc-test-base.h:240] got call: sleep_micros: 500 pattern: 4294967295 num_repetitions: 2097152 sidecar_idx: 0
I20260927 23:31:29.961750   817 rpc-test-base.h:240] got call: sleep_micros: 500 pattern: 4294967295 num_repetitions: 2097152 sidecar_idx: 0
I20260927 23:31:30.137818   816 rpc-test-base.h:240] got call: sleep_micros: 500 pattern: 4294967295 num_repetitions: 2097152 sidecar_idx: 0
W20260927 23:31:30.306211   811 connection.cc:196] Error closing socket: Network error: TlsSocket::Close: Broken pipe
W20260927 23:31:30.336404   811 connection.cc:441] server connection from 127.0.0.1:54174 torn down before Call kudu.rpc.GenericCalculatorService.SleepWithSidecar from 127.0.0.1:54174 (request call id 8) could send its response
[       OK ] Parameters/TestRpc.TestCancellationAsync/SSL_TCP (1796 ms)
[ RUN      ] Parameters/TestRpc.TestPerformanceBySocketType/SSL_TCP
I20260927 23:31:30.451028   838 acceptor_pool.cc:254] collecting diagnostics on the listening RPC socket 0.0.0.0:34945 every 8 connection(s)
I20260927 23:31:30.451741   839 acceptor_pool.cc:254] collecting diagnostics on the listening RPC socket 0.0.0.0:34945 every 8 connection(s)
I20260927 23:31:30.455442   390 rpc-test.cc:1846] Connecting to 0.0.0.0:34945
I20260927 23:31:50.239472   390 rpc-test.cc:1859] Sending 1024MB via ssl-enabled tcp socket: real 19.769s	user 16.745s	sys 11.571s
I20260927 23:32:10.016157   390 rpc-test.cc:1859] Sending 1024MB via ssl-enabled tcp socket: real 19.776s	user 16.970s	sys 11.321s
I20260927 23:32:29.662559   390 rpc-test.cc:1859] Sending 1024MB via ssl-enabled tcp socket: real 19.646s	user 16.650s	sys 11.433s
I20260927 23:32:49.385269   390 rpc-test.cc:1859] Sending 1024MB via ssl-enabled tcp socket: real 19.722s	user 16.759s	sys 11.474s
I20260927 23:33:09.082108   390 rpc-test.cc:1859] Sending 1024MB via ssl-enabled tcp socket: real 19.696s	user 16.776s	sys 11.279s
[       OK ] Parameters/TestRpc.TestPerformanceBySocketType/SSL_TCP (98753 ms)
[----------] 20 tests from Parameters/TestRpc (245781 ms total)

[----------] 1 test from Parameters/TestRpcSocketTxRxQueue
[ RUN      ] Parameters/TestRpcSocketTxRxQueue.OverCapacity/0
W20260927 23:33:09.556591   865 negotiation.cc:337] Failed RPC negotiation. Trace:
0927 23:33:09.114377 (+     0us) reactor.cc:625] Submitting negotiation task for client connection to 0.0.0.0:37199 (local address 127.0.0.1:38862)
0927 23:33:09.115075 (+   698us) negotiation.cc:107] Waiting for socket to connect
0927 23:33:09.115116 (+    41us) client_negotiation.cc:174] Beginning negotiation
0927 23:33:09.115628 (+   512us) client_negotiation.cc:252] Sending NEGOTIATE NegotiatePB request
0927 23:33:09.554974 (+439346us) negotiation.cc:327] Negotiation complete: Network error: Client connection negotiation failed: client connection to 0.0.0.0:37199: BlockingRecv error: recv error from unknown peer: Transport endpoint is not connected (error 107)
Metrics: {"client-negotiator.queue_time_us":130}
W20260927 23:33:09.556828   901 negotiation.cc:337] Failed RPC negotiation. Trace:
0927 23:33:09.156395 (+     0us) reactor.cc:625] Submitting negotiation task for client connection to 0.0.0.0:37199 (local address 127.0.0.1:38898)
0927 23:33:09.156993 (+   598us) negotiation.cc:107] Waiting for socket to connect
0927 23:33:09.157024 (+    31us) client_negotiation.cc:174] Beginning negotiation
0927 23:33:09.157229 (+   205us) client_negotiation.cc:252] Sending NEGOTIATE NegotiatePB request
0927 23:33:09.555456 (+398227us) negotiation.cc:327] Negotiation complete: Network error: Client connection negotiation failed: client connection to 0.0.0.0:37199: BlockingRecv error: recv error from unknown peer: Transport endpoint is not connected (error 107)
Metrics: {"client-negotiator.queue_time_us":133}
W20260927 23:33:09.558705   892 negotiation.cc:337] Failed RPC negotiation. Trace:
0927 23:33:09.142903 (+     0us) reactor.cc:625] Submitting negotiation task for client connection to 0.0.0.0:37199 (local address 127.0.0.1:38892)
0927 23:33:09.143452 (+   549us) negotiation.cc:107] Waiting for socket to connect
0927 23:33:09.143484 (+    32us) client_negotiation.cc:174] Beginning negotiation
0927 23:33:09.143691 (+   207us) client_negotiation.cc:252] Sending NEGOTIATE NegotiatePB request
0927 23:33:09.554949 (+411258us) negotiation.cc:327] Negotiation complete: Network error: Client connection negotiation failed: client connection to 0.0.0.0:37199: BlockingRecv error: recv error from unknown peer: Transport endpoint is not connected (error 107)
Metrics: {"client-negotiator.queue_time_us":146}
W20260927 23:33:09.559216   883 negotiation.cc:337] Failed RPC negotiation. Trace:
0927 23:33:09.129160 (+     0us) reactor.cc:625] Submitting negotiation task for client connection to 0.0.0.0:37199 (local address 127.0.0.1:38886)
0927 23:33:09.129723 (+   563us) negotiation.cc:107] Waiting for socket to connect
0927 23:33:09.129774 (+    51us) client_negotiation.cc:174] Beginning negotiation
0927 23:33:09.129991 (+   217us) client_negotiation.cc:252] Sending NEGOTIATE NegotiatePB request
0927 23:33:09.555007 (+425016us) negotiation.cc:327] Negotiation complete: Network error: Client connection negotiation failed: client connection to 0.0.0.0:37199: BlockingRecv error: recv error from unknown peer: Transport endpoint is not connected (error 107)
Metrics: {"client-negotiator.queue_time_us":128}
W20260927 23:33:09.559595   910 negotiation.cc:337] Failed RPC negotiation. Trace:
0927 23:33:09.169843 (+     0us) reactor.cc:625] Submitting negotiation task for client connection to 0.0.0.0:37199 (local address 127.0.0.1:38900)
0927 23:33:09.170432 (+   589us) negotiation.cc:107] Waiting for socket to connect
0927 23:33:09.170465 (+    33us) client_negotiation.cc:174] Beginning negotiation
0927 23:33:09.170676 (+   211us) client_negotiation.cc:252] Sending NEGOTIATE NegotiatePB request
0927 23:33:09.556513 (+385837us) negotiation.cc:327] Negotiation complete: Network error: Client connection negotiation failed: client connection to 0.0.0.0:37199: BlockingRecv error: recv error from unknown peer: Transport endpoint is not connected (error 107)
Metrics: {"client-negotiator.queue_time_us":174}
W20260927 23:33:09.559759   874 negotiation.cc:337] Failed RPC negotiation. Trace:
0927 23:33:09.121439 (+     0us) reactor.cc:625] Submitting negotiation task for client connection to 0.0.0.0:37199 (local address 127.0.0.1:38878)
0927 23:33:09.122007 (+   568us) negotiation.cc:107] Waiting for socket to connect
0927 23:33:09.122037 (+    30us) client_negotiation.cc:174] Beginning negotiation
0927 23:33:09.122241 (+   204us) client_negotiation.cc:252] Sending NEGOTIATE NegotiatePB request
0927 23:33:09.554923 (+432682us) negotiation.cc:327] Negotiation complete: Network error: Client connection negotiation failed: client connection to 0.0.0.0:37199: BlockingRecv error: recv error from unknown peer: Transport endpoint is not connected (error 107)
Metrics: {"client-negotiator.queue_time_us":141}
[       OK ] Parameters/TestRpcSocketTxRxQueue.OverCapacity/0 (1235 ms)
[----------] 1 test from Parameters/TestRpcSocketTxRxQueue (1235 ms total)

[----------] Global test environment tear-down
[==========] 21 tests from 2 test suites ran. (247018 ms total)
[  PASSED  ] 20 tests.
[  FAILED  ] 1 test, listed below:
[  FAILED  ] Parameters/TestRpc.TestCallWithChainCertAndChainCA/SSL_TCP, where GetParam() = (true, false)

 1 FAILED TEST