Diagnosed failure

Parameters/TestRpc.TestCallWithChainCertAndChainCA/SSL_TCP: /data0/somelongdirectorytoavoidrpathissues/src/kudu/src/kudu/rpc/rpc-test.cc:270: Failure
Failed
Bad status: Runtime error: could not verify certificate chain (error with cert: subject=CN = localhost, ST = sadfjas, C = AS, emailAddress = sdflkdsajf, O = lskdfjlsad, OU = sldfkja, issuer=C = AS, ST = ASDfkjdhf, L = lskdjf, O = saldfja, OU = skdjf, CN = localhost, emailAddress = sadjflkadsj): : certificate has expired
Google Test trace:
/data0/somelongdirectorytoavoidrpathissues/src/kudu/src/kudu/rpc/rpc-test.cc:267: Connecting to 0.0.0.0:35525
I20260926 06:58:53.822258  9619 test_util.cc:175] -----------------------------------------------
I20260926 06:58:53.822312  9619 test_util.cc:176] Had fatal failures, leaving test files at /tmp/dist-test-taskU1sCnL/test-tmp/rpc-test.5.Parameters_TestRpc.TestCallWithChainCertAndChainCA_SSL_TCP.1790405933758600-9619-0

Full log

Note: This is test shard 6 of 8.
[==========] Running 21 tests from 2 test suites.
[----------] Global test environment set-up.
[----------] 20 tests from Parameters/TestRpc
[ RUN      ] Parameters/TestRpc.TestMessengerCreateDestroy/SSL_TCP
WARNING: Logging before InitGoogleLogging() is written to STDERR
I20260926 06:58:53.785665  9619 rpc-test.cc:169] started messenger TestCreateDestroy
[       OK ] Parameters/TestRpc.TestMessengerCreateDestroy/SSL_TCP (25 ms)
[ RUN      ] Parameters/TestRpc.TestNegotiationDeadlock/SSL_TCP
I20260926 06:58:53.798458  9639 acceptor_pool.cc:254] collecting diagnostics on the listening RPC socket 0.0.0.0:43781 every 8 connection(s)
I20260926 06:58:53.798458  9640 acceptor_pool.cc:254] collecting diagnostics on the listening RPC socket 0.0.0.0:43781 every 8 connection(s)
[       OK ] Parameters/TestRpc.TestNegotiationDeadlock/SSL_TCP (18 ms)
[ RUN      ] Parameters/TestRpc.TestCallWithChainCertAndChainCA/SSL_TCP
I20260926 06:58:53.818363  9655 acceptor_pool.cc:254] collecting diagnostics on the listening RPC socket 0.0.0.0:35525 every 8 connection(s)
I20260926 06:58:53.818391  9656 acceptor_pool.cc:254] collecting diagnostics on the listening RPC socket 0.0.0.0:35525 every 8 connection(s)
/data0/somelongdirectorytoavoidrpathissues/src/kudu/src/kudu/rpc/rpc-test.cc:270: Failure
Failed
Bad status: Runtime error: could not verify certificate chain (error with cert: subject=CN = localhost, ST = sadfjas, C = AS, emailAddress = sdflkdsajf, O = lskdfjlsad, OU = sldfkja, issuer=C = AS, ST = ASDfkjdhf, L = lskdjf, O = saldfja, OU = skdjf, CN = localhost, emailAddress = sadjflkadsj): : certificate has expired
Google Test trace:
/data0/somelongdirectorytoavoidrpathissues/src/kudu/src/kudu/rpc/rpc-test.cc:267: Connecting to 0.0.0.0:35525
I20260926 06:58:53.822258  9619 test_util.cc:175] -----------------------------------------------
I20260926 06:58:53.822312  9619 test_util.cc:176] Had fatal failures, leaving test files at /tmp/dist-test-taskU1sCnL/test-tmp/rpc-test.5.Parameters_TestRpc.TestCallWithChainCertAndChainCA_SSL_TCP.1790405933758600-9619-0
[  FAILED  ] Parameters/TestRpc.TestCallWithChainCertAndChainCA/SSL_TCP, where GetParam() = (true, false) (16 ms)
[ RUN      ] Parameters/TestRpc.TestCallWithPasswordProtectedKey/SSL_TCP
I20260926 06:58:53.828297  9680 acceptor_pool.cc:254] collecting diagnostics on the listening RPC socket 0.0.0.0:41493 every 8 connection(s)
I20260926 06:58:53.828313  9681 acceptor_pool.cc:254] collecting diagnostics on the listening RPC socket 0.0.0.0:41493 every 8 connection(s)
[       OK ] Parameters/TestRpc.TestCallWithPasswordProtectedKey/SSL_TCP (18 ms)
[ RUN      ] Parameters/TestRpc.TestCallToBadServer/SSL_TCP
I20260926 06:58:53.862699  9619 rpc-test.cc:394] Status: Network error: Client connection negotiation failed: client connection to 0.0.0.0:0: connect: Connection refused (error 111)
I20260926 06:58:53.862938  9619 rpc-test.cc:394] Status: Network error: Client connection negotiation failed: client connection to 0.0.0.0:0: connect: Connection refused (error 111)
I20260926 06:58:53.863082  9619 rpc-test.cc:394] Status: Network error: Client connection negotiation failed: client connection to 0.0.0.0:0: connect: Connection refused (error 111)
I20260926 06:58:53.863214  9619 rpc-test.cc:394] Status: Network error: Client connection negotiation failed: client connection to 0.0.0.0:0: connect: Connection refused (error 111)
I20260926 06:58:53.863373  9619 rpc-test.cc:394] Status: Network error: Client connection negotiation failed: client connection to 0.0.0.0:0: connect: Connection refused (error 111)
[       OK ] Parameters/TestRpc.TestCallToBadServer/SSL_TCP (23 ms)
[ RUN      ] Parameters/TestRpc.TestWrongService/SSL_TCP
I20260926 06:58:53.878662  9715 acceptor_pool.cc:254] collecting diagnostics on the listening RPC socket 0.0.0.0:40529 every 8 connection(s)
I20260926 06:58:53.878697  9716 acceptor_pool.cc:254] collecting diagnostics on the listening RPC socket 0.0.0.0:40529 every 8 connection(s)
I20260926 06:58:53.897909  9712 messenger.cc:345] service WrongServiceName not registered on TestServer
[       OK ] Parameters/TestRpc.TestWrongService/SSL_TCP (35 ms)
[ RUN      ] Parameters/TestRpc.TestConnectionKeepalive/SSL_TCP
I20260926 06:58:53.912182  9738 acceptor_pool.cc:254] collecting diagnostics on the listening RPC socket 0.0.0.0:38079 every 8 connection(s)
I20260926 06:58:53.912194  9739 acceptor_pool.cc:254] collecting diagnostics on the listening RPC socket 0.0.0.0:38079 every 8 connection(s)
I20260926 06:58:53.912315  9619 rpc-test.cc:488] Connecting to 0.0.0.0:38079
[       OK ] Parameters/TestRpc.TestConnectionKeepalive/SSL_TCP (1038 ms)
[ RUN      ] Parameters/TestRpc.TestClientConnectionMetrics/SSL_TCP
I20260926 06:58:54.968542  9763 acceptor_pool.cc:254] collecting diagnostics on the listening RPC socket 0.0.0.0:36021 every 8 connection(s)
I20260926 06:58:54.968554  9764 acceptor_pool.cc:254] collecting diagnostics on the listening RPC socket 0.0.0.0:36021 every 8 connection(s)
I20260926 06:58:54.968683  9619 rpc-test.cc:569] Connecting to 0.0.0.0:36021
[       OK ] Parameters/TestRpc.TestClientConnectionMetrics/SSL_TCP (7836 ms)
[ RUN      ] Parameters/TestRpc.TestCredentialsPolicy/SSL_TCP
I20260926 06:59:02.786990  9786 acceptor_pool.cc:254] collecting diagnostics on the listening RPC socket 0.0.0.0:43175 every 8 connection(s)
I20260926 06:59:02.787011  9787 acceptor_pool.cc:254] collecting diagnostics on the listening RPC socket 0.0.0.0:43175 every 8 connection(s)
I20260926 06:59:02.787072  9619 rpc-test.cc:700] Connecting to 0.0.0.0:43175
[       OK ] Parameters/TestRpc.TestCredentialsPolicy/SSL_TCP (37 ms)
[ RUN      ] Parameters/TestRpc.TestCallLongerThanKeepalive/SSL_TCP
I20260926 06:59:02.827991  9811 acceptor_pool.cc:254] collecting diagnostics on the listening RPC socket 0.0.0.0:35929 every 8 connection(s)
I20260926 06:59:02.828030  9812 acceptor_pool.cc:254] collecting diagnostics on the listening RPC socket 0.0.0.0:35929 every 8 connection(s)
I20260926 06:59:02.837276  9815 rpc-test-base.h:222] got call: sleep_micros: 3000000 deferred: true
I20260926 06:59:05.837968  9815 rpcz_store.cc:275] Call kudu.rpc.GenericCalculatorService.Sleep from 127.0.0.1:38442 (request call id 0) took 3000 ms. Trace:
I20260926 06:59:05.838079  9815 rpcz_store.cc:276] 0926 06:59:02.837227 (+     0us) service_pool.cc:170] Inserting onto call queue
0926 06:59:02.837259 (+    32us) service_pool.cc:227] Handling call
0926 06:59:05.837951 (+3000692us) inbound_call.cc:173] Queueing success response
Metrics: {}
[       OK ] Parameters/TestRpc.TestCallLongerThanKeepalive/SSL_TCP (3027 ms)
[ RUN      ] Parameters/TestRpc.TestRpcSidecar/SSL_TCP
I20260926 06:59:05.863723  9836 acceptor_pool.cc:254] collecting diagnostics on the listening RPC socket 0.0.0.0:43481 every 8 connection(s)
I20260926 06:59:05.863758  9837 acceptor_pool.cc:254] collecting diagnostics on the listening RPC socket 0.0.0.0:43481 every 8 connection(s)
[       OK ] Parameters/TestRpc.TestRpcSidecar/SSL_TCP (67 ms)
[ RUN      ] Parameters/TestRpc.TestRpcSidecarLimits/SSL_TCP
I20260926 06:59:07.541314  9861 acceptor_pool.cc:254] collecting diagnostics on the listening RPC socket 0.0.0.0:37821 every 8 connection(s)
I20260926 06:59:07.541322  9862 acceptor_pool.cc:254] collecting diagnostics on the listening RPC socket 0.0.0.0:37821 every 8 connection(s)
W20260926 06:59:07.551010  9619 serialization.cc:72] Serialized kudu.rpc_test.PushStringsRequestPB (2147483654 bytes) is larger than the maximum configured RPC message size (52428800 bytes). Sending anyway, but peer may reject the data.
W20260926 06:59:07.553982  9860 connection.cc:535] server connection from 127.0.0.1:57918 recv error: Network error: RPC frame had a length of 2147483714, but we only support messages up to 52428800 bytes long.
W20260926 06:59:07.554032  9860 connection.cc:158] shutting down server connection from 127.0.0.1:57918 with pending inbound data: 4/2147483714 bytes received; last active 0 ns ago: status Network error: RPC frame had a length of 2147483714, but we only support messages up to 52428800 bytes long.
W20260926 06:59:07.554216  9874 connection.cc:196] Error closing socket: Network error: TlsSocket::Close: Connection reset by peer
I20260926 06:59:07.571942  9886 acceptor_pool.cc:254] collecting diagnostics on the listening RPC socket 0.0.0.0:37495 every 8 connection(s)
I20260926 06:59:07.572005  9887 acceptor_pool.cc:254] collecting diagnostics on the listening RPC socket 0.0.0.0:37495 every 8 connection(s)
W20260926 06:59:11.210731  9884 connection.cc:577] server connection from 127.0.0.1:56922: received bad data: 'Corruption: Invalid packet: message had a length of 2147483710, but we only support messages up to 2147483647 bytes
'
[       OK ] Parameters/TestRpc.TestRpcSidecarLimits/SSL_TCP (5304 ms)
[ RUN      ] Parameters/TestRpc.TestCallTimeoutDoesntAffectNegotiation/SSL_TCP
I20260926 06:59:11.235025  9911 acceptor_pool.cc:254] collecting diagnostics on the listening RPC socket 0.0.0.0:45781 every 8 connection(s)
I20260926 06:59:11.235067  9912 acceptor_pool.cc:254] collecting diagnostics on the listening RPC socket 0.0.0.0:45781 every 8 connection(s)
W20260926 06:59:11.253052  9907 negotiation.cc:266] Injecting 500ms delay in negotiation
I20260926 06:59:11.303355  9619 rpc-test-base.h:595] status: Timed out: connection negotiation to 0.0.0.0:45781 for RPC Sleep timed out after 0.050s (ON_OUTBOUND_QUEUE), seconds elapsed: 0.0506735
[       OK ] Parameters/TestRpc.TestCallTimeoutDoesntAffectNegotiation/SSL_TCP (544 ms)
[ RUN      ] Parameters/TestRpc.TestRpcHandlerLatencyMetric/SSL_TCP
I20260926 06:59:11.769778  9936 acceptor_pool.cc:254] collecting diagnostics on the listening RPC socket 0.0.0.0:33735 every 8 connection(s)
I20260926 06:59:11.769786  9937 acceptor_pool.cc:254] collecting diagnostics on the listening RPC socket 0.0.0.0:33735 every 8 connection(s)
I20260926 06:59:11.805712  9619 rpc-test.cc:1236] Sleep() min lat: 20337
I20260926 06:59:11.805790  9619 rpc-test.cc:1237] Sleep() mean lat: 20337
I20260926 06:59:11.805815  9619 rpc-test.cc:1238] Sleep() max lat: 20337
I20260926 06:59:11.805827  9619 rpc-test.cc:1239] Sleep() #calls: 1
[       OK ] Parameters/TestRpc.TestRpcHandlerLatencyMetric/SSL_TCP (49 ms)
[ RUN      ] Parameters/TestRpc.TimedOutOnResponseMetricServiceQueue/SSL_TCP
I20260926 06:59:11.822016  9962 acceptor_pool.cc:254] collecting diagnostics on the listening RPC socket 0.0.0.0:39747 every 8 connection(s)
I20260926 06:59:11.822032  9963 acceptor_pool.cc:254] collecting diagnostics on the listening RPC socket 0.0.0.0:39747 every 8 connection(s)
W20260926 06:59:11.872741  9964 rpcz_store.cc:267] Call kudu.rpc_test.CalculatorService.Sleep from 127.0.0.1:34556 (request call id 2) took 20 ms (client timeout 20 ms). Trace:
W20260926 06:59:11.872843  9964 rpcz_store.cc:269] 0926 06:59:11.852483 (+     0us) service_pool.cc:170] Inserting onto call queue
0926 06:59:11.872719 (+ 20236us) service_pool.cc:214] Skipping call since client already timed out
0926 06:59:11.872728 (+     9us) inbound_call.cc:173] Queueing failure response
Metrics: {}
[       OK ] Parameters/TestRpc.TimedOutOnResponseMetricServiceQueue/SSL_TCP (67 ms)
[ RUN      ] Parameters/TestRpc.RpcPendingConnectionsMetric/SSL_TCP
I20260926 06:59:11.876746  9985 acceptor_pool.cc:254] collecting diagnostics on the listening RPC socket 0.0.0.0:41595 every 8 connection(s)
I20260926 06:59:11.876796  9986 acceptor_pool.cc:254] collecting diagnostics on the listening RPC socket 0.0.0.0:41595 every 8 connection(s)
W20260926 06:59:11.877293  9981 negotiation.cc:337] Failed RPC negotiation. Trace:
0926 06:59:11.877141 (+     0us) reactor.cc:625] Submitting negotiation task for server connection from 127.0.0.1:51884 (local address 127.0.0.1:41595)
0926 06:59:11.877180 (+    39us) server_negotiation.cc:206] Beginning negotiation
0926 06:59:11.877182 (+     2us) server_negotiation.cc:399] Waiting for connection header
0926 06:59:11.877242 (+    60us) negotiation.cc:327] Negotiation complete: Network error: Server connection negotiation failed: server connection from 127.0.0.1:51884: BlockingRecv error: recv got EOF from 127.0.0.1:51884 (error 108)
Metrics: {"server-negotiator.queue_time_us":13}
[       OK ] Parameters/TestRpc.RpcPendingConnectionsMetric/SSL_TCP (12 ms)
[ RUN      ] Parameters/TestRpc.TestRpcContextClientDeadline/SSL_TCP
I20260926 06:59:11.912690 10001 acceptor_pool.cc:254] collecting diagnostics on the listening RPC socket 0.0.0.0:34435 every 8 connection(s)
I20260926 06:59:11.912710 10002 acceptor_pool.cc:254] collecting diagnostics on the listening RPC socket 0.0.0.0:34435 every 8 connection(s)
[       OK ] Parameters/TestRpc.TestRpcContextClientDeadline/SSL_TCP (60 ms)
[ RUN      ] Parameters/TestRpc.TestApplicationFeatureFlagUnsupportedServer/SSL_TCP
I20260926 06:59:11.959206 10026 acceptor_pool.cc:254] collecting diagnostics on the listening RPC socket 0.0.0.0:35075 every 8 connection(s)
I20260926 06:59:11.959240 10027 acceptor_pool.cc:254] collecting diagnostics on the listening RPC socket 0.0.0.0:35075 every 8 connection(s)
[       OK ] Parameters/TestRpc.TestApplicationFeatureFlagUnsupportedServer/SSL_TCP (25 ms)
[ RUN      ] Parameters/TestRpc.TestCancellationAsync/SSL_TCP
I20260926 06:59:11.981307 10051 acceptor_pool.cc:254] collecting diagnostics on the listening RPC socket 0.0.0.0:40193 every 8 connection(s)
I20260926 06:59:11.981340 10052 acceptor_pool.cc:254] collecting diagnostics on the listening RPC socket 0.0.0.0:40193 every 8 connection(s)
I20260926 06:59:11.981503  9619 rpc-test.cc:1716] Connecting to 0.0.0.0:40193
I20260926 06:59:11.999744  9619 test_util.cc:268] Using random seed: 1590021886
I20260926 06:59:12.015388 10055 rpc-test-base.h:240] got call: sleep_micros: 500 pattern: 4294967295 num_repetitions: 2097152 sidecar_idx: 0
I20260926 06:59:12.027105 10055 rpc-test-base.h:240] got call: sleep_micros: 500 pattern: 4294967295 num_repetitions: 2097152 sidecar_idx: 0
I20260926 06:59:12.038972 10055 rpc-test-base.h:240] got call: sleep_micros: 500 pattern: 4294967295 num_repetitions: 2097152 sidecar_idx: 0
I20260926 06:59:12.050844 10055 rpc-test-base.h:240] got call: sleep_micros: 500 pattern: 4294967295 num_repetitions: 2097152 sidecar_idx: 0
I20260926 06:59:12.061822 10055 rpc-test-base.h:240] got call: sleep_micros: 500 pattern: 4294967295 num_repetitions: 2097152 sidecar_idx: 0
I20260926 06:59:12.073096 10055 rpc-test-base.h:240] got call: sleep_micros: 500 pattern: 4294967295 num_repetitions: 2097152 sidecar_idx: 0
I20260926 06:59:12.085215 10055 rpc-test-base.h:240] got call: sleep_micros: 500 pattern: 4294967295 num_repetitions: 2097152 sidecar_idx: 0
I20260926 06:59:12.096930 10055 rpc-test-base.h:240] got call: sleep_micros: 500 pattern: 4294967295 num_repetitions: 2097152 sidecar_idx: 0
W20260926 06:59:12.099830 10049 connection.cc:441] server connection from 127.0.0.1:40610 torn down before Call kudu.rpc.GenericCalculatorService.SleepWithSidecar from 127.0.0.1:40610 (request call id 9) could send its response
[       OK ] Parameters/TestRpc.TestCancellationAsync/SSL_TCP (126 ms)
[ RUN      ] Parameters/TestRpc.TestPerformanceBySocketType/SSL_TCP
I20260926 06:59:12.113662 10077 acceptor_pool.cc:254] collecting diagnostics on the listening RPC socket 0.0.0.0:37905 every 8 connection(s)
I20260926 06:59:12.113837  9619 rpc-test.cc:1846] Connecting to 0.0.0.0:37905
I20260926 06:59:12.113766 10076 acceptor_pool.cc:254] collecting diagnostics on the listening RPC socket 0.0.0.0:37905 every 8 connection(s)
I20260926 06:59:13.643244  9619 rpc-test.cc:1859] Sending 1024MB via ssl-enabled tcp socket: real 1.508s	user 1.403s	sys 1.276s
I20260926 06:59:15.167325  9619 rpc-test.cc:1859] Sending 1024MB via ssl-enabled tcp socket: real 1.524s	user 1.363s	sys 1.331s
I20260926 06:59:16.609182  9619 rpc-test.cc:1859] Sending 1024MB via ssl-enabled tcp socket: real 1.442s	user 1.369s	sys 1.207s
I20260926 06:59:18.138482  9619 rpc-test.cc:1859] Sending 1024MB via ssl-enabled tcp socket: real 1.529s	user 1.475s	sys 1.249s
I20260926 06:59:19.675935  9619 rpc-test.cc:1859] Sending 1024MB via ssl-enabled tcp socket: real 1.537s	user 1.485s	sys 1.245s
[       OK ] Parameters/TestRpc.TestPerformanceBySocketType/SSL_TCP (7576 ms)
[----------] 20 tests from Parameters/TestRpc (25916 ms total)

[----------] 1 test from Parameters/TestRpcSocketTxRxQueue
[ RUN      ] Parameters/TestRpcSocketTxRxQueue.OverCapacity/0
W20260926 06:59:19.941560 10093 negotiation.cc:337] Failed RPC negotiation. Trace:
0926 06:59:19.679142 (+     0us) reactor.cc:625] Submitting negotiation task for client connection to 0.0.0.0:44493 (local address 127.0.0.1:39512)
0926 06:59:19.679181 (+    39us) negotiation.cc:107] Waiting for socket to connect
0926 06:59:19.679190 (+     9us) client_negotiation.cc:174] Beginning negotiation
0926 06:59:19.679235 (+    45us) client_negotiation.cc:252] Sending NEGOTIATE NegotiatePB request
0926 06:59:19.941429 (+262194us) negotiation.cc:327] Negotiation complete: Network error: Client connection negotiation failed: client connection to 0.0.0.0:44493: BlockingRecv error: recv error from unknown peer: Transport endpoint is not connected (error 107)
Metrics: {"client-negotiator.queue_time_us":16}
W20260926 06:59:19.941570 10129 negotiation.cc:337] Failed RPC negotiation. Trace:
0926 06:59:19.682274 (+     0us) reactor.cc:625] Submitting negotiation task for client connection to 0.0.0.0:44493 (local address 127.0.0.1:39562)
0926 06:59:19.682318 (+    44us) negotiation.cc:107] Waiting for socket to connect
0926 06:59:19.682326 (+     8us) client_negotiation.cc:174] Beginning negotiation
0926 06:59:19.682363 (+    37us) client_negotiation.cc:252] Sending NEGOTIATE NegotiatePB request
0926 06:59:19.941507 (+259144us) negotiation.cc:327] Negotiation complete: Network error: Client connection negotiation failed: client connection to 0.0.0.0:44493: BlockingRecv error: recv error from unknown peer: Transport endpoint is not connected (error 107)
Metrics: {"client-negotiator.queue_time_us":27}
W20260926 06:59:19.941713 10102 negotiation.cc:337] Failed RPC negotiation. Trace:
0926 06:59:19.679959 (+     0us) reactor.cc:625] Submitting negotiation task for client connection to 0.0.0.0:44493 (local address 127.0.0.1:39518)
0926 06:59:19.680006 (+    47us) negotiation.cc:107] Waiting for socket to connect
0926 06:59:19.680015 (+     9us) client_negotiation.cc:174] Beginning negotiation
0926 06:59:19.680054 (+    39us) client_negotiation.cc:252] Sending NEGOTIATE NegotiatePB request
0926 06:59:19.941429 (+261375us) negotiation.cc:327] Negotiation complete: Network error: Client connection negotiation failed: client connection to 0.0.0.0:44493: BlockingRecv error: recv error from unknown peer: Transport endpoint is not connected (error 107)
Metrics: {"client-negotiator.queue_time_us":27}
W20260926 06:59:19.941570 10138 negotiation.cc:337] Failed RPC negotiation. Trace:
0926 06:59:19.683022 (+     0us) reactor.cc:625] Submitting negotiation task for client connection to 0.0.0.0:44493 (local address 127.0.0.1:39568)
0926 06:59:19.683069 (+    47us) negotiation.cc:107] Waiting for socket to connect
0926 06:59:19.683078 (+     9us) client_negotiation.cc:174] Beginning negotiation
0926 06:59:19.683113 (+    35us) client_negotiation.cc:252] Sending NEGOTIATE NegotiatePB request
0926 06:59:19.941542 (+258429us) negotiation.cc:327] Negotiation complete: Network error: Client connection negotiation failed: client connection to 0.0.0.0:44493: BlockingRecv error: recv error from unknown peer: Transport endpoint is not connected (error 107)
Metrics: {"client-negotiator.queue_time_us":28}
W20260926 06:59:19.941860 10111 negotiation.cc:337] Failed RPC negotiation. Trace:
0926 06:59:19.680727 (+     0us) reactor.cc:625] Submitting negotiation task for client connection to 0.0.0.0:44493 (local address 127.0.0.1:39534)
0926 06:59:19.680771 (+    44us) negotiation.cc:107] Waiting for socket to connect
0926 06:59:19.680779 (+     8us) client_negotiation.cc:174] Beginning negotiation
0926 06:59:19.680816 (+    37us) client_negotiation.cc:252] Sending NEGOTIATE NegotiatePB request
0926 06:59:19.941429 (+260613us) negotiation.cc:327] Negotiation complete: Network error: Client connection negotiation failed: client connection to 0.0.0.0:44493: BlockingRecv error: recv error from unknown peer: Transport endpoint is not connected (error 107)
Metrics: {"client-negotiator.queue_time_us":26}
W20260926 06:59:19.942219 10120 negotiation.cc:337] Failed RPC negotiation. Trace:
0926 06:59:19.681507 (+     0us) reactor.cc:625] Submitting negotiation task for client connection to 0.0.0.0:44493 (local address 127.0.0.1:39546)
0926 06:59:19.681550 (+    43us) negotiation.cc:107] Waiting for socket to connect
0926 06:59:19.681558 (+     8us) client_negotiation.cc:174] Beginning negotiation
0926 06:59:19.681597 (+    39us) client_negotiation.cc:252] Sending NEGOTIATE NegotiatePB request
0926 06:59:19.941430 (+259833us) negotiation.cc:327] Negotiation complete: Network error: Client connection negotiation failed: client connection to 0.0.0.0:44493: BlockingRecv error: recv error from unknown peer: Transport endpoint is not connected (error 107)
Metrics: {"client-negotiator.queue_time_us":24}
[       OK ] Parameters/TestRpcSocketTxRxQueue.OverCapacity/0 (1019 ms)
[----------] 1 test from Parameters/TestRpcSocketTxRxQueue (1019 ms total)

[----------] Global test environment tear-down
[==========] 21 tests from 2 test suites ran. (26936 ms total)
[  PASSED  ] 20 tests.
[  FAILED  ] 1 test, listed below:
[  FAILED  ] Parameters/TestRpc.TestCallWithChainCertAndChainCA/SSL_TCP, where GetParam() = (true, false)

 1 FAILED TEST