Diagnosed failure
Parameters/TestRpc.TestCallWithChainCertAndChainCA/SSL_UnixSocket: /data0/somelongdirectorytoavoidrpathissues/src/kudu/src/kudu/rpc/rpc-test.cc:270: Failure
Failed
Bad status: Runtime error: could not verify certificate chain (error with cert: subject=CN = localhost, ST = sadfjas, C = AS, emailAddress = sdflkdsajf, O = lskdfjlsad, OU = sldfkja, issuer=C = AS, ST = ASDfkjdhf, L = lskdjf, O = saldfja, OU = skdjf, CN = localhost, emailAddress = sadjflkadsj): : certificate has expired
Google Test trace:
/data0/somelongdirectorytoavoidrpathissues/src/kudu/src/kudu/rpc/rpc-test.cc:267: Connecting to unix:/tmp/dist-test-taskibczIH/test-tmp/rpc-test-15f6785c83c843789b69188c94794156.sock
I20260924 03:11:46.756481 7494 test_util.cc:175] -----------------------------------------------
I20260924 03:11:46.756593 7494 test_util.cc:176] Had fatal failures, leaving test files at /tmp/dist-test-taskibczIH/test-tmp/rpc-test.6.Parameters_TestRpc.TestCallWithChainCertAndChainCA_SSL_UnixSocket.1790219506638190-7494-0
Full log
Note: This is test shard 7 of 8.
[==========] Running 21 tests from 2 test suites.
[----------] Global test environment set-up.
[----------] 20 tests from Parameters/TestRpc
[ RUN ] Parameters/TestRpc.TestMessengerCreateDestroy/SSL_UnixSocket
WARNING: Logging before InitGoogleLogging() is written to STDERR
I20260924 03:11:46.680809 7494 rpc-test.cc:169] started messenger TestCreateDestroy
[ OK ] Parameters/TestRpc.TestMessengerCreateDestroy/SSL_UnixSocket (27 ms)
[ RUN ] Parameters/TestRpc.TestNegotiationDeadlock/SSL_UnixSocket
I20260924 03:11:46.708164 7514 acceptor_pool.cc:254] collecting diagnostics on the listening RPC socket unix:/tmp/dist-test-taskibczIH/test-tmp/rpc-test-cc6bed1c1f3446ff9ccd6b6dd462eefc.sock every 8 connection(s)
I20260924 03:11:46.708463 7515 acceptor_pool.cc:254] collecting diagnostics on the listening RPC socket unix:/tmp/dist-test-taskibczIH/test-tmp/rpc-test-cc6bed1c1f3446ff9ccd6b6dd462eefc.sock every 8 connection(s)
[ OK ] Parameters/TestRpc.TestNegotiationDeadlock/SSL_UnixSocket (43 ms)
[ RUN ] Parameters/TestRpc.TestCallWithChainCertAndChainCA/SSL_UnixSocket
I20260924 03:11:46.744962 7530 acceptor_pool.cc:254] collecting diagnostics on the listening RPC socket unix:/tmp/dist-test-taskibczIH/test-tmp/rpc-test-15f6785c83c843789b69188c94794156.sock every 8 connection(s)
I20260924 03:11:46.745330 7531 acceptor_pool.cc:254] collecting diagnostics on the listening RPC socket unix:/tmp/dist-test-taskibczIH/test-tmp/rpc-test-15f6785c83c843789b69188c94794156.sock every 8 connection(s)
/data0/somelongdirectorytoavoidrpathissues/src/kudu/src/kudu/rpc/rpc-test.cc:270: Failure
Failed
Bad status: Runtime error: could not verify certificate chain (error with cert: subject=CN = localhost, ST = sadfjas, C = AS, emailAddress = sdflkdsajf, O = lskdfjlsad, OU = sldfkja, issuer=C = AS, ST = ASDfkjdhf, L = lskdjf, O = saldfja, OU = skdjf, CN = localhost, emailAddress = sadjflkadsj): : certificate has expired
Google Test trace:
/data0/somelongdirectorytoavoidrpathissues/src/kudu/src/kudu/rpc/rpc-test.cc:267: Connecting to unix:/tmp/dist-test-taskibczIH/test-tmp/rpc-test-15f6785c83c843789b69188c94794156.sock
I20260924 03:11:46.756481 7494 test_util.cc:175] -----------------------------------------------
I20260924 03:11:46.756593 7494 test_util.cc:176] Had fatal failures, leaving test files at /tmp/dist-test-taskibczIH/test-tmp/rpc-test.6.Parameters_TestRpc.TestCallWithChainCertAndChainCA_SSL_UnixSocket.1790219506638190-7494-0
[ FAILED ] Parameters/TestRpc.TestCallWithChainCertAndChainCA/SSL_UnixSocket, where GetParam() = (true, true) (28 ms)
[ RUN ] Parameters/TestRpc.TestCallWithPasswordProtectedKey/SSL_UnixSocket
I20260924 03:11:46.780117 7555 acceptor_pool.cc:254] collecting diagnostics on the listening RPC socket unix:/tmp/dist-test-taskibczIH/test-tmp/rpc-test-481e27fe06624f71b0abe5cd2bff0990.sock every 8 connection(s)
I20260924 03:11:46.780369 7556 acceptor_pool.cc:254] collecting diagnostics on the listening RPC socket unix:/tmp/dist-test-taskibczIH/test-tmp/rpc-test-481e27fe06624f71b0abe5cd2bff0990.sock every 8 connection(s)
W20260924 03:11:46.810236 7552 connection.cc:196] Error closing socket: Network error: TlsSocket::Close: Broken pipe
[ OK ] Parameters/TestRpc.TestCallWithPasswordProtectedKey/SSL_UnixSocket (58 ms)
[ RUN ] Parameters/TestRpc.TestCallToBadServer/SSL_UnixSocket
I20260924 03:11:46.838968 7494 rpc-test.cc:394] Status: Network error: Client connection negotiation failed: client connection to 0.0.0.0:0: connect: Connection refused (error 111)
I20260924 03:11:46.839597 7494 rpc-test.cc:394] Status: Network error: Client connection negotiation failed: client connection to 0.0.0.0:0: connect: Connection refused (error 111)
I20260924 03:11:46.840117 7494 rpc-test.cc:394] Status: Network error: Client connection negotiation failed: client connection to 0.0.0.0:0: connect: Connection refused (error 111)
I20260924 03:11:46.840606 7494 rpc-test.cc:394] Status: Network error: Client connection negotiation failed: client connection to 0.0.0.0:0: connect: Connection refused (error 111)
I20260924 03:11:46.841113 7494 rpc-test.cc:394] Status: Network error: Client connection negotiation failed: client connection to 0.0.0.0:0: connect: Connection refused (error 111)
[ OK ] Parameters/TestRpc.TestCallToBadServer/SSL_UnixSocket (28 ms)
[ RUN ] Parameters/TestRpc.TestWrongService/SSL_UnixSocket
I20260924 03:11:46.864481 7590 acceptor_pool.cc:254] collecting diagnostics on the listening RPC socket unix:/tmp/dist-test-taskibczIH/test-tmp/rpc-test-ad27e2726e3c4e419ccd953a89c17ce7.sock every 8 connection(s)
I20260924 03:11:46.864720 7591 acceptor_pool.cc:254] collecting diagnostics on the listening RPC socket unix:/tmp/dist-test-taskibczIH/test-tmp/rpc-test-ad27e2726e3c4e419ccd953a89c17ce7.sock every 8 connection(s)
I20260924 03:11:46.880751 7587 messenger.cc:345] service WrongServiceName not registered on TestServer
[ OK ] Parameters/TestRpc.TestWrongService/SSL_UnixSocket (43 ms)
[ RUN ] Parameters/TestRpc.TestConnectionKeepalive/SSL_UnixSocket
I20260924 03:11:46.899992 7613 acceptor_pool.cc:254] collecting diagnostics on the listening RPC socket unix:/tmp/dist-test-taskibczIH/test-tmp/rpc-test-1cdf44db0f09424c9ac52f5ffe56b88e.sock every 8 connection(s)
I20260924 03:11:46.900216 7614 acceptor_pool.cc:254] collecting diagnostics on the listening RPC socket unix:/tmp/dist-test-taskibczIH/test-tmp/rpc-test-1cdf44db0f09424c9ac52f5ffe56b88e.sock every 8 connection(s)
I20260924 03:11:46.901249 7494 rpc-test.cc:488] Connecting to unix:/tmp/dist-test-taskibczIH/test-tmp/rpc-test-1cdf44db0f09424c9ac52f5ffe56b88e.sock
W20260924 03:11:47.389072 7626 connection.cc:196] Error closing socket: Network error: TlsSocket::Close: Broken pipe
[ OK ] Parameters/TestRpc.TestConnectionKeepalive/SSL_UnixSocket (1040 ms)
[ RUN ] Parameters/TestRpc.TestClientConnectionMetrics/SSL_UnixSocket
I20260924 03:11:47.937615 7638 acceptor_pool.cc:254] collecting diagnostics on the listening RPC socket unix:/tmp/dist-test-taskibczIH/test-tmp/rpc-test-0c4baf48018345e8a3f81430e8face8f.sock every 8 connection(s)
I20260924 03:11:47.937901 7639 acceptor_pool.cc:254] collecting diagnostics on the listening RPC socket unix:/tmp/dist-test-taskibczIH/test-tmp/rpc-test-0c4baf48018345e8a3f81430e8face8f.sock every 8 connection(s)
I20260924 03:11:47.938890 7494 rpc-test.cc:569] Connecting to unix:/tmp/dist-test-taskibczIH/test-tmp/rpc-test-0c4baf48018345e8a3f81430e8face8f.sock
W20260924 03:12:09.522183 7635 connection.cc:196] Error closing socket: Network error: TlsSocket::Close: Broken pipe
[ OK ] Parameters/TestRpc.TestClientConnectionMetrics/SSL_UnixSocket (21602 ms)
[ RUN ] Parameters/TestRpc.TestCredentialsPolicy/SSL_UnixSocket
I20260924 03:12:09.555333 7661 acceptor_pool.cc:254] collecting diagnostics on the listening RPC socket unix:/tmp/dist-test-taskibczIH/test-tmp/rpc-test-dfcb44ac892c44ee9a32a980dfb760a9.sock every 8 connection(s)
I20260924 03:12:09.555557 7662 acceptor_pool.cc:254] collecting diagnostics on the listening RPC socket unix:/tmp/dist-test-taskibczIH/test-tmp/rpc-test-dfcb44ac892c44ee9a32a980dfb760a9.sock every 8 connection(s)
I20260924 03:12:09.556558 7494 rpc-test.cc:700] Connecting to unix:/tmp/dist-test-taskibczIH/test-tmp/rpc-test-dfcb44ac892c44ee9a32a980dfb760a9.sock
W20260924 03:12:09.597375 7660 connection.cc:196] Error closing socket: Network error: TlsSocket::Close: Broken pipe
W20260924 03:12:09.605473 7660 connection.cc:196] Error closing socket: Network error: TlsSocket::Close: Broken pipe
[ OK ] Parameters/TestRpc.TestCredentialsPolicy/SSL_UnixSocket (79 ms)
[ RUN ] Parameters/TestRpc.TestCallLongerThanKeepalive/SSL_UnixSocket
I20260924 03:12:09.645394 7686 acceptor_pool.cc:254] collecting diagnostics on the listening RPC socket unix:/tmp/dist-test-taskibczIH/test-tmp/rpc-test-94b14db7c5ff4d9688749f83a689be0a.sock every 8 connection(s)
I20260924 03:12:09.645674 7687 acceptor_pool.cc:254] collecting diagnostics on the listening RPC socket unix:/tmp/dist-test-taskibczIH/test-tmp/rpc-test-94b14db7c5ff4d9688749f83a689be0a.sock every 8 connection(s)
I20260924 03:12:09.688210 7690 rpc-test-base.h:222] got call: sleep_micros: 3000000 deferred: true
I20260924 03:12:12.689901 7690 rpcz_store.cc:275] Call kudu.rpc.GenericCalculatorService.Sleep from unix:<unnamed> (request call id 0) took 3001 ms. Trace:
I20260924 03:12:12.690062 7690 rpcz_store.cc:276] 0924 03:12:09.688096 (+ 0us) service_pool.cc:170] Inserting onto call queue
0924 03:12:09.688164 (+ 68us) service_pool.cc:227] Handling call
0924 03:12:12.689855 (+3001691us) inbound_call.cc:173] Queueing success response
Metrics: {}
[ OK ] Parameters/TestRpc.TestCallLongerThanKeepalive/SSL_UnixSocket (3087 ms)
[ RUN ] Parameters/TestRpc.TestRpcSidecar/SSL_UnixSocket
I20260924 03:12:12.721596 7711 acceptor_pool.cc:254] collecting diagnostics on the listening RPC socket unix:/tmp/dist-test-taskibczIH/test-tmp/rpc-test-b88dab5cef6b46bb9ad9b1713526dd77.sock every 8 connection(s)
I20260924 03:12:12.721872 7712 acceptor_pool.cc:254] collecting diagnostics on the listening RPC socket unix:/tmp/dist-test-taskibczIH/test-tmp/rpc-test-b88dab5cef6b46bb9ad9b1713526dd77.sock every 8 connection(s)
W20260924 03:12:12.824563 7708 connection.cc:196] Error closing socket: Network error: TlsSocket::Close: Broken pipe
[ OK ] Parameters/TestRpc.TestRpcSidecar/SSL_UnixSocket (131 ms)
[ RUN ] Parameters/TestRpc.TestRpcSidecarLimits/SSL_UnixSocket
I20260924 03:12:14.877560 7736 acceptor_pool.cc:254] collecting diagnostics on the listening RPC socket unix:/tmp/dist-test-taskibczIH/test-tmp/rpc-test-8114e706c7cc4e768b736e55f90319f4.sock every 8 connection(s)
I20260924 03:12:14.877830 7737 acceptor_pool.cc:254] collecting diagnostics on the listening RPC socket unix:/tmp/dist-test-taskibczIH/test-tmp/rpc-test-8114e706c7cc4e768b736e55f90319f4.sock every 8 connection(s)
W20260924 03:12:14.886546 7494 serialization.cc:72] Serialized kudu.rpc_test.PushStringsRequestPB (2147483654 bytes) is larger than the maximum configured RPC message size (52428800 bytes). Sending anyway, but peer may reject the data.
W20260924 03:12:14.892379 7733 connection.cc:535] server connection from unix:<unnamed> recv error: Network error: RPC frame had a length of 2147483714, but we only support messages up to 52428800 bytes long.
W20260924 03:12:14.892500 7733 connection.cc:158] shutting down server connection from unix:<unnamed> with pending inbound data: 4/2147483714 bytes received; last active 0 ns ago: status Network error: RPC frame had a length of 2147483714, but we only support messages up to 52428800 bytes long.
W20260924 03:12:14.892980 7749 connection.cc:196] Error closing socket: Network error: TlsSocket::Close: Broken pipe
I20260924 03:12:14.909358 7761 acceptor_pool.cc:254] collecting diagnostics on the listening RPC socket unix:/tmp/dist-test-taskibczIH/test-tmp/rpc-test-8114e706c7cc4e768b736e55f90319f4.sock every 8 connection(s)
I20260924 03:12:14.910096 7762 acceptor_pool.cc:254] collecting diagnostics on the listening RPC socket unix:/tmp/dist-test-taskibczIH/test-tmp/rpc-test-8114e706c7cc4e768b736e55f90319f4.sock every 8 connection(s)
W20260924 03:12:20.507117 7758 connection.cc:577] server connection from unix:<unnamed>: received bad data: 'Corruption: Invalid packet: message had a length of 2147483710, but we only support messages up to 2147483647 bytes
'
W20260924 03:12:20.507750 7774 connection.cc:196] Error closing socket: Network error: TlsSocket::Close: Broken pipe
[ OK ] Parameters/TestRpc.TestRpcSidecarLimits/SSL_UnixSocket (8139 ms)
[ RUN ] Parameters/TestRpc.TestCallTimeoutDoesntAffectNegotiation/SSL_UnixSocket
I20260924 03:12:20.992647 7786 acceptor_pool.cc:254] collecting diagnostics on the listening RPC socket unix:/tmp/dist-test-taskibczIH/test-tmp/rpc-test-3d4d9947b2264946843e55fd2c54dc25.sock every 8 connection(s)
I20260924 03:12:20.992930 7787 acceptor_pool.cc:254] collecting diagnostics on the listening RPC socket unix:/tmp/dist-test-taskibczIH/test-tmp/rpc-test-3d4d9947b2264946843e55fd2c54dc25.sock every 8 connection(s)
W20260924 03:12:21.044788 7782 negotiation.cc:266] Injecting 500ms delay in negotiation
I20260924 03:12:21.095140 7494 rpc-test-base.h:595] status: Timed out: connection negotiation to unix:/tmp/dist-test-taskibczIH/test-tmp/rpc-test-3d4d9947b2264946843e55fd2c54dc25.sock for RPC Sleep timed out after 0.050s (ON_OUTBOUND_QUEUE), seconds elapsed: 0.0510993
W20260924 03:12:21.551680 7783 connection.cc:196] Error closing socket: Network error: TlsSocket::Close: Broken pipe
[ OK ] Parameters/TestRpc.TestCallTimeoutDoesntAffectNegotiation/SSL_UnixSocket (587 ms)
[ RUN ] Parameters/TestRpc.TestRpcHandlerLatencyMetric/SSL_UnixSocket
I20260924 03:12:21.571727 7811 acceptor_pool.cc:254] collecting diagnostics on the listening RPC socket unix:/tmp/dist-test-taskibczIH/test-tmp/rpc-test-808d9130e9db4efc849c98c07eb2d616.sock every 8 connection(s)
I20260924 03:12:21.571949 7812 acceptor_pool.cc:254] collecting diagnostics on the listening RPC socket unix:/tmp/dist-test-taskibczIH/test-tmp/rpc-test-808d9130e9db4efc849c98c07eb2d616.sock every 8 connection(s)
I20260924 03:12:21.638067 7494 rpc-test.cc:1236] Sleep() min lat: 20622
I20260924 03:12:21.638175 7494 rpc-test.cc:1237] Sleep() mean lat: 20622
I20260924 03:12:21.638221 7494 rpc-test.cc:1238] Sleep() max lat: 20622
I20260924 03:12:21.638239 7494 rpc-test.cc:1239] Sleep() #calls: 1
[ OK ] Parameters/TestRpc.TestRpcHandlerLatencyMetric/SSL_UnixSocket (88 ms)
[ RUN ] Parameters/TestRpc.TimedOutOnResponseMetricServiceQueue/SSL_UnixSocket
I20260924 03:12:21.677392 7837 acceptor_pool.cc:254] collecting diagnostics on the listening RPC socket unix:/tmp/dist-test-taskibczIH/test-tmp/rpc-test-6b1644c4a2af45869b98a4785a5b5cd3.sock every 8 connection(s)
I20260924 03:12:21.677620 7838 acceptor_pool.cc:254] collecting diagnostics on the listening RPC socket unix:/tmp/dist-test-taskibczIH/test-tmp/rpc-test-6b1644c4a2af45869b98a4785a5b5cd3.sock every 8 connection(s)
W20260924 03:12:21.737885 7839 rpcz_store.cc:267] Call kudu.rpc_test.CalculatorService.Sleep from unix:<unnamed> (request call id 2) took 20 ms (client timeout 20 ms). Trace:
W20260924 03:12:21.738075 7839 rpcz_store.cc:269] 0924 03:12:21.717509 (+ 0us) service_pool.cc:170] Inserting onto call queue
0924 03:12:21.737832 (+ 20323us) service_pool.cc:214] Skipping call since client already timed out
0924 03:12:21.737869 (+ 37us) inbound_call.cc:173] Queueing failure response
Metrics: {}
[ OK ] Parameters/TestRpc.TimedOutOnResponseMetricServiceQueue/SSL_UnixSocket (99 ms)
[ RUN ] Parameters/TestRpc.RpcPendingConnectionsMetric/SSL_UnixSocket
I20260924 03:12:21.747432 7860 acceptor_pool.cc:254] collecting diagnostics on the listening RPC socket 0.0.0.0:39725 every 8 connection(s)
I20260924 03:12:21.747648 7861 acceptor_pool.cc:254] collecting diagnostics on the listening RPC socket 0.0.0.0:39725 every 8 connection(s)
W20260924 03:12:21.749614 7856 negotiation.cc:337] Failed RPC negotiation. Trace:
0924 03:12:21.748984 (+ 0us) reactor.cc:625] Submitting negotiation task for server connection from 127.0.0.1:41774 (local address 127.0.0.1:39725)
0924 03:12:21.749157 (+ 173us) server_negotiation.cc:206] Beginning negotiation
0924 03:12:21.749161 (+ 4us) server_negotiation.cc:399] Waiting for connection header
0924 03:12:21.749291 (+ 130us) negotiation.cc:327] Negotiation complete: Network error: Server connection negotiation failed: server connection from 127.0.0.1:41774: BlockingRecv error: recv got EOF from 127.0.0.1:41774 (error 108)
Metrics: {"server-negotiator.queue_time_us":55}
[ OK ] Parameters/TestRpc.RpcPendingConnectionsMetric/SSL_UnixSocket (20 ms)
[ RUN ] Parameters/TestRpc.TestRpcContextClientDeadline/SSL_UnixSocket
I20260924 03:12:21.772020 7876 acceptor_pool.cc:254] collecting diagnostics on the listening RPC socket unix:/tmp/dist-test-taskibczIH/test-tmp/rpc-test-7ba7f38393dc4268bef9450d9b435810.sock every 8 connection(s)
I20260924 03:12:21.772262 7877 acceptor_pool.cc:254] collecting diagnostics on the listening RPC socket unix:/tmp/dist-test-taskibczIH/test-tmp/rpc-test-7ba7f38393dc4268bef9450d9b435810.sock every 8 connection(s)
W20260924 03:12:21.827409 7873 connection.cc:196] Error closing socket: Network error: TlsSocket::Close: Broken pipe
[ OK ] Parameters/TestRpc.TestRpcContextClientDeadline/SSL_UnixSocket (67 ms)
[ RUN ] Parameters/TestRpc.TestApplicationFeatureFlagUnsupportedServer/SSL_UnixSocket
I20260924 03:12:21.843883 7901 acceptor_pool.cc:254] collecting diagnostics on the listening RPC socket unix:/tmp/dist-test-taskibczIH/test-tmp/rpc-test-8ec626e8bc114d0b943a0b98a16d258e.sock every 8 connection(s)
I20260924 03:12:21.844165 7902 acceptor_pool.cc:254] collecting diagnostics on the listening RPC socket unix:/tmp/dist-test-taskibczIH/test-tmp/rpc-test-8ec626e8bc114d0b943a0b98a16d258e.sock every 8 connection(s)
[ OK ] Parameters/TestRpc.TestApplicationFeatureFlagUnsupportedServer/SSL_UnixSocket (35 ms)
[ RUN ] Parameters/TestRpc.TestCancellationAsync/SSL_UnixSocket
I20260924 03:12:21.883517 7926 acceptor_pool.cc:254] collecting diagnostics on the listening RPC socket unix:/tmp/dist-test-taskibczIH/test-tmp/rpc-test-5dc6cd90f8c34352b71fc960e605499f.sock every 8 connection(s)
I20260924 03:12:21.883775 7927 acceptor_pool.cc:254] collecting diagnostics on the listening RPC socket unix:/tmp/dist-test-taskibczIH/test-tmp/rpc-test-5dc6cd90f8c34352b71fc960e605499f.sock every 8 connection(s)
I20260924 03:12:21.884694 7494 rpc-test.cc:1716] Connecting to unix:/tmp/dist-test-taskibczIH/test-tmp/rpc-test-5dc6cd90f8c34352b71fc960e605499f.sock
I20260924 03:12:21.912111 7494 test_util.cc:268] Using random seed: -136472036
I20260924 03:12:21.950546 7930 rpc-test-base.h:240] got call: sleep_micros: 500 pattern: 4294967295 num_repetitions: 2097152 sidecar_idx: 0
I20260924 03:12:21.979140 7929 rpc-test-base.h:240] got call: sleep_micros: 500 pattern: 4294967295 num_repetitions: 2097152 sidecar_idx: 0
I20260924 03:12:22.008899 7930 rpc-test-base.h:240] got call: sleep_micros: 500 pattern: 4294967295 num_repetitions: 2097152 sidecar_idx: 0
I20260924 03:12:22.042311 7929 rpc-test-base.h:240] got call: sleep_micros: 500 pattern: 4294967295 num_repetitions: 2097152 sidecar_idx: 0
I20260924 03:12:22.076592 7930 rpc-test-base.h:240] got call: sleep_micros: 500 pattern: 4294967295 num_repetitions: 2097152 sidecar_idx: 0
I20260924 03:12:22.108601 7929 rpc-test-base.h:240] got call: sleep_micros: 500 pattern: 4294967295 num_repetitions: 2097152 sidecar_idx: 0
I20260924 03:12:22.132624 7930 rpc-test-base.h:240] got call: sleep_micros: 500 pattern: 4294967295 num_repetitions: 2097152 sidecar_idx: 0
W20260924 03:12:22.135002 7923 connection.cc:196] Error closing socket: Network error: TlsSocket::Close: Broken pipe
W20260924 03:12:22.154403 7923 connection.cc:441] server connection from unix:<unnamed> torn down before Call kudu.rpc.GenericCalculatorService.SleepWithSidecar from unix:<unnamed> (request call id 8) could send its response
W20260924 03:12:22.166203 7923 connection.cc:441] server connection from unix:<unnamed> torn down before Call kudu.rpc.GenericCalculatorService.SleepWithSidecar from unix:<unnamed> (request call id 9) could send its response
[ OK ] Parameters/TestRpc.TestCancellationAsync/SSL_UnixSocket (302 ms)
[ RUN ] Parameters/TestRpc.TestPerformanceBySocketType/SSL_UnixSocket
I20260924 03:12:22.188123 7951 acceptor_pool.cc:254] collecting diagnostics on the listening RPC socket unix:/tmp/dist-test-taskibczIH/test-tmp/rpc-test-122f68ef1a0a4563820019c2f69ddd60.sock every 8 connection(s)
I20260924 03:12:22.188385 7952 acceptor_pool.cc:254] collecting diagnostics on the listening RPC socket unix:/tmp/dist-test-taskibczIH/test-tmp/rpc-test-122f68ef1a0a4563820019c2f69ddd60.sock every 8 connection(s)
I20260924 03:12:22.189270 7494 rpc-test.cc:1846] Connecting to unix:/tmp/dist-test-taskibczIH/test-tmp/rpc-test-122f68ef1a0a4563820019c2f69ddd60.sock
I20260924 03:12:25.646304 7494 rpc-test.cc:1859] Sending 1024MB via ssl-enabled unix socket: real 3.440s user 3.578s sys 2.285s
I20260924 03:12:28.803890 7494 rpc-test.cc:1859] Sending 1024MB via ssl-enabled unix socket: real 3.157s user 3.095s sys 2.236s
I20260924 03:12:31.854210 7494 rpc-test.cc:1859] Sending 1024MB via ssl-enabled unix socket: real 3.050s user 2.944s sys 2.206s
I20260924 03:12:34.918887 7494 rpc-test.cc:1859] Sending 1024MB via ssl-enabled unix socket: real 3.065s user 2.992s sys 2.220s
I20260924 03:12:37.951071 7494 rpc-test.cc:1859] Sending 1024MB via ssl-enabled unix socket: real 3.032s user 2.830s sys 2.303s
W20260924 03:12:37.952073 7948 connection.cc:196] Error closing socket: Network error: TlsSocket::Close: Broken pipe
[ OK ] Parameters/TestRpc.TestPerformanceBySocketType/SSL_UnixSocket (15789 ms)
[----------] 20 tests from Parameters/TestRpc (51302 ms total)
[----------] 1 test from Parameters/TestRpcSocketTxRxQueue
[ RUN ] Parameters/TestRpcSocketTxRxQueue.AcceptorRxQueueSizeMetric/0
I20260924 03:12:37.963411 7976 acceptor_pool.cc:254] collecting diagnostics on the listening RPC socket 0.0.0.0:39865 every 1 connection(s)
I20260924 03:12:37.963654 7977 acceptor_pool.cc:254] collecting diagnostics on the listening RPC socket 0.0.0.0:39865 every 1 connection(s)
W20260924 03:12:37.965291 7972 negotiation.cc:337] Failed RPC negotiation. Trace:
0924 03:12:37.964922 (+ 0us) reactor.cc:625] Submitting negotiation task for server connection from 127.0.0.1:50210 (local address 127.0.0.1:39865)
0924 03:12:37.965072 (+ 150us) server_negotiation.cc:206] Beginning negotiation
0924 03:12:37.965076 (+ 4us) server_negotiation.cc:399] Waiting for connection header
0924 03:12:37.965186 (+ 110us) negotiation.cc:327] Negotiation complete: Network error: Server connection negotiation failed: server connection from 127.0.0.1:50210: BlockingRecv error: recv got EOF from 127.0.0.1:50210 (error 108)
Metrics: {"server-negotiator.queue_time_us":50}
[ OK ] Parameters/TestRpcSocketTxRxQueue.AcceptorRxQueueSizeMetric/0 (10 ms)
[----------] 1 test from Parameters/TestRpcSocketTxRxQueue (10 ms total)
[----------] Global test environment tear-down
[==========] 21 tests from 2 test suites ran. (51312 ms total)
[ PASSED ] 20 tests.
[ FAILED ] 1 test, listed below:
[ FAILED ] Parameters/TestRpc.TestCallWithChainCertAndChainCA/SSL_UnixSocket, where GetParam() = (true, true)
1 FAILED TEST