Diagnosed failure

Parameters/TestRpc.TestCallWithChainCertAndChainCA/SSL_UnixSocket: /data0/somelongdirectorytoavoidrpathissues/src/kudu/src/kudu/rpc/rpc-test.cc:270: Failure
Failed
Bad status: Runtime error: could not verify certificate chain (error with cert: subject=CN = localhost, ST = sadfjas, C = AS, emailAddress = sdflkdsajf, O = lskdfjlsad, OU = sldfkja, issuer=C = AS, ST = ASDfkjdhf, L = lskdjf, O = saldfja, OU = skdjf, CN = localhost, emailAddress = sadjflkadsj): : certificate has expired
Google Test trace:
/data0/somelongdirectorytoavoidrpathissues/src/kudu/src/kudu/rpc/rpc-test.cc:267: Connecting to unix:/tmp/dist-test-taskJDevis/test-tmp/rpc-test-916e3ba612924da295bb944160e4f40a.sock
I20260926 13:39:41.451805  3279 test_util.cc:175] -----------------------------------------------
I20260926 13:39:41.451854  3279 test_util.cc:176] Had fatal failures, leaving test files at /tmp/dist-test-taskJDevis/test-tmp/rpc-test.6.Parameters_TestRpc.TestCallWithChainCertAndChainCA_SSL_UnixSocket.1790429981379365-3279-0

Full log

Note: This is test shard 7 of 8.
[==========] Running 21 tests from 2 test suites.
[----------] Global test environment set-up.
[----------] 20 tests from Parameters/TestRpc
[ RUN      ] Parameters/TestRpc.TestMessengerCreateDestroy/SSL_UnixSocket
WARNING: Logging before InitGoogleLogging() is written to STDERR
I20260926 13:39:41.406937  3279 rpc-test.cc:169] started messenger TestCreateDestroy
[       OK ] Parameters/TestRpc.TestMessengerCreateDestroy/SSL_UnixSocket (22 ms)
[ RUN      ] Parameters/TestRpc.TestNegotiationDeadlock/SSL_UnixSocket
I20260926 13:39:41.427668  3299 acceptor_pool.cc:254] collecting diagnostics on the listening RPC socket unix:/tmp/dist-test-taskJDevis/test-tmp/rpc-test-a7dc7fd4fee34289b910e2cda86ed6d6.sock every 8 connection(s)
I20260926 13:39:41.427672  3300 acceptor_pool.cc:254] collecting diagnostics on the listening RPC socket unix:/tmp/dist-test-taskJDevis/test-tmp/rpc-test-a7dc7fd4fee34289b910e2cda86ed6d6.sock every 8 connection(s)
[       OK ] Parameters/TestRpc.TestNegotiationDeadlock/SSL_UnixSocket (28 ms)
[ RUN      ] Parameters/TestRpc.TestCallWithChainCertAndChainCA/SSL_UnixSocket
I20260926 13:39:41.446822  3315 acceptor_pool.cc:254] collecting diagnostics on the listening RPC socket unix:/tmp/dist-test-taskJDevis/test-tmp/rpc-test-916e3ba612924da295bb944160e4f40a.sock every 8 connection(s)
I20260926 13:39:41.446902  3316 acceptor_pool.cc:254] collecting diagnostics on the listening RPC socket unix:/tmp/dist-test-taskJDevis/test-tmp/rpc-test-916e3ba612924da295bb944160e4f40a.sock every 8 connection(s)
/data0/somelongdirectorytoavoidrpathissues/src/kudu/src/kudu/rpc/rpc-test.cc:270: Failure
Failed
Bad status: Runtime error: could not verify certificate chain (error with cert: subject=CN = localhost, ST = sadfjas, C = AS, emailAddress = sdflkdsajf, O = lskdfjlsad, OU = sldfkja, issuer=C = AS, ST = ASDfkjdhf, L = lskdjf, O = saldfja, OU = skdjf, CN = localhost, emailAddress = sadjflkadsj): : certificate has expired
Google Test trace:
/data0/somelongdirectorytoavoidrpathissues/src/kudu/src/kudu/rpc/rpc-test.cc:267: Connecting to unix:/tmp/dist-test-taskJDevis/test-tmp/rpc-test-916e3ba612924da295bb944160e4f40a.sock
I20260926 13:39:41.451805  3279 test_util.cc:175] -----------------------------------------------
I20260926 13:39:41.451854  3279 test_util.cc:176] Had fatal failures, leaving test files at /tmp/dist-test-taskJDevis/test-tmp/rpc-test.6.Parameters_TestRpc.TestCallWithChainCertAndChainCA_SSL_UnixSocket.1790429981379365-3279-0
[  FAILED  ] Parameters/TestRpc.TestCallWithChainCertAndChainCA/SSL_UnixSocket, where GetParam() = (true, true) (14 ms)
[ RUN      ] Parameters/TestRpc.TestCallWithPasswordProtectedKey/SSL_UnixSocket
I20260926 13:39:41.462604  3340 acceptor_pool.cc:254] collecting diagnostics on the listening RPC socket unix:/tmp/dist-test-taskJDevis/test-tmp/rpc-test-3b558e68bca5499baa1b9935f783b1e4.sock every 8 connection(s)
I20260926 13:39:41.462615  3341 acceptor_pool.cc:254] collecting diagnostics on the listening RPC socket unix:/tmp/dist-test-taskJDevis/test-tmp/rpc-test-3b558e68bca5499baa1b9935f783b1e4.sock every 8 connection(s)
W20260926 13:39:41.474591  3337 connection.cc:196] Error closing socket: Network error: TlsSocket::Close: Broken pipe
[       OK ] Parameters/TestRpc.TestCallWithPasswordProtectedKey/SSL_UnixSocket (24 ms)
[ RUN      ] Parameters/TestRpc.TestCallToBadServer/SSL_UnixSocket
I20260926 13:39:41.491338  3279 rpc-test.cc:394] Status: Network error: Client connection negotiation failed: client connection to 0.0.0.0:0: connect: Connection refused (error 111)
I20260926 13:39:41.491792  3279 rpc-test.cc:394] Status: Network error: Client connection negotiation failed: client connection to 0.0.0.0:0: connect: Connection refused (error 111)
I20260926 13:39:41.492192  3279 rpc-test.cc:394] Status: Network error: Client connection negotiation failed: client connection to 0.0.0.0:0: connect: Connection refused (error 111)
I20260926 13:39:41.492566  3279 rpc-test.cc:394] Status: Network error: Client connection negotiation failed: client connection to 0.0.0.0:0: connect: Connection refused (error 111)
I20260926 13:39:41.492926  3279 rpc-test.cc:394] Status: Network error: Client connection negotiation failed: client connection to 0.0.0.0:0: connect: Connection refused (error 111)
[       OK ] Parameters/TestRpc.TestCallToBadServer/SSL_UnixSocket (17 ms)
[ RUN      ] Parameters/TestRpc.TestWrongService/SSL_UnixSocket
I20260926 13:39:41.509099  3375 acceptor_pool.cc:254] collecting diagnostics on the listening RPC socket unix:/tmp/dist-test-taskJDevis/test-tmp/rpc-test-55fd3fd25b2f40beaf794fbbe0e8572a.sock every 8 connection(s)
I20260926 13:39:41.509153  3376 acceptor_pool.cc:254] collecting diagnostics on the listening RPC socket unix:/tmp/dist-test-taskJDevis/test-tmp/rpc-test-55fd3fd25b2f40beaf794fbbe0e8572a.sock every 8 connection(s)
I20260926 13:39:41.529242  3372 messenger.cc:345] service WrongServiceName not registered on TestServer
W20260926 13:39:41.530015  3372 connection.cc:196] Error closing socket: Network error: TlsSocket::Close: Broken pipe
[       OK ] Parameters/TestRpc.TestWrongService/SSL_UnixSocket (38 ms)
[ RUN      ] Parameters/TestRpc.TestConnectionKeepalive/SSL_UnixSocket
I20260926 13:39:41.546162  3399 acceptor_pool.cc:254] collecting diagnostics on the listening RPC socket unix:/tmp/dist-test-taskJDevis/test-tmp/rpc-test-3e55b4db7b99422db27a4a4282aa91d4.sock every 8 connection(s)
I20260926 13:39:41.546175  3398 acceptor_pool.cc:254] collecting diagnostics on the listening RPC socket unix:/tmp/dist-test-taskJDevis/test-tmp/rpc-test-3e55b4db7b99422db27a4a4282aa91d4.sock every 8 connection(s)
I20260926 13:39:41.546446  3279 rpc-test.cc:488] Connecting to unix:/tmp/dist-test-taskJDevis/test-tmp/rpc-test-3e55b4db7b99422db27a4a4282aa91d4.sock
W20260926 13:39:42.033349  3411 connection.cc:196] Error closing socket: Network error: TlsSocket::Close: Broken pipe
[       OK ] Parameters/TestRpc.TestConnectionKeepalive/SSL_UnixSocket (1054 ms)
[ RUN      ] Parameters/TestRpc.TestClientConnectionMetrics/SSL_UnixSocket
I20260926 13:39:42.606217  3423 acceptor_pool.cc:254] collecting diagnostics on the listening RPC socket unix:/tmp/dist-test-taskJDevis/test-tmp/rpc-test-11e38e353dc4407c90fa631017ca5b61.sock every 8 connection(s)
I20260926 13:39:42.606280  3424 acceptor_pool.cc:254] collecting diagnostics on the listening RPC socket unix:/tmp/dist-test-taskJDevis/test-tmp/rpc-test-11e38e353dc4407c90fa631017ca5b61.sock every 8 connection(s)
I20260926 13:39:42.606643  3279 rpc-test.cc:569] Connecting to unix:/tmp/dist-test-taskJDevis/test-tmp/rpc-test-11e38e353dc4407c90fa631017ca5b61.sock
W20260926 13:39:52.529116  3420 connection.cc:196] Error closing socket: Network error: TlsSocket::Close: Broken pipe
[       OK ] Parameters/TestRpc.TestClientConnectionMetrics/SSL_UnixSocket (9944 ms)
[ RUN      ] Parameters/TestRpc.TestCredentialsPolicy/SSL_UnixSocket
I20260926 13:39:52.536907  3446 acceptor_pool.cc:254] collecting diagnostics on the listening RPC socket unix:/tmp/dist-test-taskJDevis/test-tmp/rpc-test-2bf9928be90e42b7aefaa2ad6409946a.sock every 8 connection(s)
I20260926 13:39:52.537068  3447 acceptor_pool.cc:254] collecting diagnostics on the listening RPC socket unix:/tmp/dist-test-taskJDevis/test-tmp/rpc-test-2bf9928be90e42b7aefaa2ad6409946a.sock every 8 connection(s)
I20260926 13:39:52.537070  3279 rpc-test.cc:700] Connecting to unix:/tmp/dist-test-taskJDevis/test-tmp/rpc-test-2bf9928be90e42b7aefaa2ad6409946a.sock
W20260926 13:39:52.563570  3445 connection.cc:196] Error closing socket: Network error: TlsSocket::Close: Broken pipe
[       OK ] Parameters/TestRpc.TestCredentialsPolicy/SSL_UnixSocket (38 ms)
[ RUN      ] Parameters/TestRpc.TestCallLongerThanKeepalive/SSL_UnixSocket
I20260926 13:39:52.579414  3471 acceptor_pool.cc:254] collecting diagnostics on the listening RPC socket unix:/tmp/dist-test-taskJDevis/test-tmp/rpc-test-def93527129d4239a26a2fa7e093fb53.sock every 8 connection(s)
I20260926 13:39:52.579464  3472 acceptor_pool.cc:254] collecting diagnostics on the listening RPC socket unix:/tmp/dist-test-taskJDevis/test-tmp/rpc-test-def93527129d4239a26a2fa7e093fb53.sock every 8 connection(s)
I20260926 13:39:52.594134  3475 rpc-test-base.h:222] got call: sleep_micros: 3000000 deferred: true
I20260926 13:39:55.595127  3475 rpcz_store.cc:275] Call kudu.rpc.GenericCalculatorService.Sleep from unix:<unnamed> (request call id 0) took 3001 ms. Trace:
I20260926 13:39:55.595283  3475 rpcz_store.cc:276] 0926 13:39:52.594053 (+     0us) service_pool.cc:170] Inserting onto call queue
0926 13:39:52.594101 (+    48us) service_pool.cc:227] Handling call
0926 13:39:55.595107 (+3001006us) inbound_call.cc:173] Queueing success response
Metrics: {}
W20260926 13:39:55.596944  3468 connection.cc:196] Error closing socket: Network error: TlsSocket::Close: Broken pipe
[       OK ] Parameters/TestRpc.TestCallLongerThanKeepalive/SSL_UnixSocket (3028 ms)
[ RUN      ] Parameters/TestRpc.TestRpcSidecar/SSL_UnixSocket
I20260926 13:39:55.611950  3496 acceptor_pool.cc:254] collecting diagnostics on the listening RPC socket unix:/tmp/dist-test-taskJDevis/test-tmp/rpc-test-61f0633e609340789acace9750c961ee.sock every 8 connection(s)
I20260926 13:39:55.611994  3497 acceptor_pool.cc:254] collecting diagnostics on the listening RPC socket unix:/tmp/dist-test-taskJDevis/test-tmp/rpc-test-61f0633e609340789acace9750c961ee.sock every 8 connection(s)
W20260926 13:39:55.683163  3493 connection.cc:196] Error closing socket: Network error: TlsSocket::Close: Broken pipe
[       OK ] Parameters/TestRpc.TestRpcSidecar/SSL_UnixSocket (86 ms)
[ RUN      ] Parameters/TestRpc.TestRpcSidecarLimits/SSL_UnixSocket
I20260926 13:39:57.266134  3521 acceptor_pool.cc:254] collecting diagnostics on the listening RPC socket unix:/tmp/dist-test-taskJDevis/test-tmp/rpc-test-74b98641f84c426b87beae989781e349.sock every 8 connection(s)
I20260926 13:39:57.266175  3522 acceptor_pool.cc:254] collecting diagnostics on the listening RPC socket unix:/tmp/dist-test-taskJDevis/test-tmp/rpc-test-74b98641f84c426b87beae989781e349.sock every 8 connection(s)
W20260926 13:39:57.284839  3279 serialization.cc:72] Serialized kudu.rpc_test.PushStringsRequestPB (2147483654 bytes) is larger than the maximum configured RPC message size (52428800 bytes). Sending anyway, but peer may reject the data.
W20260926 13:39:57.288192  3518 connection.cc:535] server connection from unix:<unnamed> recv error: Network error: RPC frame had a length of 2147483714, but we only support messages up to 52428800 bytes long.
W20260926 13:39:57.288241  3518 connection.cc:158] shutting down server connection from unix:<unnamed> with pending inbound data: 4/2147483714 bytes received; last active 0 ns ago: status Network error: RPC frame had a length of 2147483714, but we only support messages up to 52428800 bytes long.
W20260926 13:39:57.288379  3534 connection.cc:698] client connection to unix:/tmp/dist-test-taskJDevis/test-tmp/rpc-test-74b98641f84c426b87beae989781e349.sock send error: Network error: failed to write to TLS socket: Broken pipe
W20260926 13:39:57.288539  3534 connection.cc:196] Error closing socket: Network error: TlsSocket::Close: Success
I20260926 13:39:57.320475  3546 acceptor_pool.cc:254] collecting diagnostics on the listening RPC socket unix:/tmp/dist-test-taskJDevis/test-tmp/rpc-test-74b98641f84c426b87beae989781e349.sock every 8 connection(s)
I20260926 13:39:57.320492  3547 acceptor_pool.cc:254] collecting diagnostics on the listening RPC socket unix:/tmp/dist-test-taskJDevis/test-tmp/rpc-test-74b98641f84c426b87beae989781e349.sock every 8 connection(s)
W20260926 13:40:01.998495  3543 connection.cc:577] server connection from unix:<unnamed>: received bad data: 'Corruption: Invalid packet: message had a length of 2147483710, but we only support messages up to 2147483647 bytes
'
W20260926 13:40:01.998914  3559 connection.cc:196] Error closing socket: Network error: TlsSocket::Close: Broken pipe
[       OK ] Parameters/TestRpc.TestRpcSidecarLimits/SSL_UnixSocket (6317 ms)
[ RUN      ] Parameters/TestRpc.TestCallTimeoutDoesntAffectNegotiation/SSL_UnixSocket
I20260926 13:40:02.012507  3571 acceptor_pool.cc:254] collecting diagnostics on the listening RPC socket unix:/tmp/dist-test-taskJDevis/test-tmp/rpc-test-a90321cdfbcc4b019e70ad0123b21022.sock every 8 connection(s)
I20260926 13:40:02.012611  3572 acceptor_pool.cc:254] collecting diagnostics on the listening RPC socket unix:/tmp/dist-test-taskJDevis/test-tmp/rpc-test-a90321cdfbcc4b019e70ad0123b21022.sock every 8 connection(s)
W20260926 13:40:02.041712  3567 negotiation.cc:266] Injecting 500ms delay in negotiation
I20260926 13:40:02.092046  3279 rpc-test-base.h:595] status: Timed out: connection negotiation to unix:/tmp/dist-test-taskJDevis/test-tmp/rpc-test-a90321cdfbcc4b019e70ad0123b21022.sock for RPC Sleep timed out after 0.050s (ON_OUTBOUND_QUEUE), seconds elapsed: 0.050755
[       OK ] Parameters/TestRpc.TestCallTimeoutDoesntAffectNegotiation/SSL_UnixSocket (545 ms)
[ RUN      ] Parameters/TestRpc.TestRpcHandlerLatencyMetric/SSL_UnixSocket
I20260926 13:40:02.554139  3596 acceptor_pool.cc:254] collecting diagnostics on the listening RPC socket unix:/tmp/dist-test-taskJDevis/test-tmp/rpc-test-624d5bd453b542d988735001d4fd4426.sock every 8 connection(s)
I20260926 13:40:02.554266  3597 acceptor_pool.cc:254] collecting diagnostics on the listening RPC socket unix:/tmp/dist-test-taskJDevis/test-tmp/rpc-test-624d5bd453b542d988735001d4fd4426.sock every 8 connection(s)
I20260926 13:40:02.588572  3279 rpc-test.cc:1236] Sleep() min lat: 20329
I20260926 13:40:02.588629  3279 rpc-test.cc:1237] Sleep() mean lat: 20329
I20260926 13:40:02.588670  3279 rpc-test.cc:1238] Sleep() max lat: 20329
I20260926 13:40:02.588708  3279 rpc-test.cc:1239] Sleep() #calls: 1
W20260926 13:40:02.589993  3593 connection.cc:196] Error closing socket: Network error: TlsSocket::Close: Broken pipe
[       OK ] Parameters/TestRpc.TestRpcHandlerLatencyMetric/SSL_UnixSocket (43 ms)
[ RUN      ] Parameters/TestRpc.TimedOutOnResponseMetricServiceQueue/SSL_UnixSocket
I20260926 13:40:02.604768  3622 acceptor_pool.cc:254] collecting diagnostics on the listening RPC socket unix:/tmp/dist-test-taskJDevis/test-tmp/rpc-test-aa772c58585e481db911329b9cffa62a.sock every 8 connection(s)
I20260926 13:40:02.604825  3623 acceptor_pool.cc:254] collecting diagnostics on the listening RPC socket unix:/tmp/dist-test-taskJDevis/test-tmp/rpc-test-aa772c58585e481db911329b9cffa62a.sock every 8 connection(s)
W20260926 13:40:02.657506  3624 rpcz_store.cc:267] Call kudu.rpc_test.CalculatorService.Sleep from unix:<unnamed> (request call id 2) took 20 ms (client timeout 20 ms). Trace:
W20260926 13:40:02.657596  3624 rpcz_store.cc:269] 0926 13:40:02.637195 (+     0us) service_pool.cc:170] Inserting onto call queue
0926 13:40:02.657440 (+ 20245us) service_pool.cc:214] Skipping call since client already timed out
0926 13:40:02.657459 (+    19us) inbound_call.cc:173] Queueing failure response
Metrics: {}
[       OK ] Parameters/TestRpc.TimedOutOnResponseMetricServiceQueue/SSL_UnixSocket (67 ms)
[ RUN      ] Parameters/TestRpc.RpcPendingConnectionsMetric/SSL_UnixSocket
I20260926 13:40:02.661561  3645 acceptor_pool.cc:254] collecting diagnostics on the listening RPC socket 0.0.0.0:45975 every 8 connection(s)
I20260926 13:40:02.661620  3646 acceptor_pool.cc:254] collecting diagnostics on the listening RPC socket 0.0.0.0:45975 every 8 connection(s)
W20260926 13:40:02.662784  3641 negotiation.cc:337] Failed RPC negotiation. Trace:
0926 13:40:02.662338 (+     0us) reactor.cc:625] Submitting negotiation task for server connection from 127.0.0.1:37154 (local address 127.0.0.1:45975)
0926 13:40:02.662431 (+    93us) server_negotiation.cc:206] Beginning negotiation
0926 13:40:02.662434 (+     3us) server_negotiation.cc:399] Waiting for connection header
0926 13:40:02.662565 (+   131us) negotiation.cc:327] Negotiation complete: Network error: Server connection negotiation failed: server connection from 127.0.0.1:37154: BlockingRecv error: recv got EOF from 127.0.0.1:37154 (error 108)
Metrics: {"server-negotiator.queue_time_us":32}
[       OK ] Parameters/TestRpc.RpcPendingConnectionsMetric/SSL_UnixSocket (14 ms)
[ RUN      ] Parameters/TestRpc.TestRpcContextClientDeadline/SSL_UnixSocket
I20260926 13:40:02.680454  3661 acceptor_pool.cc:254] collecting diagnostics on the listening RPC socket unix:/tmp/dist-test-taskJDevis/test-tmp/rpc-test-b222fe24e1da4c6a90b94b00fbfc4ab4.sock every 8 connection(s)
I20260926 13:40:02.680527  3662 acceptor_pool.cc:254] collecting diagnostics on the listening RPC socket unix:/tmp/dist-test-taskJDevis/test-tmp/rpc-test-b222fe24e1da4c6a90b94b00fbfc4ab4.sock every 8 connection(s)
[       OK ] Parameters/TestRpc.TestRpcContextClientDeadline/SSL_UnixSocket (43 ms)
[ RUN      ] Parameters/TestRpc.TestApplicationFeatureFlagUnsupportedServer/SSL_UnixSocket
I20260926 13:40:02.747123  3686 acceptor_pool.cc:254] collecting diagnostics on the listening RPC socket unix:/tmp/dist-test-taskJDevis/test-tmp/rpc-test-24a2e57a835e44a2aa197629f1056ed3.sock every 8 connection(s)
I20260926 13:40:02.747171  3687 acceptor_pool.cc:254] collecting diagnostics on the listening RPC socket unix:/tmp/dist-test-taskJDevis/test-tmp/rpc-test-24a2e57a835e44a2aa197629f1056ed3.sock every 8 connection(s)
W20260926 13:40:02.778769  3683 connection.cc:196] Error closing socket: Network error: TlsSocket::Close: Broken pipe
[       OK ] Parameters/TestRpc.TestApplicationFeatureFlagUnsupportedServer/SSL_UnixSocket (62 ms)
[ RUN      ] Parameters/TestRpc.TestCancellationAsync/SSL_UnixSocket
I20260926 13:40:02.786284  3711 acceptor_pool.cc:254] collecting diagnostics on the listening RPC socket unix:/tmp/dist-test-taskJDevis/test-tmp/rpc-test-7d622898db234c63b4e110a520c6fe68.sock every 8 connection(s)
I20260926 13:40:02.786337  3712 acceptor_pool.cc:254] collecting diagnostics on the listening RPC socket unix:/tmp/dist-test-taskJDevis/test-tmp/rpc-test-7d622898db234c63b4e110a520c6fe68.sock every 8 connection(s)
I20260926 13:40:02.786631  3279 rpc-test.cc:1716] Connecting to unix:/tmp/dist-test-taskJDevis/test-tmp/rpc-test-7d622898db234c63b4e110a520c6fe68.sock
I20260926 13:40:02.797814  3279 test_util.cc:268] Using random seed: -128983819
I20260926 13:40:02.812960  3715 rpc-test-base.h:240] got call: sleep_micros: 500 pattern: 4294967295 num_repetitions: 2097152 sidecar_idx: 0
I20260926 13:40:02.831240  3714 rpc-test-base.h:240] got call: sleep_micros: 500 pattern: 4294967295 num_repetitions: 2097152 sidecar_idx: 0
I20260926 13:40:02.846850  3715 rpc-test-base.h:240] got call: sleep_micros: 500 pattern: 4294967295 num_repetitions: 2097152 sidecar_idx: 0
I20260926 13:40:02.863056  3714 rpc-test-base.h:240] got call: sleep_micros: 500 pattern: 4294967295 num_repetitions: 2097152 sidecar_idx: 0
I20260926 13:40:02.878896  3715 rpc-test-base.h:240] got call: sleep_micros: 500 pattern: 4294967295 num_repetitions: 2097152 sidecar_idx: 0
I20260926 13:40:02.894233  3714 rpc-test-base.h:240] got call: sleep_micros: 500 pattern: 4294967295 num_repetitions: 2097152 sidecar_idx: 0
I20260926 13:40:02.909370  3715 rpc-test-base.h:240] got call: sleep_micros: 500 pattern: 4294967295 num_repetitions: 2097152 sidecar_idx: 0
I20260926 13:40:02.926643  3714 rpc-test-base.h:240] got call: sleep_micros: 500 pattern: 4294967295 num_repetitions: 2097152 sidecar_idx: 0
W20260926 13:40:02.928274  3708 connection.cc:196] Error closing socket: Network error: TlsSocket::Close: Broken pipe
W20260926 13:40:02.934382  3708 connection.cc:441] server connection from unix:<unnamed> torn down before Call kudu.rpc.GenericCalculatorService.SleepWithSidecar from unix:<unnamed> (request call id 8) could send its response
W20260926 13:40:02.944021  3708 connection.cc:441] server connection from unix:<unnamed> torn down before Call kudu.rpc.GenericCalculatorService.SleepWithSidecar from unix:<unnamed> (request call id 9) could send its response
[       OK ] Parameters/TestRpc.TestCancellationAsync/SSL_UnixSocket (165 ms)
[ RUN      ] Parameters/TestRpc.TestPerformanceBySocketType/SSL_UnixSocket
I20260926 13:40:02.959589  3736 acceptor_pool.cc:254] collecting diagnostics on the listening RPC socket unix:/tmp/dist-test-taskJDevis/test-tmp/rpc-test-571fc95a378b4d8295ed8995375fb268.sock every 8 connection(s)
I20260926 13:40:02.959646  3737 acceptor_pool.cc:254] collecting diagnostics on the listening RPC socket unix:/tmp/dist-test-taskJDevis/test-tmp/rpc-test-571fc95a378b4d8295ed8995375fb268.sock every 8 connection(s)
I20260926 13:40:02.959980  3279 rpc-test.cc:1846] Connecting to unix:/tmp/dist-test-taskJDevis/test-tmp/rpc-test-571fc95a378b4d8295ed8995375fb268.sock
I20260926 13:40:04.528590  3279 rpc-test.cc:1859] Sending 1024MB via ssl-enabled unix socket: real 1.545s	user 1.783s	sys 1.033s
I20260926 13:40:05.974116  3279 rpc-test.cc:1859] Sending 1024MB via ssl-enabled unix socket: real 1.445s	user 1.785s	sys 0.879s
I20260926 13:40:07.365268  3279 rpc-test.cc:1859] Sending 1024MB via ssl-enabled unix socket: real 1.391s	user 1.701s	sys 0.854s
I20260926 13:40:08.808192  3279 rpc-test.cc:1859] Sending 1024MB via ssl-enabled unix socket: real 1.443s	user 1.754s	sys 0.902s
I20260926 13:40:10.207942  3279 rpc-test.cc:1859] Sending 1024MB via ssl-enabled unix socket: real 1.400s	user 1.750s	sys 0.825s
W20260926 13:40:10.208678  3733 connection.cc:196] Error closing socket: Network error: TlsSocket::Close: Broken pipe
[       OK ] Parameters/TestRpc.TestPerformanceBySocketType/SSL_UnixSocket (7264 ms)
[----------] 20 tests from Parameters/TestRpc (28824 ms total)

[----------] 1 test from Parameters/TestRpcSocketTxRxQueue
[ RUN      ] Parameters/TestRpcSocketTxRxQueue.AcceptorRxQueueSizeMetric/0
I20260926 13:40:10.211887  3761 acceptor_pool.cc:254] collecting diagnostics on the listening RPC socket 0.0.0.0:38641 every 1 connection(s)
I20260926 13:40:10.211983  3762 acceptor_pool.cc:254] collecting diagnostics on the listening RPC socket 0.0.0.0:38641 every 1 connection(s)
W20260926 13:40:10.212774  3757 negotiation.cc:337] Failed RPC negotiation. Trace:
0926 13:40:10.212534 (+     0us) reactor.cc:625] Submitting negotiation task for server connection from 127.0.0.1:55292 (local address 127.0.0.1:38641)
0926 13:40:10.212635 (+   101us) server_negotiation.cc:206] Beginning negotiation
0926 13:40:10.212638 (+     3us) server_negotiation.cc:399] Waiting for connection header
0926 13:40:10.212714 (+    76us) negotiation.cc:327] Negotiation complete: Network error: Server connection negotiation failed: server connection from 127.0.0.1:55292: BlockingRecv error: recv got EOF from 127.0.0.1:55292 (error 108)
Metrics: {"server-negotiator.queue_time_us":37}
[       OK ] Parameters/TestRpcSocketTxRxQueue.AcceptorRxQueueSizeMetric/0 (5 ms)
[----------] 1 test from Parameters/TestRpcSocketTxRxQueue (5 ms total)

[----------] Global test environment tear-down
[==========] 21 tests from 2 test suites ran. (28829 ms total)
[  PASSED  ] 20 tests.
[  FAILED  ] 1 test, listed below:
[  FAILED  ] Parameters/TestRpc.TestCallWithChainCertAndChainCA/SSL_UnixSocket, where GetParam() = (true, true)

 1 FAILED TEST