Diagnosed failure

Parameters/TestRpc.TestCallWithChainCertAndChainCA/SSL_TCP: /data0/somelongdirectorytoavoidrpathissues/src/kudu/src/kudu/rpc/rpc-test.cc:270: Failure
Failed
Bad status: Runtime error: could not verify certificate chain (error with cert: subject=CN = localhost, ST = sadfjas, C = AS, emailAddress = sdflkdsajf, O = lskdfjlsad, OU = sldfkja, issuer=C = AS, ST = ASDfkjdhf, L = lskdjf, O = saldfja, OU = skdjf, CN = localhost, emailAddress = sadjflkadsj): : certificate has expired
Google Test trace:
/data0/somelongdirectorytoavoidrpathissues/src/kudu/src/kudu/rpc/rpc-test.cc:267: Connecting to 0.0.0.0:33369
I20260929 03:06:01.864509  4591 test_util.cc:175] -----------------------------------------------
I20260929 03:06:01.864578  4591 test_util.cc:176] Had fatal failures, leaving test files at /tmp/dist-test-taskazpVSW/test-tmp/rpc-test.5.Parameters_TestRpc.TestCallWithChainCertAndChainCA_SSL_TCP.1790651161790065-4591-0

Full log

Note: This is test shard 6 of 8.
[==========] Running 21 tests from 2 test suites.
[----------] Global test environment set-up.
[----------] 20 tests from Parameters/TestRpc
[ RUN      ] Parameters/TestRpc.TestMessengerCreateDestroy/SSL_TCP
WARNING: Logging before InitGoogleLogging() is written to STDERR
I20260929 03:06:01.826247  4591 rpc-test.cc:169] started messenger TestCreateDestroy
[       OK ] Parameters/TestRpc.TestMessengerCreateDestroy/SSL_TCP (30 ms)
[ RUN      ] Parameters/TestRpc.TestNegotiationDeadlock/SSL_TCP
I20260929 03:06:01.838588  4611 acceptor_pool.cc:254] collecting diagnostics on the listening RPC socket 0.0.0.0:39001 every 8 connection(s)
I20260929 03:06:01.838673  4612 acceptor_pool.cc:254] collecting diagnostics on the listening RPC socket 0.0.0.0:39001 every 8 connection(s)
[       OK ] Parameters/TestRpc.TestNegotiationDeadlock/SSL_TCP (22 ms)
[ RUN      ] Parameters/TestRpc.TestCallWithChainCertAndChainCA/SSL_TCP
I20260929 03:06:01.859553  4627 acceptor_pool.cc:254] collecting diagnostics on the listening RPC socket 0.0.0.0:33369 every 8 connection(s)
I20260929 03:06:01.859573  4628 acceptor_pool.cc:254] collecting diagnostics on the listening RPC socket 0.0.0.0:33369 every 8 connection(s)
/data0/somelongdirectorytoavoidrpathissues/src/kudu/src/kudu/rpc/rpc-test.cc:270: Failure
Failed
Bad status: Runtime error: could not verify certificate chain (error with cert: subject=CN = localhost, ST = sadfjas, C = AS, emailAddress = sdflkdsajf, O = lskdfjlsad, OU = sldfkja, issuer=C = AS, ST = ASDfkjdhf, L = lskdjf, O = saldfja, OU = skdjf, CN = localhost, emailAddress = sadjflkadsj): : certificate has expired
Google Test trace:
/data0/somelongdirectorytoavoidrpathissues/src/kudu/src/kudu/rpc/rpc-test.cc:267: Connecting to 0.0.0.0:33369
I20260929 03:06:01.864509  4591 test_util.cc:175] -----------------------------------------------
I20260929 03:06:01.864578  4591 test_util.cc:176] Had fatal failures, leaving test files at /tmp/dist-test-taskazpVSW/test-tmp/rpc-test.5.Parameters_TestRpc.TestCallWithChainCertAndChainCA_SSL_TCP.1790651161790065-4591-0
[  FAILED  ] Parameters/TestRpc.TestCallWithChainCertAndChainCA/SSL_TCP, where GetParam() = (true, false) (14 ms)
[ RUN      ] Parameters/TestRpc.TestCallWithPasswordProtectedKey/SSL_TCP
I20260929 03:06:01.896574  4653 acceptor_pool.cc:254] collecting diagnostics on the listening RPC socket 0.0.0.0:34927 every 8 connection(s)
I20260929 03:06:01.896533  4652 acceptor_pool.cc:254] collecting diagnostics on the listening RPC socket 0.0.0.0:34927 every 8 connection(s)
[       OK ] Parameters/TestRpc.TestCallWithPasswordProtectedKey/SSL_TCP (48 ms)
[ RUN      ] Parameters/TestRpc.TestCallToBadServer/SSL_TCP
I20260929 03:06:01.925601  4591 rpc-test.cc:394] Status: Network error: Client connection negotiation failed: client connection to 0.0.0.0:0: connect: Connection refused (error 111)
I20260929 03:06:01.926083  4591 rpc-test.cc:394] Status: Network error: Client connection negotiation failed: client connection to 0.0.0.0:0: connect: Connection refused (error 111)
I20260929 03:06:01.926414  4591 rpc-test.cc:394] Status: Network error: Client connection negotiation failed: client connection to 0.0.0.0:0: connect: Connection refused (error 111)
I20260929 03:06:01.926826  4591 rpc-test.cc:394] Status: Network error: Client connection negotiation failed: client connection to 0.0.0.0:0: connect: Connection refused (error 111)
I20260929 03:06:01.927158  4591 rpc-test.cc:394] Status: Network error: Client connection negotiation failed: client connection to 0.0.0.0:0: connect: Connection refused (error 111)
[       OK ] Parameters/TestRpc.TestCallToBadServer/SSL_TCP (14 ms)
[ RUN      ] Parameters/TestRpc.TestWrongService/SSL_TCP
I20260929 03:06:01.935501  4687 acceptor_pool.cc:254] collecting diagnostics on the listening RPC socket 0.0.0.0:33585 every 8 connection(s)
I20260929 03:06:01.935523  4688 acceptor_pool.cc:254] collecting diagnostics on the listening RPC socket 0.0.0.0:33585 every 8 connection(s)
I20260929 03:06:01.953675  4684 messenger.cc:345] service WrongServiceName not registered on TestServer
[       OK ] Parameters/TestRpc.TestWrongService/SSL_TCP (27 ms)
[ RUN      ] Parameters/TestRpc.TestConnectionKeepalive/SSL_TCP
I20260929 03:06:01.967067  4710 acceptor_pool.cc:254] collecting diagnostics on the listening RPC socket 0.0.0.0:34833 every 8 connection(s)
I20260929 03:06:01.967094  4711 acceptor_pool.cc:254] collecting diagnostics on the listening RPC socket 0.0.0.0:34833 every 8 connection(s)
I20260929 03:06:01.967329  4591 rpc-test.cc:488] Connecting to 0.0.0.0:34833
[       OK ] Parameters/TestRpc.TestConnectionKeepalive/SSL_TCP (1033 ms)
[ RUN      ] Parameters/TestRpc.TestClientConnectionMetrics/SSL_TCP
I20260929 03:06:03.005221  4735 acceptor_pool.cc:254] collecting diagnostics on the listening RPC socket 0.0.0.0:43487 every 8 connection(s)
I20260929 03:06:03.005250  4736 acceptor_pool.cc:254] collecting diagnostics on the listening RPC socket 0.0.0.0:43487 every 8 connection(s)
I20260929 03:06:03.005532  4591 rpc-test.cc:569] Connecting to 0.0.0.0:43487
[       OK ] Parameters/TestRpc.TestClientConnectionMetrics/SSL_TCP (14352 ms)
[ RUN      ] Parameters/TestRpc.TestCredentialsPolicy/SSL_TCP
I20260929 03:06:17.361235  4759 acceptor_pool.cc:254] collecting diagnostics on the listening RPC socket 0.0.0.0:45813 every 8 connection(s)
I20260929 03:06:17.361235  4758 acceptor_pool.cc:254] collecting diagnostics on the listening RPC socket 0.0.0.0:45813 every 8 connection(s)
I20260929 03:06:17.361488  4591 rpc-test.cc:700] Connecting to 0.0.0.0:45813
[       OK ] Parameters/TestRpc.TestCredentialsPolicy/SSL_TCP (46 ms)
[ RUN      ] Parameters/TestRpc.TestCallLongerThanKeepalive/SSL_TCP
I20260929 03:06:17.404686  4784 acceptor_pool.cc:254] collecting diagnostics on the listening RPC socket 0.0.0.0:36789 every 8 connection(s)
I20260929 03:06:17.404706  4783 acceptor_pool.cc:254] collecting diagnostics on the listening RPC socket 0.0.0.0:36789 every 8 connection(s)
I20260929 03:06:17.446990  4787 rpc-test-base.h:222] got call: sleep_micros: 3000000 deferred: true
I20260929 03:06:20.448038  4787 rpcz_store.cc:275] Call kudu.rpc.GenericCalculatorService.Sleep from 127.0.0.1:34832 (request call id 0) took 3001 ms. Trace:
I20260929 03:06:20.448194  4787 rpcz_store.cc:276] 0929 03:06:17.446900 (+     0us) service_pool.cc:170] Inserting onto call queue
0929 03:06:17.446957 (+    57us) service_pool.cc:227] Handling call
0929 03:06:20.448006 (+3001049us) inbound_call.cc:173] Queueing success response
Metrics: {}
[       OK ] Parameters/TestRpc.TestCallLongerThanKeepalive/SSL_TCP (3063 ms)
[ RUN      ] Parameters/TestRpc.TestRpcSidecar/SSL_TCP
I20260929 03:06:20.462532  4808 acceptor_pool.cc:254] collecting diagnostics on the listening RPC socket 0.0.0.0:39895 every 8 connection(s)
I20260929 03:06:20.462532  4809 acceptor_pool.cc:254] collecting diagnostics on the listening RPC socket 0.0.0.0:39895 every 8 connection(s)
[       OK ] Parameters/TestRpc.TestRpcSidecar/SSL_TCP (79 ms)
[ RUN      ] Parameters/TestRpc.TestRpcSidecarLimits/SSL_TCP
I20260929 03:06:22.473057  4833 acceptor_pool.cc:254] collecting diagnostics on the listening RPC socket 0.0.0.0:44917 every 8 connection(s)
I20260929 03:06:22.473093  4834 acceptor_pool.cc:254] collecting diagnostics on the listening RPC socket 0.0.0.0:44917 every 8 connection(s)
W20260929 03:06:22.478519  4591 serialization.cc:72] Serialized kudu.rpc_test.PushStringsRequestPB (2147483654 bytes) is larger than the maximum configured RPC message size (52428800 bytes). Sending anyway, but peer may reject the data.
W20260929 03:06:22.482728  4832 connection.cc:535] server connection from 127.0.0.1:52912 recv error: Network error: RPC frame had a length of 2147483714, but we only support messages up to 52428800 bytes long.
W20260929 03:06:22.482800  4832 connection.cc:158] shutting down server connection from 127.0.0.1:52912 with pending inbound data: 4/2147483714 bytes received; last active 0 ns ago: status Network error: RPC frame had a length of 2147483714, but we only support messages up to 52428800 bytes long.
W20260929 03:06:22.483153  4846 connection.cc:196] Error closing socket: Network error: TlsSocket::Close: Connection reset by peer
I20260929 03:06:22.498994  4858 acceptor_pool.cc:254] collecting diagnostics on the listening RPC socket 0.0.0.0:36197 every 8 connection(s)
I20260929 03:06:22.499135  4859 acceptor_pool.cc:254] collecting diagnostics on the listening RPC socket 0.0.0.0:36197 every 8 connection(s)
W20260929 03:06:26.893867  4855 connection.cc:577] server connection from 127.0.0.1:41874: received bad data: 'Corruption: Invalid packet: message had a length of 2147483710, but we only support messages up to 2147483647 bytes
'
[       OK ] Parameters/TestRpc.TestRpcSidecarLimits/SSL_TCP (6364 ms)
[ RUN      ] Parameters/TestRpc.TestCallTimeoutDoesntAffectNegotiation/SSL_TCP
I20260929 03:06:26.920002  4883 acceptor_pool.cc:254] collecting diagnostics on the listening RPC socket 0.0.0.0:37089 every 8 connection(s)
I20260929 03:06:26.920008  4884 acceptor_pool.cc:254] collecting diagnostics on the listening RPC socket 0.0.0.0:37089 every 8 connection(s)
W20260929 03:06:26.931703  4877 negotiation.cc:266] Injecting 500ms delay in negotiation
I20260929 03:06:26.982079  4591 rpc-test-base.h:595] status: Timed out: connection negotiation to 0.0.0.0:37089 for RPC Sleep timed out after 0.050s (ON_OUTBOUND_QUEUE), seconds elapsed: 0.0508274
[       OK ] Parameters/TestRpc.TestCallTimeoutDoesntAffectNegotiation/SSL_TCP (543 ms)
[ RUN      ] Parameters/TestRpc.TestRpcHandlerLatencyMetric/SSL_TCP
I20260929 03:06:27.453465  4909 acceptor_pool.cc:254] collecting diagnostics on the listening RPC socket 0.0.0.0:35905 every 8 connection(s)
I20260929 03:06:27.453465  4908 acceptor_pool.cc:254] collecting diagnostics on the listening RPC socket 0.0.0.0:35905 every 8 connection(s)
I20260929 03:06:27.504065  4591 rpc-test.cc:1236] Sleep() min lat: 20601
I20260929 03:06:27.504158  4591 rpc-test.cc:1237] Sleep() mean lat: 20601
I20260929 03:06:27.504190  4591 rpc-test.cc:1238] Sleep() max lat: 20601
I20260929 03:06:27.504202  4591 rpc-test.cc:1239] Sleep() #calls: 1
[       OK ] Parameters/TestRpc.TestRpcHandlerLatencyMetric/SSL_TCP (66 ms)
[ RUN      ] Parameters/TestRpc.TimedOutOnResponseMetricServiceQueue/SSL_TCP
I20260929 03:06:27.537953  4934 acceptor_pool.cc:254] collecting diagnostics on the listening RPC socket 0.0.0.0:43621 every 8 connection(s)
I20260929 03:06:27.538021  4935 acceptor_pool.cc:254] collecting diagnostics on the listening RPC socket 0.0.0.0:43621 every 8 connection(s)
W20260929 03:06:27.602093  4936 rpcz_store.cc:267] Call kudu.rpc_test.CalculatorService.Sleep from 127.0.0.1:36258 (request call id 2) took 20 ms (client timeout 20 ms). Trace:
W20260929 03:06:27.602262  4936 rpcz_store.cc:269] 0929 03:06:27.581556 (+     0us) service_pool.cc:170] Inserting onto call queue
0929 03:06:27.602028 (+ 20472us) service_pool.cc:214] Skipping call since client already timed out
0929 03:06:27.602067 (+    39us) inbound_call.cc:173] Queueing failure response
Metrics: {}
[       OK ] Parameters/TestRpc.TimedOutOnResponseMetricServiceQueue/SSL_TCP (97 ms)
[ RUN      ] Parameters/TestRpc.RpcPendingConnectionsMetric/SSL_TCP
I20260929 03:06:27.607007  4957 acceptor_pool.cc:254] collecting diagnostics on the listening RPC socket 0.0.0.0:43547 every 8 connection(s)
I20260929 03:06:27.607055  4958 acceptor_pool.cc:254] collecting diagnostics on the listening RPC socket 0.0.0.0:43547 every 8 connection(s)
W20260929 03:06:27.608348  4953 negotiation.cc:337] Failed RPC negotiation. Trace:
0929 03:06:27.607830 (+     0us) reactor.cc:625] Submitting negotiation task for server connection from 127.0.0.1:42506 (local address 127.0.0.1:43547)
0929 03:06:27.607944 (+   114us) server_negotiation.cc:206] Beginning negotiation
0929 03:06:27.607947 (+     3us) server_negotiation.cc:399] Waiting for connection header
0929 03:06:27.608054 (+   107us) negotiation.cc:327] Negotiation complete: Network error: Server connection negotiation failed: server connection from 127.0.0.1:42506: BlockingRecv error: recv got EOF from 127.0.0.1:42506 (error 108)
Metrics: {"server-negotiator.queue_time_us":36}
[       OK ] Parameters/TestRpc.RpcPendingConnectionsMetric/SSL_TCP (15 ms)
[ RUN      ] Parameters/TestRpc.TestRpcContextClientDeadline/SSL_TCP
I20260929 03:06:27.643457  4973 acceptor_pool.cc:254] collecting diagnostics on the listening RPC socket 0.0.0.0:40393 every 8 connection(s)
I20260929 03:06:27.643466  4974 acceptor_pool.cc:254] collecting diagnostics on the listening RPC socket 0.0.0.0:40393 every 8 connection(s)
[       OK ] Parameters/TestRpc.TestRpcContextClientDeadline/SSL_TCP (72 ms)
[ RUN      ] Parameters/TestRpc.TestApplicationFeatureFlagUnsupportedServer/SSL_TCP
I20260929 03:06:27.706605  4998 acceptor_pool.cc:254] collecting diagnostics on the listening RPC socket 0.0.0.0:45125 every 8 connection(s)
I20260929 03:06:27.706620  4999 acceptor_pool.cc:254] collecting diagnostics on the listening RPC socket 0.0.0.0:45125 every 8 connection(s)
[       OK ] Parameters/TestRpc.TestApplicationFeatureFlagUnsupportedServer/SSL_TCP (30 ms)
[ RUN      ] Parameters/TestRpc.TestCancellationAsync/SSL_TCP
I20260929 03:06:27.741042  5023 acceptor_pool.cc:254] collecting diagnostics on the listening RPC socket 0.0.0.0:40835 every 8 connection(s)
I20260929 03:06:27.741074  5024 acceptor_pool.cc:254] collecting diagnostics on the listening RPC socket 0.0.0.0:40835 every 8 connection(s)
I20260929 03:06:27.741416  4591 rpc-test.cc:1716] Connecting to 0.0.0.0:40835
I20260929 03:06:27.764097  4591 test_util.cc:268] Using random seed: 2012650364
I20260929 03:06:27.794375  5027 rpc-test-base.h:240] got call: sleep_micros: 500 pattern: 4294967295 num_repetitions: 2097152 sidecar_idx: 0
I20260929 03:06:27.818776  5027 rpc-test-base.h:240] got call: sleep_micros: 500 pattern: 4294967295 num_repetitions: 2097152 sidecar_idx: 0
I20260929 03:06:27.843632  5027 rpc-test-base.h:240] got call: sleep_micros: 500 pattern: 4294967295 num_repetitions: 2097152 sidecar_idx: 0
I20260929 03:06:27.871069  5027 rpc-test-base.h:240] got call: sleep_micros: 500 pattern: 4294967295 num_repetitions: 2097152 sidecar_idx: 0
I20260929 03:06:27.899020  5027 rpc-test-base.h:240] got call: sleep_micros: 500 pattern: 4294967295 num_repetitions: 2097152 sidecar_idx: 0
I20260929 03:06:27.925989  5027 rpc-test-base.h:240] got call: sleep_micros: 500 pattern: 4294967295 num_repetitions: 2097152 sidecar_idx: 0
I20260929 03:06:27.946988  5026 rpc-test-base.h:240] got call: sleep_micros: 500 pattern: 4294967295 num_repetitions: 2097152 sidecar_idx: 0
I20260929 03:06:27.965340  5027 rpc-test-base.h:240] got call: sleep_micros: 500 pattern: 4294967295 num_repetitions: 2097152 sidecar_idx: 0
W20260929 03:06:27.971925  5020 connection.cc:441] server connection from 127.0.0.1:34184 torn down before Call kudu.rpc.GenericCalculatorService.SleepWithSidecar from 127.0.0.1:34184 (request call id 8) could send its response
W20260929 03:06:27.983665  5020 connection.cc:441] server connection from 127.0.0.1:34184 torn down before Call kudu.rpc.GenericCalculatorService.SleepWithSidecar from 127.0.0.1:34184 (request call id 9) could send its response
[       OK ] Parameters/TestRpc.TestCancellationAsync/SSL_TCP (262 ms)
[ RUN      ] Parameters/TestRpc.TestPerformanceBySocketType/SSL_TCP
I20260929 03:06:28.025053  5048 acceptor_pool.cc:254] collecting diagnostics on the listening RPC socket 0.0.0.0:33435 every 8 connection(s)
I20260929 03:06:28.025069  5049 acceptor_pool.cc:254] collecting diagnostics on the listening RPC socket 0.0.0.0:33435 every 8 connection(s)
I20260929 03:06:28.025399  4591 rpc-test.cc:1846] Connecting to 0.0.0.0:33435
I20260929 03:06:30.414130  4591 rpc-test.cc:1859] Sending 1024MB via ssl-enabled tcp socket: real 2.379s	user 2.662s	sys 1.491s
I20260929 03:06:32.775198  4591 rpc-test.cc:1859] Sending 1024MB via ssl-enabled tcp socket: real 2.361s	user 2.524s	sys 1.601s
I20260929 03:06:34.932304  4591 rpc-test.cc:1859] Sending 1024MB via ssl-enabled tcp socket: real 2.157s	user 2.239s	sys 1.517s
I20260929 03:06:37.141881  4591 rpc-test.cc:1859] Sending 1024MB via ssl-enabled tcp socket: real 2.209s	user 2.454s	sys 1.427s
I20260929 03:06:39.378535  4591 rpc-test.cc:1859] Sending 1024MB via ssl-enabled tcp socket: real 2.237s	user 2.479s	sys 1.422s
[       OK ] Parameters/TestRpc.TestPerformanceBySocketType/SSL_TCP (11395 ms)
[----------] 20 tests from Parameters/TestRpc (37583 ms total)

[----------] 1 test from Parameters/TestRpcSocketTxRxQueue
[ RUN      ] Parameters/TestRpcSocketTxRxQueue.OverCapacity/0
W20260929 03:06:39.658499  5092 negotiation.cc:337] Failed RPC negotiation. Trace:
0929 03:06:39.394290 (+     0us) reactor.cc:625] Submitting negotiation task for client connection to 0.0.0.0:37551 (local address 127.0.0.1:50380)
0929 03:06:39.394558 (+   268us) negotiation.cc:107] Waiting for socket to connect
0929 03:06:39.394571 (+    13us) client_negotiation.cc:174] Beginning negotiation
0929 03:06:39.394676 (+   105us) client_negotiation.cc:252] Sending NEGOTIATE NegotiatePB request
0929 03:06:39.658325 (+263649us) negotiation.cc:327] Negotiation complete: Network error: Client connection negotiation failed: client connection to 0.0.0.0:37551: BlockingRecv error: recv error from unknown peer: Transport endpoint is not connected (error 107)
Metrics: {"client-negotiator.queue_time_us":64}
W20260929 03:06:39.658499  5083 negotiation.cc:337] Failed RPC negotiation. Trace:
0929 03:06:39.392864 (+     0us) reactor.cc:625] Submitting negotiation task for client connection to 0.0.0.0:37551 (local address 127.0.0.1:50366)
0929 03:06:39.393012 (+   148us) negotiation.cc:107] Waiting for socket to connect
0929 03:06:39.393026 (+    14us) client_negotiation.cc:174] Beginning negotiation
0929 03:06:39.393122 (+    96us) client_negotiation.cc:252] Sending NEGOTIATE NegotiatePB request
0929 03:06:39.658325 (+265203us) negotiation.cc:327] Negotiation complete: Network error: Client connection negotiation failed: client connection to 0.0.0.0:37551: BlockingRecv error: recv error from unknown peer: Transport endpoint is not connected (error 107)
Metrics: {"client-negotiator.queue_time_us":57}
W20260929 03:06:39.658699  5065 negotiation.cc:337] Failed RPC negotiation. Trace:
0929 03:06:39.389872 (+     0us) reactor.cc:625] Submitting negotiation task for client connection to 0.0.0.0:37551 (local address 127.0.0.1:50348)
0929 03:06:39.390056 (+   184us) negotiation.cc:107] Waiting for socket to connect
0929 03:06:39.390073 (+    17us) client_negotiation.cc:174] Beginning negotiation
0929 03:06:39.390196 (+   123us) client_negotiation.cc:252] Sending NEGOTIATE NegotiatePB request
0929 03:06:39.658328 (+268132us) negotiation.cc:327] Negotiation complete: Network error: Client connection negotiation failed: client connection to 0.0.0.0:37551: BlockingRecv error: recv error from unknown peer: Transport endpoint is not connected (error 107)
Metrics: {"client-negotiator.queue_time_us":67}
W20260929 03:06:39.659001  5100 negotiation.cc:337] Failed RPC negotiation. Trace:
0929 03:06:39.395710 (+     0us) reactor.cc:625] Submitting negotiation task for client connection to 0.0.0.0:37551 (local address 127.0.0.1:50392)
0929 03:06:39.395880 (+   170us) negotiation.cc:107] Waiting for socket to connect
0929 03:06:39.395893 (+    13us) client_negotiation.cc:174] Beginning negotiation
0929 03:06:39.395989 (+    96us) client_negotiation.cc:252] Sending NEGOTIATE NegotiatePB request
0929 03:06:39.658910 (+262921us) negotiation.cc:327] Negotiation complete: Network error: Client connection negotiation failed: client connection to 0.0.0.0:37551: BlockingRecv error: recv error from unknown peer: Transport endpoint is not connected (error 107)
Metrics: {"client-negotiator.queue_time_us":88}
W20260929 03:06:39.659004  5110 negotiation.cc:337] Failed RPC negotiation. Trace:
0929 03:06:39.396811 (+     0us) reactor.cc:625] Submitting negotiation task for client connection to 0.0.0.0:37551 (local address 127.0.0.1:50408)
0929 03:06:39.396906 (+    95us) negotiation.cc:107] Waiting for socket to connect
0929 03:06:39.396918 (+    12us) client_negotiation.cc:174] Beginning negotiation
0929 03:06:39.397001 (+    83us) client_negotiation.cc:252] Sending NEGOTIATE NegotiatePB request
0929 03:06:39.658910 (+261909us) negotiation.cc:327] Negotiation complete: Network error: Client connection negotiation failed: client connection to 0.0.0.0:37551: BlockingRecv error: recv error from unknown peer: Transport endpoint is not connected (error 107)
Metrics: {"client-negotiator.queue_time_us":25}
W20260929 03:06:39.658722  5074 negotiation.cc:337] Failed RPC negotiation. Trace:
0929 03:06:39.391589 (+     0us) reactor.cc:625] Submitting negotiation task for client connection to 0.0.0.0:37551 (local address 127.0.0.1:50354)
0929 03:06:39.391706 (+   117us) negotiation.cc:107] Waiting for socket to connect
0929 03:06:39.391719 (+    13us) client_negotiation.cc:174] Beginning negotiation
0929 03:06:39.391810 (+    91us) client_negotiation.cc:252] Sending NEGOTIATE NegotiatePB request
0929 03:06:39.658328 (+266518us) negotiation.cc:327] Negotiation complete: Network error: Client connection negotiation failed: client connection to 0.0.0.0:37551: BlockingRecv error: recv error from unknown peer: Transport endpoint is not connected (error 107)
Metrics: {"client-negotiator.queue_time_us":39}
[       OK ] Parameters/TestRpcSocketTxRxQueue.OverCapacity/0 (1049 ms)
[----------] 1 test from Parameters/TestRpcSocketTxRxQueue (1049 ms total)

[----------] Global test environment tear-down
[==========] 21 tests from 2 test suites ran. (38633 ms total)
[  PASSED  ] 20 tests.
[  FAILED  ] 1 test, listed below:
[  FAILED  ] Parameters/TestRpc.TestCallWithChainCertAndChainCA/SSL_TCP, where GetParam() = (true, false)

 1 FAILED TEST