Diagnosed failure
Parameters/TestRpc.TestCallWithChainCertAndChainCA/SSL_TCP: /data0/somelongdirectorytoavoidrpathissues/src/kudu/src/kudu/rpc/rpc-test.cc:270: Failure
Failed
Bad status: Runtime error: could not verify certificate chain (error with cert: subject=CN = localhost, ST = sadfjas, C = AS, emailAddress = sdflkdsajf, O = lskdfjlsad, OU = sldfkja, issuer=C = AS, ST = ASDfkjdhf, L = lskdjf, O = saldfja, OU = skdjf, CN = localhost, emailAddress = sadjflkadsj): : certificate has expired
Google Test trace:
/data0/somelongdirectorytoavoidrpathissues/src/kudu/src/kudu/rpc/rpc-test.cc:267: Connecting to 0.0.0.0:34575
I20260929 20:16:33.555042 8074 test_util.cc:175] -----------------------------------------------
I20260929 20:16:33.555148 8074 test_util.cc:176] Had fatal failures, leaving test files at /tmp/dist-test-taskKyrpUZ/test-tmp/rpc-test.5.Parameters_TestRpc.TestCallWithChainCertAndChainCA_SSL_TCP.1790712993437164-8074-0
Full log
Note: This is test shard 6 of 8.
[==========] Running 21 tests from 2 test suites.
[----------] Global test environment set-up.
[----------] 20 tests from Parameters/TestRpc
[ RUN ] Parameters/TestRpc.TestMessengerCreateDestroy/SSL_TCP
WARNING: Logging before InitGoogleLogging() is written to STDERR
I20260929 20:16:33.479007 8074 rpc-test.cc:169] started messenger TestCreateDestroy
[ OK ] Parameters/TestRpc.TestMessengerCreateDestroy/SSL_TCP (25 ms)
[ RUN ] Parameters/TestRpc.TestNegotiationDeadlock/SSL_TCP
I20260929 20:16:33.496209 8094 acceptor_pool.cc:254] collecting diagnostics on the listening RPC socket 0.0.0.0:41525 every 8 connection(s)
I20260929 20:16:33.496433 8095 acceptor_pool.cc:254] collecting diagnostics on the listening RPC socket 0.0.0.0:41525 every 8 connection(s)
[ OK ] Parameters/TestRpc.TestNegotiationDeadlock/SSL_TCP (34 ms)
[ RUN ] Parameters/TestRpc.TestCallWithChainCertAndChainCA/SSL_TCP
I20260929 20:16:33.542661 8110 acceptor_pool.cc:254] collecting diagnostics on the listening RPC socket 0.0.0.0:34575 every 8 connection(s)
I20260929 20:16:33.542961 8111 acceptor_pool.cc:254] collecting diagnostics on the listening RPC socket 0.0.0.0:34575 every 8 connection(s)
/data0/somelongdirectorytoavoidrpathissues/src/kudu/src/kudu/rpc/rpc-test.cc:270: Failure
Failed
Bad status: Runtime error: could not verify certificate chain (error with cert: subject=CN = localhost, ST = sadfjas, C = AS, emailAddress = sdflkdsajf, O = lskdfjlsad, OU = sldfkja, issuer=C = AS, ST = ASDfkjdhf, L = lskdjf, O = saldfja, OU = skdjf, CN = localhost, emailAddress = sadjflkadsj): : certificate has expired
Google Test trace:
/data0/somelongdirectorytoavoidrpathissues/src/kudu/src/kudu/rpc/rpc-test.cc:267: Connecting to 0.0.0.0:34575
I20260929 20:16:33.555042 8074 test_util.cc:175] -----------------------------------------------
I20260929 20:16:33.555148 8074 test_util.cc:176] Had fatal failures, leaving test files at /tmp/dist-test-taskKyrpUZ/test-tmp/rpc-test.5.Parameters_TestRpc.TestCallWithChainCertAndChainCA_SSL_TCP.1790712993437164-8074-0
[ FAILED ] Parameters/TestRpc.TestCallWithChainCertAndChainCA/SSL_TCP, where GetParam() = (true, false) (38 ms)
[ RUN ] Parameters/TestRpc.TestCallWithPasswordProtectedKey/SSL_TCP
I20260929 20:16:33.591137 8135 acceptor_pool.cc:254] collecting diagnostics on the listening RPC socket 0.0.0.0:36859 every 8 connection(s)
I20260929 20:16:33.591387 8136 acceptor_pool.cc:254] collecting diagnostics on the listening RPC socket 0.0.0.0:36859 every 8 connection(s)
[ OK ] Parameters/TestRpc.TestCallWithPasswordProtectedKey/SSL_TCP (73 ms)
[ RUN ] Parameters/TestRpc.TestCallToBadServer/SSL_TCP
I20260929 20:16:33.647728 8074 rpc-test.cc:394] Status: Network error: Client connection negotiation failed: client connection to 0.0.0.0:0: connect: Connection refused (error 111)
I20260929 20:16:33.648577 8074 rpc-test.cc:394] Status: Network error: Client connection negotiation failed: client connection to 0.0.0.0:0: connect: Connection refused (error 111)
I20260929 20:16:33.649255 8074 rpc-test.cc:394] Status: Network error: Client connection negotiation failed: client connection to 0.0.0.0:0: connect: Connection refused (error 111)
I20260929 20:16:33.649920 8074 rpc-test.cc:394] Status: Network error: Client connection negotiation failed: client connection to 0.0.0.0:0: connect: Connection refused (error 111)
I20260929 20:16:33.650583 8074 rpc-test.cc:394] Status: Network error: Client connection negotiation failed: client connection to 0.0.0.0:0: connect: Connection refused (error 111)
[ OK ] Parameters/TestRpc.TestCallToBadServer/SSL_TCP (23 ms)
[ RUN ] Parameters/TestRpc.TestWrongService/SSL_TCP
I20260929 20:16:33.677498 8170 acceptor_pool.cc:254] collecting diagnostics on the listening RPC socket 0.0.0.0:46055 every 8 connection(s)
I20260929 20:16:33.677788 8171 acceptor_pool.cc:254] collecting diagnostics on the listening RPC socket 0.0.0.0:46055 every 8 connection(s)
I20260929 20:16:33.708866 8167 messenger.cc:345] service WrongServiceName not registered on TestServer
[ OK ] Parameters/TestRpc.TestWrongService/SSL_TCP (61 ms)
[ RUN ] Parameters/TestRpc.TestConnectionKeepalive/SSL_TCP
I20260929 20:16:33.723677 8193 acceptor_pool.cc:254] collecting diagnostics on the listening RPC socket 0.0.0.0:40665 every 8 connection(s)
I20260929 20:16:33.723934 8194 acceptor_pool.cc:254] collecting diagnostics on the listening RPC socket 0.0.0.0:40665 every 8 connection(s)
I20260929 20:16:33.724866 8074 rpc-test.cc:488] Connecting to 0.0.0.0:40665
[ OK ] Parameters/TestRpc.TestConnectionKeepalive/SSL_TCP (1035 ms)
[ RUN ] Parameters/TestRpc.TestClientConnectionMetrics/SSL_TCP
I20260929 20:16:34.766149 8218 acceptor_pool.cc:254] collecting diagnostics on the listening RPC socket 0.0.0.0:36219 every 8 connection(s)
I20260929 20:16:34.766333 8219 acceptor_pool.cc:254] collecting diagnostics on the listening RPC socket 0.0.0.0:36219 every 8 connection(s)
I20260929 20:16:34.767329 8074 rpc-test.cc:569] Connecting to 0.0.0.0:36219
[ OK ] Parameters/TestRpc.TestClientConnectionMetrics/SSL_TCP (20975 ms)
[ RUN ] Parameters/TestRpc.TestCredentialsPolicy/SSL_TCP
I20260929 20:16:55.764151 8241 acceptor_pool.cc:254] collecting diagnostics on the listening RPC socket 0.0.0.0:37279 every 8 connection(s)
I20260929 20:16:55.764397 8242 acceptor_pool.cc:254] collecting diagnostics on the listening RPC socket 0.0.0.0:37279 every 8 connection(s)
I20260929 20:16:55.765354 8074 rpc-test.cc:700] Connecting to 0.0.0.0:37279
[ OK ] Parameters/TestRpc.TestCredentialsPolicy/SSL_TCP (99 ms)
[ RUN ] Parameters/TestRpc.TestCallLongerThanKeepalive/SSL_TCP
I20260929 20:16:55.846369 8266 acceptor_pool.cc:254] collecting diagnostics on the listening RPC socket 0.0.0.0:37769 every 8 connection(s)
I20260929 20:16:55.846593 8267 acceptor_pool.cc:254] collecting diagnostics on the listening RPC socket 0.0.0.0:37769 every 8 connection(s)
I20260929 20:16:55.864535 8270 rpc-test-base.h:222] got call: sleep_micros: 3000000 deferred: true
I20260929 20:16:58.867115 8270 rpcz_store.cc:275] Call kudu.rpc.GenericCalculatorService.Sleep from 127.0.0.1:48138 (request call id 0) took 3002 ms. Trace:
I20260929 20:16:58.867319 8270 rpcz_store.cc:276] 0929 20:16:55.864418 (+ 0us) service_pool.cc:170] Inserting onto call queue
0929 20:16:55.864477 (+ 59us) service_pool.cc:227] Handling call
0929 20:16:58.867058 (+3002581us) inbound_call.cc:173] Queueing success response
Metrics: {}
[ OK ] Parameters/TestRpc.TestCallLongerThanKeepalive/SSL_TCP (3048 ms)
[ RUN ] Parameters/TestRpc.TestRpcSidecar/SSL_TCP
I20260929 20:16:58.885206 8291 acceptor_pool.cc:254] collecting diagnostics on the listening RPC socket 0.0.0.0:35789 every 8 connection(s)
I20260929 20:16:58.885507 8292 acceptor_pool.cc:254] collecting diagnostics on the listening RPC socket 0.0.0.0:35789 every 8 connection(s)
[ OK ] Parameters/TestRpc.TestRpcSidecar/SSL_TCP (131 ms)
[ RUN ] Parameters/TestRpc.TestRpcSidecarLimits/SSL_TCP
I20260929 20:17:02.223533 8316 acceptor_pool.cc:254] collecting diagnostics on the listening RPC socket 0.0.0.0:41175 every 8 connection(s)
I20260929 20:17:02.223843 8317 acceptor_pool.cc:254] collecting diagnostics on the listening RPC socket 0.0.0.0:41175 every 8 connection(s)
W20260929 20:17:02.236085 8074 serialization.cc:72] Serialized kudu.rpc_test.PushStringsRequestPB (2147483654 bytes) is larger than the maximum configured RPC message size (52428800 bytes). Sending anyway, but peer may reject the data.
W20260929 20:17:02.243302 8313 connection.cc:535] server connection from 127.0.0.1:38860 recv error: Network error: RPC frame had a length of 2147483714, but we only support messages up to 52428800 bytes long.
W20260929 20:17:02.243466 8313 connection.cc:158] shutting down server connection from 127.0.0.1:38860 with pending inbound data: 4/2147483714 bytes received; last active 0 ns ago: status Network error: RPC frame had a length of 2147483714, but we only support messages up to 52428800 bytes long.
W20260929 20:17:02.244138 8329 connection.cc:196] Error closing socket: Network error: TlsSocket::Close: Connection reset by peer
I20260929 20:17:02.267185 8341 acceptor_pool.cc:254] collecting diagnostics on the listening RPC socket 0.0.0.0:43521 every 8 connection(s)
I20260929 20:17:02.267319 8342 acceptor_pool.cc:254] collecting diagnostics on the listening RPC socket 0.0.0.0:43521 every 8 connection(s)
W20260929 20:17:08.709815 8340 connection.cc:577] server connection from 127.0.0.1:54800: received bad data: 'Corruption: Invalid packet: message had a length of 2147483710, but we only support messages up to 2147483647 bytes
'
[ OK ] Parameters/TestRpc.TestRpcSidecarLimits/SSL_TCP (10189 ms)
[ RUN ] Parameters/TestRpc.TestCallTimeoutDoesntAffectNegotiation/SSL_TCP
I20260929 20:17:09.210382 8366 acceptor_pool.cc:254] collecting diagnostics on the listening RPC socket 0.0.0.0:38611 every 8 connection(s)
I20260929 20:17:09.210608 8367 acceptor_pool.cc:254] collecting diagnostics on the listening RPC socket 0.0.0.0:38611 every 8 connection(s)
W20260929 20:17:09.257525 8362 negotiation.cc:266] Injecting 500ms delay in negotiation
I20260929 20:17:09.307993 8074 rpc-test-base.h:595] status: Timed out: connection negotiation to 0.0.0.0:38611 for RPC Sleep timed out after 0.050s (ON_OUTBOUND_QUEUE), seconds elapsed: 0.0513135
[ OK ] Parameters/TestRpc.TestCallTimeoutDoesntAffectNegotiation/SSL_TCP (573 ms)
[ RUN ] Parameters/TestRpc.TestRpcHandlerLatencyMetric/SSL_TCP
I20260929 20:17:09.792929 8391 acceptor_pool.cc:254] collecting diagnostics on the listening RPC socket 0.0.0.0:40141 every 8 connection(s)
I20260929 20:17:09.793145 8392 acceptor_pool.cc:254] collecting diagnostics on the listening RPC socket 0.0.0.0:40141 every 8 connection(s)
I20260929 20:17:09.840432 8074 rpc-test.cc:1236] Sleep() min lat: 20729
I20260929 20:17:09.840520 8074 rpc-test.cc:1237] Sleep() mean lat: 20729
I20260929 20:17:09.840562 8074 rpc-test.cc:1238] Sleep() max lat: 20729
I20260929 20:17:09.840632 8074 rpc-test.cc:1239] Sleep() #calls: 1
[ OK ] Parameters/TestRpc.TestRpcHandlerLatencyMetric/SSL_TCP (78 ms)
[ RUN ] Parameters/TestRpc.TimedOutOnResponseMetricServiceQueue/SSL_TCP
I20260929 20:17:09.863322 8417 acceptor_pool.cc:254] collecting diagnostics on the listening RPC socket 0.0.0.0:38055 every 8 connection(s)
I20260929 20:17:09.863552 8418 acceptor_pool.cc:254] collecting diagnostics on the listening RPC socket 0.0.0.0:38055 every 8 connection(s)
W20260929 20:17:09.926585 8419 rpcz_store.cc:267] Call kudu.rpc_test.CalculatorService.Sleep from 127.0.0.1:50586 (request call id 2) took 20 ms (client timeout 20 ms). Trace:
W20260929 20:17:09.926797 8419 rpcz_store.cc:269] 0929 20:17:09.906191 (+ 0us) service_pool.cc:170] Inserting onto call queue
0929 20:17:09.926523 (+ 20332us) service_pool.cc:214] Skipping call since client already timed out
0929 20:17:09.926567 (+ 44us) inbound_call.cc:173] Queueing failure response
Metrics: {}
[ OK ] Parameters/TestRpc.TimedOutOnResponseMetricServiceQueue/SSL_TCP (83 ms)
[ RUN ] Parameters/TestRpc.RpcPendingConnectionsMetric/SSL_TCP
I20260929 20:17:09.936676 8440 acceptor_pool.cc:254] collecting diagnostics on the listening RPC socket 0.0.0.0:40593 every 8 connection(s)
I20260929 20:17:09.936931 8441 acceptor_pool.cc:254] collecting diagnostics on the listening RPC socket 0.0.0.0:40593 every 8 connection(s)
W20260929 20:17:09.939102 8436 negotiation.cc:337] Failed RPC negotiation. Trace:
0929 20:17:09.938371 (+ 0us) reactor.cc:625] Submitting negotiation task for server connection from 127.0.0.1:34698 (local address 127.0.0.1:40593)
0929 20:17:09.938573 (+ 202us) server_negotiation.cc:206] Beginning negotiation
0929 20:17:09.938580 (+ 7us) server_negotiation.cc:399] Waiting for connection header
0929 20:17:09.938755 (+ 175us) negotiation.cc:327] Negotiation complete: Network error: Server connection negotiation failed: server connection from 127.0.0.1:34698: BlockingRecv error: recv got EOF from 127.0.0.1:34698 (error 108)
Metrics: {"server-negotiator.queue_time_us":53}
[ OK ] Parameters/TestRpc.RpcPendingConnectionsMetric/SSL_TCP (20 ms)
[ RUN ] Parameters/TestRpc.TestRpcContextClientDeadline/SSL_TCP
I20260929 20:17:09.964568 8456 acceptor_pool.cc:254] collecting diagnostics on the listening RPC socket 0.0.0.0:37157 every 8 connection(s)
I20260929 20:17:09.964807 8457 acceptor_pool.cc:254] collecting diagnostics on the listening RPC socket 0.0.0.0:37157 every 8 connection(s)
[ OK ] Parameters/TestRpc.TestRpcContextClientDeadline/SSL_TCP (68 ms)
[ RUN ] Parameters/TestRpc.TestApplicationFeatureFlagUnsupportedServer/SSL_TCP
I20260929 20:17:10.037279 8481 acceptor_pool.cc:254] collecting diagnostics on the listening RPC socket 0.0.0.0:40853 every 8 connection(s)
I20260929 20:17:10.037515 8482 acceptor_pool.cc:254] collecting diagnostics on the listening RPC socket 0.0.0.0:40853 every 8 connection(s)
[ OK ] Parameters/TestRpc.TestApplicationFeatureFlagUnsupportedServer/SSL_TCP (45 ms)
[ RUN ] Parameters/TestRpc.TestCancellationAsync/SSL_TCP
I20260929 20:17:10.084607 8506 acceptor_pool.cc:254] collecting diagnostics on the listening RPC socket 0.0.0.0:41439 every 8 connection(s)
I20260929 20:17:10.084849 8507 acceptor_pool.cc:254] collecting diagnostics on the listening RPC socket 0.0.0.0:41439 every 8 connection(s)
I20260929 20:17:10.085836 8074 rpc-test.cc:1716] Connecting to 0.0.0.0:41439
I20260929 20:17:10.108129 8074 test_util.cc:268] Using random seed: -569515071
I20260929 20:17:10.146036 8510 rpc-test-base.h:240] got call: sleep_micros: 500 pattern: 4294967295 num_repetitions: 2097152 sidecar_idx: 0
I20260929 20:17:10.166620 8509 rpc-test-base.h:240] got call: sleep_micros: 500 pattern: 4294967295 num_repetitions: 2097152 sidecar_idx: 0
I20260929 20:17:10.193368 8508 rpc-test-base.h:240] got call: sleep_micros: 500 pattern: 4294967295 num_repetitions: 2097152 sidecar_idx: 0
I20260929 20:17:10.220541 8510 rpc-test-base.h:240] got call: sleep_micros: 500 pattern: 4294967295 num_repetitions: 2097152 sidecar_idx: 0
I20260929 20:17:10.248184 8509 rpc-test-base.h:240] got call: sleep_micros: 500 pattern: 4294967295 num_repetitions: 2097152 sidecar_idx: 0
I20260929 20:17:10.284847 8510 rpc-test-base.h:240] got call: sleep_micros: 500 pattern: 4294967295 num_repetitions: 2097152 sidecar_idx: 0
W20260929 20:17:10.314953 8504 connection.cc:698] server connection from 127.0.0.1:57900 send error: Network error: failed to write to TLS socket: Broken pipe
W20260929 20:17:10.315131 8504 connection.cc:441] server connection from 127.0.0.1:57900 torn down before Call kudu.rpc.GenericCalculatorService.SleepWithSidecar from 127.0.0.1:57900 (request call id 9) could send its response
W20260929 20:17:10.315490 8504 connection.cc:196] Error closing socket: Network error: TlsSocket::Close: Success
W20260929 20:17:10.331501 8504 connection.cc:441] server connection from 127.0.0.1:57900 torn down before Call kudu.rpc.GenericCalculatorService.SleepWithSidecar from 127.0.0.1:57900 (request call id 8) could send its response
[ OK ] Parameters/TestRpc.TestCancellationAsync/SSL_TCP (269 ms)
[ RUN ] Parameters/TestRpc.TestPerformanceBySocketType/SSL_TCP
I20260929 20:17:10.347995 8531 acceptor_pool.cc:254] collecting diagnostics on the listening RPC socket 0.0.0.0:45577 every 8 connection(s)
I20260929 20:17:10.348265 8532 acceptor_pool.cc:254] collecting diagnostics on the listening RPC socket 0.0.0.0:45577 every 8 connection(s)
I20260929 20:17:10.349160 8074 rpc-test.cc:1846] Connecting to 0.0.0.0:45577
I20260929 20:17:13.516191 8074 rpc-test.cc:1859] Sending 1024MB via ssl-enabled tcp socket: real 3.159s user 2.821s sys 2.403s
I20260929 20:17:16.731024 8074 rpc-test.cc:1859] Sending 1024MB via ssl-enabled tcp socket: real 3.215s user 2.986s sys 2.341s
I20260929 20:17:19.899982 8074 rpc-test.cc:1859] Sending 1024MB via ssl-enabled tcp socket: real 3.169s user 2.837s sys 2.393s
I20260929 20:17:23.064096 8074 rpc-test.cc:1859] Sending 1024MB via ssl-enabled tcp socket: real 3.164s user 2.880s sys 2.380s
I20260929 20:17:26.274289 8074 rpc-test.cc:1859] Sending 1024MB via ssl-enabled tcp socket: real 3.210s user 3.001s sys 2.343s
[ OK ] Parameters/TestRpc.TestPerformanceBySocketType/SSL_TCP (15947 ms)
[----------] 20 tests from Parameters/TestRpc (52826 ms total)
[----------] 1 test from Parameters/TestRpcSocketTxRxQueue
[ RUN ] Parameters/TestRpcSocketTxRxQueue.OverCapacity/0
W20260929 20:17:26.586149 8584 negotiation.cc:337] Failed RPC negotiation. Trace:
0929 20:17:26.297773 (+ 0us) reactor.cc:625] Submitting negotiation task for client connection to 0.0.0.0:34131 (local address 127.0.0.1:58774)
0929 20:17:26.298151 (+ 378us) negotiation.cc:107] Waiting for socket to connect
0929 20:17:26.298173 (+ 22us) client_negotiation.cc:174] Beginning negotiation
0929 20:17:26.298297 (+ 124us) client_negotiation.cc:252] Sending NEGOTIATE NegotiatePB request
0929 20:17:26.585705 (+287408us) negotiation.cc:327] Negotiation complete: Network error: Client connection negotiation failed: client connection to 0.0.0.0:34131: BlockingRecv error: recv error from unknown peer: Transport endpoint is not connected (error 107)
Metrics: {"client-negotiator.queue_time_us":60}
W20260929 20:17:26.586230 8548 negotiation.cc:337] Failed RPC negotiation. Trace:
0929 20:17:26.287013 (+ 0us) reactor.cc:625] Submitting negotiation task for client connection to 0.0.0.0:34131 (local address 127.0.0.1:58728)
0929 20:17:26.287177 (+ 164us) negotiation.cc:107] Waiting for socket to connect
0929 20:17:26.287196 (+ 19us) client_negotiation.cc:174] Beginning negotiation
0929 20:17:26.287316 (+ 120us) client_negotiation.cc:252] Sending NEGOTIATE NegotiatePB request
0929 20:17:26.585705 (+298389us) negotiation.cc:327] Negotiation complete: Network error: Client connection negotiation failed: client connection to 0.0.0.0:34131: BlockingRecv error: recv error from unknown peer: Transport endpoint is not connected (error 107)
Metrics: {"client-negotiator.queue_time_us":54}
W20260929 20:17:26.586395 8557 negotiation.cc:337] Failed RPC negotiation. Trace:
0929 20:17:26.289391 (+ 0us) reactor.cc:625] Submitting negotiation task for client connection to 0.0.0.0:34131 (local address 127.0.0.1:58742)
0929 20:17:26.289564 (+ 173us) negotiation.cc:107] Waiting for socket to connect
0929 20:17:26.289582 (+ 18us) client_negotiation.cc:174] Beginning negotiation
0929 20:17:26.289686 (+ 104us) client_negotiation.cc:252] Sending NEGOTIATE NegotiatePB request
0929 20:17:26.585948 (+296262us) negotiation.cc:327] Negotiation complete: Network error: Client connection negotiation failed: client connection to 0.0.0.0:34131: BlockingRecv error: recv error from unknown peer: Transport endpoint is not connected (error 107)
Metrics: {"client-negotiator.queue_time_us":57}
W20260929 20:17:26.586634 8575 negotiation.cc:337] Failed RPC negotiation. Trace:
0929 20:17:26.294824 (+ 0us) reactor.cc:625] Submitting negotiation task for client connection to 0.0.0.0:34131 (local address 127.0.0.1:58758)
0929 20:17:26.295014 (+ 190us) negotiation.cc:107] Waiting for socket to connect
0929 20:17:26.295032 (+ 18us) client_negotiation.cc:174] Beginning negotiation
0929 20:17:26.295141 (+ 109us) client_negotiation.cc:252] Sending NEGOTIATE NegotiatePB request
0929 20:17:26.586027 (+290886us) negotiation.cc:327] Negotiation complete: Network error: Client connection negotiation failed: client connection to 0.0.0.0:34131: BlockingRecv error: recv error from unknown peer: Transport endpoint is not connected (error 107)
Metrics: {"client-negotiator.queue_time_us":54}
W20260929 20:17:26.587580 8566 negotiation.cc:337] Failed RPC negotiation. Trace:
0929 20:17:26.291927 (+ 0us) reactor.cc:625] Submitting negotiation task for client connection to 0.0.0.0:34131 (local address 127.0.0.1:58744)
0929 20:17:26.292102 (+ 175us) negotiation.cc:107] Waiting for socket to connect
0929 20:17:26.292121 (+ 19us) client_negotiation.cc:174] Beginning negotiation
0929 20:17:26.292238 (+ 117us) client_negotiation.cc:252] Sending NEGOTIATE NegotiatePB request
0929 20:17:26.585846 (+293608us) negotiation.cc:327] Negotiation complete: Network error: Client connection negotiation failed: client connection to 0.0.0.0:34131: BlockingRecv error: recv error from unknown peer: Transport endpoint is not connected (error 107)
Metrics: {"client-negotiator.queue_time_us":32}
W20260929 20:17:26.588281 8593 negotiation.cc:337] Failed RPC negotiation. Trace:
0929 20:17:26.300873 (+ 0us) reactor.cc:625] Submitting negotiation task for client connection to 0.0.0.0:34131 (local address 127.0.0.1:58788)
0929 20:17:26.301217 (+ 344us) negotiation.cc:107] Waiting for socket to connect
0929 20:17:26.301238 (+ 21us) client_negotiation.cc:174] Beginning negotiation
0929 20:17:26.301374 (+ 136us) client_negotiation.cc:252] Sending NEGOTIATE NegotiatePB request
0929 20:17:26.587178 (+285804us) negotiation.cc:327] Negotiation complete: Network error: Client connection negotiation failed: client connection to 0.0.0.0:34131: BlockingRecv error: recv error from unknown peer: Transport endpoint is not connected (error 107)
Metrics: {"client-negotiator.queue_time_us":163}
[ OK ] Parameters/TestRpcSocketTxRxQueue.OverCapacity/0 (1069 ms)
[----------] 1 test from Parameters/TestRpcSocketTxRxQueue (1069 ms total)
[----------] Global test environment tear-down
[==========] 21 tests from 2 test suites ran. (53896 ms total)
[ PASSED ] 20 tests.
[ FAILED ] 1 test, listed below:
[ FAILED ] Parameters/TestRpc.TestCallWithChainCertAndChainCA/SSL_TCP, where GetParam() = (true, false)
1 FAILED TEST