Parameters/TestRpc.TestCallWithChainCertAndRootCA/SSL_UnixSocket: /data0/somelongdirectorytoavoidrpathissues/src/kudu/src/kudu/rpc/rpc-test.cc:303: Failure
Failed
Bad status: Runtime error: could not verify certificate chain (error with cert: subject=CN = localhost, ST = sadfjas, C = AS, emailAddress = sdflkdsajf, O = lskdfjlsad, OU = sldfkja, issuer=C = AS, ST = ASDfkjdhf, L = lskdjf, O = saldfja, OU = skdjf, CN = localhost, emailAddress = sadjflkadsj): : certificate has expired
Google Test trace:
/data0/somelongdirectorytoavoidrpathissues/src/kudu/src/kudu/rpc/rpc-test.cc:300: Connecting to unix:/tmp/dist-test-task9GGKu8/test-tmp/rpc-test-e8b239d2ac054f149dee03cdd93ed7ca.sock
I20260924 22:17:15.613174 2479 test_util.cc:175] -----------------------------------------------
I20260924 22:17:15.613350 2479 test_util.cc:176] Had fatal failures, leaving test files at /tmp/dist-test-task9GGKu8/test-tmp/rpc-test.2.Parameters_TestRpc.TestCallWithChainCertAndRootCA_SSL_UnixSocket.1790288232159579-2479-0
Note: This is test shard 3 of 8.
[==========] Running 21 tests from 2 test suites.
[----------] Global test environment set-up.
[----------] 1 test from TestRpc
[ RUN ] TestRpc.TestNegotiationTimeout
WARNING: Logging before InitGoogleLogging() is written to STDERR
I20260924 22:17:12.354152 2479 rpc-test-base.h:595] status: Timed out: connection negotiation to 0.0.0.0:37593 for RPC Sleep timed out after 0.100s (ON_OUTBOUND_QUEUE), seconds elapsed: 0.10084
W20260924 22:17:15.279096 2489 negotiation.cc:337] Failed RPC negotiation. Trace:
0924 22:17:12.253848 (+ 0us) reactor.cc:625] Submitting negotiation task for client connection to 0.0.0.0:37593 (local address 127.0.0.1:53244)
0924 22:17:12.254525 (+ 677us) negotiation.cc:107] Waiting for socket to connect
0924 22:17:12.254578 (+ 53us) client_negotiation.cc:174] Beginning negotiation
0924 22:17:12.267428 (+ 12850us) client_negotiation.cc:252] Sending NEGOTIATE NegotiatePB request
0924 22:17:15.277809 (+3010381us) negotiation.cc:327] Negotiation complete: Timed out: Client connection negotiation failed: client connection to 0.0.0.0:37593: received 0 of 4 requested bytes
Metrics: {"client-negotiator.queue_time_us":223}
[ OK ] TestRpc.TestNegotiationTimeout (3068 ms)
[----------] 1 test from TestRpc (3068 ms total)
[----------] 20 tests from Parameters/TestRpc
[ RUN ] Parameters/TestRpc.TestAcceptorPoolStartStop/SSL_UnixSocket
I20260924 22:17:15.321156 2505 acceptor_pool.cc:254] collecting diagnostics on the listening RPC socket unix:/tmp/dist-test-task9GGKu8/test-tmp/rpc-test-2b0405644e66497196a2ccea2576724c.sock every 8 connection(s)
I20260924 22:17:15.323163 2506 acceptor_pool.cc:254] collecting diagnostics on the listening RPC socket unix:/tmp/dist-test-task9GGKu8/test-tmp/rpc-test-2b0405644e66497196a2ccea2576724c.sock every 8 connection(s)
I20260924 22:17:15.385567 2516 acceptor_pool.cc:254] collecting diagnostics on the listening RPC socket unix:/tmp/dist-test-task9GGKu8/test-tmp/rpc-test-2b0405644e66497196a2ccea2576724c.sock every 8 connection(s)
I20260924 22:17:15.387439 2517 acceptor_pool.cc:254] collecting diagnostics on the listening RPC socket unix:/tmp/dist-test-task9GGKu8/test-tmp/rpc-test-2b0405644e66497196a2ccea2576724c.sock every 8 connection(s)
I20260924 22:17:15.407253 2527 acceptor_pool.cc:254] collecting diagnostics on the listening RPC socket unix:/tmp/dist-test-task9GGKu8/test-tmp/rpc-test-2b0405644e66497196a2ccea2576724c.sock every 8 connection(s)
I20260924 22:17:15.407882 2528 acceptor_pool.cc:254] collecting diagnostics on the listening RPC socket unix:/tmp/dist-test-task9GGKu8/test-tmp/rpc-test-2b0405644e66497196a2ccea2576724c.sock every 8 connection(s)
I20260924 22:17:15.427107 2538 acceptor_pool.cc:254] collecting diagnostics on the listening RPC socket unix:/tmp/dist-test-task9GGKu8/test-tmp/rpc-test-2b0405644e66497196a2ccea2576724c.sock every 8 connection(s)
I20260924 22:17:15.427834 2539 acceptor_pool.cc:254] collecting diagnostics on the listening RPC socket unix:/tmp/dist-test-task9GGKu8/test-tmp/rpc-test-2b0405644e66497196a2ccea2576724c.sock every 8 connection(s)
I20260924 22:17:15.448194 2549 acceptor_pool.cc:254] collecting diagnostics on the listening RPC socket unix:/tmp/dist-test-task9GGKu8/test-tmp/rpc-test-2b0405644e66497196a2ccea2576724c.sock every 8 connection(s)
I20260924 22:17:15.448895 2550 acceptor_pool.cc:254] collecting diagnostics on the listening RPC socket unix:/tmp/dist-test-task9GGKu8/test-tmp/rpc-test-2b0405644e66497196a2ccea2576724c.sock every 8 connection(s)
[ OK ] Parameters/TestRpc.TestAcceptorPoolStartStop/SSL_UnixSocket (169 ms)
[ RUN ] Parameters/TestRpc.TestCall/SSL_UnixSocket
I20260924 22:17:15.501896 2562 acceptor_pool.cc:254] collecting diagnostics on the listening RPC socket unix:/tmp/dist-test-task9GGKu8/test-tmp/rpc-test-6cfa55ab11fc4e8992aea1854595a3f7.sock every 8 connection(s)
I20260924 22:17:15.503726 2563 acceptor_pool.cc:254] collecting diagnostics on the listening RPC socket unix:/tmp/dist-test-task9GGKu8/test-tmp/rpc-test-6cfa55ab11fc4e8992aea1854595a3f7.sock every 8 connection(s)
I20260924 22:17:15.508884 2479 rpc-test.cc:234] Connecting to unix:/tmp/dist-test-task9GGKu8/test-tmp/rpc-test-6cfa55ab11fc4e8992aea1854595a3f7.sock
W20260924 22:17:15.560531 2559 connection.cc:196] Error closing socket: Network error: TlsSocket::Close: Broken pipe
[ OK ] Parameters/TestRpc.TestCall/SSL_UnixSocket (112 ms)
[ RUN ] Parameters/TestRpc.TestCallWithChainCertAndRootCA/SSL_UnixSocket
I20260924 22:17:15.592103 2587 acceptor_pool.cc:254] collecting diagnostics on the listening RPC socket unix:/tmp/dist-test-task9GGKu8/test-tmp/rpc-test-e8b239d2ac054f149dee03cdd93ed7ca.sock every 8 connection(s)
I20260924 22:17:15.592855 2588 acceptor_pool.cc:254] collecting diagnostics on the listening RPC socket unix:/tmp/dist-test-task9GGKu8/test-tmp/rpc-test-e8b239d2ac054f149dee03cdd93ed7ca.sock every 8 connection(s)
/data0/somelongdirectorytoavoidrpathissues/src/kudu/src/kudu/rpc/rpc-test.cc:303: Failure
Failed
Bad status: Runtime error: could not verify certificate chain (error with cert: subject=CN = localhost, ST = sadfjas, C = AS, emailAddress = sdflkdsajf, O = lskdfjlsad, OU = sldfkja, issuer=C = AS, ST = ASDfkjdhf, L = lskdjf, O = saldfja, OU = skdjf, CN = localhost, emailAddress = sadjflkadsj): : certificate has expired
Google Test trace:
/data0/somelongdirectorytoavoidrpathissues/src/kudu/src/kudu/rpc/rpc-test.cc:300: Connecting to unix:/tmp/dist-test-task9GGKu8/test-tmp/rpc-test-e8b239d2ac054f149dee03cdd93ed7ca.sock
I20260924 22:17:15.613174 2479 test_util.cc:175] -----------------------------------------------
I20260924 22:17:15.613350 2479 test_util.cc:176] Had fatal failures, leaving test files at /tmp/dist-test-task9GGKu8/test-tmp/rpc-test.2.Parameters_TestRpc.TestCallWithChainCertAndRootCA_SSL_UnixSocket.1790288232159579-2479-0
[ FAILED ] Parameters/TestRpc.TestCallWithChainCertAndRootCA/SSL_UnixSocket, where GetParam() = (true, true) (47 ms)
[ RUN ] Parameters/TestRpc.TestCallWithBadPasswordProtectedKey/SSL_UnixSocket
[ OK ] Parameters/TestRpc.TestCallWithBadPasswordProtectedKey/SSL_UnixSocket (31 ms)
[ RUN ] Parameters/TestRpc.TestInvalidMethodCall/SSL_UnixSocket
I20260924 22:17:15.679957 2624 acceptor_pool.cc:254] collecting diagnostics on the listening RPC socket unix:/tmp/dist-test-task9GGKu8/test-tmp/rpc-test-d7e476d3d3bf47b1a146647b955ed897.sock every 8 connection(s)
I20260924 22:17:15.680738 2625 acceptor_pool.cc:254] collecting diagnostics on the listening RPC socket unix:/tmp/dist-test-task9GGKu8/test-tmp/rpc-test-d7e476d3d3bf47b1a146647b955ed897.sock every 8 connection(s)
I20260924 22:17:15.684266 2479 rpc-test.cc:406] Connecting to unix:/tmp/dist-test-task9GGKu8/test-tmp/rpc-test-d7e476d3d3bf47b1a146647b955ed897.sock
[ OK ] Parameters/TestRpc.TestInvalidMethodCall/SSL_UnixSocket (73 ms)
[ RUN ] Parameters/TestRpc.TestHighFDs/SSL_UnixSocket
I20260924 22:17:15.945132 2649 acceptor_pool.cc:254] collecting diagnostics on the listening RPC socket unix:/tmp/dist-test-task9GGKu8/test-tmp/rpc-test-453c9704245340408fc5f199d4ce24cf.sock every 8 connection(s)
I20260924 22:17:15.945942 2650 acceptor_pool.cc:254] collecting diagnostics on the listening RPC socket unix:/tmp/dist-test-task9GGKu8/test-tmp/rpc-test-453c9704245340408fc5f199d4ce24cf.sock every 8 connection(s)
W20260924 22:17:15.980110 2646 connection.cc:196] Error closing socket: Network error: TlsSocket::Close: Broken pipe
[ OK ] Parameters/TestRpc.TestHighFDs/SSL_UnixSocket (273 ms)
[ RUN ] Parameters/TestRpc.TestConnectionAlwaysKeepalive/SSL_UnixSocket
I20260924 22:17:16.024819 2672 acceptor_pool.cc:254] collecting diagnostics on the listening RPC socket unix:/tmp/dist-test-task9GGKu8/test-tmp/rpc-test-02be4a8552ea4d938249ff7df9b71d98.sock every 8 connection(s)
I20260924 22:17:16.025651 2673 acceptor_pool.cc:254] collecting diagnostics on the listening RPC socket unix:/tmp/dist-test-task9GGKu8/test-tmp/rpc-test-02be4a8552ea4d938249ff7df9b71d98.sock every 8 connection(s)
I20260924 22:17:16.028970 2479 rpc-test.cc:532] Connecting to unix:/tmp/dist-test-task9GGKu8/test-tmp/rpc-test-02be4a8552ea4d938249ff7df9b71d98.sock
W20260924 22:17:19.062167 2671 connection.cc:196] Error closing socket: Network error: TlsSocket::Close: Broken pipe
[ OK ] Parameters/TestRpc.TestConnectionAlwaysKeepalive/SSL_UnixSocket (3073 ms)
[ RUN ] Parameters/TestRpc.TestReopenOutboundConnections/SSL_UnixSocket
I20260924 22:17:19.081264 2695 acceptor_pool.cc:254] collecting diagnostics on the listening RPC socket unix:/tmp/dist-test-task9GGKu8/test-tmp/rpc-test-74efeff8b67f403d8ea434bc76f0155c.sock every 8 connection(s)
I20260924 22:17:19.081965 2696 acceptor_pool.cc:254] collecting diagnostics on the listening RPC socket unix:/tmp/dist-test-task9GGKu8/test-tmp/rpc-test-74efeff8b67f403d8ea434bc76f0155c.sock every 8 connection(s)
I20260924 22:17:19.085471 2479 rpc-test.cc:658] Connecting to unix:/tmp/dist-test-task9GGKu8/test-tmp/rpc-test-74efeff8b67f403d8ea434bc76f0155c.sock
W20260924 22:17:19.112772 2694 connection.cc:196] Error closing socket: Network error: TlsSocket::Close: Broken pipe
W20260924 22:17:19.122104 2694 connection.cc:196] Error closing socket: Network error: TlsSocket::Close: Broken pipe
W20260924 22:17:19.136838 2694 connection.cc:196] Error closing socket: Network error: TlsSocket::Close: Broken pipe
W20260924 22:17:19.150830 2694 connection.cc:196] Error closing socket: Network error: TlsSocket::Close: Broken pipe
W20260924 22:17:19.164692 2694 connection.cc:196] Error closing socket: Network error: TlsSocket::Close: Broken pipe
W20260924 22:17:19.178668 2694 connection.cc:196] Error closing socket: Network error: TlsSocket::Close: Broken pipe
W20260924 22:17:19.189736 2694 connection.cc:196] Error closing socket: Network error: TlsSocket::Close: Broken pipe
W20260924 22:17:19.200742 2694 connection.cc:196] Error closing socket: Network error: TlsSocket::Close: Broken pipe
W20260924 22:17:19.210731 2694 connection.cc:196] Error closing socket: Network error: TlsSocket::Close: Broken pipe
W20260924 22:17:19.220779 2694 connection.cc:196] Error closing socket: Network error: TlsSocket::Close: Broken pipe
W20260924 22:17:19.232031 2694 connection.cc:196] Error closing socket: Network error: TlsSocket::Close: Broken pipe
W20260924 22:17:19.243902 2694 connection.cc:196] Error closing socket: Network error: TlsSocket::Close: Broken pipe
W20260924 22:17:19.255020 2694 connection.cc:196] Error closing socket: Network error: TlsSocket::Close: Broken pipe
W20260924 22:17:19.266499 2694 connection.cc:196] Error closing socket: Network error: TlsSocket::Close: Broken pipe
W20260924 22:17:19.266615 2695 acceptor_pool.cc:285] unable to collect diagnostics on RPC socket unix:/tmp/dist-test-task9GGKu8/test-tmp/rpc-test-74efeff8b67f403d8ea434bc76f0155c.sock: Not implemented: netlink diagnostics is currently supported only on IPv4 TCP sockets
W20260924 22:17:19.277304 2694 connection.cc:196] Error closing socket: Network error: TlsSocket::Close: Broken pipe
W20260924 22:17:19.289153 2694 connection.cc:196] Error closing socket: Network error: TlsSocket::Close: Broken pipe
W20260924 22:17:19.300500 2694 connection.cc:196] Error closing socket: Network error: TlsSocket::Close: Broken pipe
W20260924 22:17:19.311301 2694 connection.cc:196] Error closing socket: Network error: TlsSocket::Close: Broken pipe
W20260924 22:17:19.322818 2694 connection.cc:196] Error closing socket: Network error: TlsSocket::Close: Broken pipe
W20260924 22:17:19.333626 2694 connection.cc:196] Error closing socket: Network error: TlsSocket::Close: Broken pipe
W20260924 22:17:19.344659 2694 connection.cc:196] Error closing socket: Network error: TlsSocket::Close: Broken pipe
W20260924 22:17:19.355923 2694 connection.cc:196] Error closing socket: Network error: TlsSocket::Close: Broken pipe
W20260924 22:17:19.366925 2694 connection.cc:196] Error closing socket: Network error: TlsSocket::Close: Broken pipe
W20260924 22:17:19.377935 2694 connection.cc:196] Error closing socket: Network error: TlsSocket::Close: Broken pipe
W20260924 22:17:19.388797 2694 connection.cc:196] Error closing socket: Network error: TlsSocket::Close: Broken pipe
W20260924 22:17:19.398168 2694 connection.cc:196] Error closing socket: Network error: TlsSocket::Close: Broken pipe
W20260924 22:17:19.407692 2694 connection.cc:196] Error closing socket: Network error: TlsSocket::Close: Broken pipe
W20260924 22:17:19.416716 2694 connection.cc:196] Error closing socket: Network error: TlsSocket::Close: Broken pipe
W20260924 22:17:19.425573 2694 connection.cc:196] Error closing socket: Network error: TlsSocket::Close: Broken pipe
W20260924 22:17:19.434031 2694 connection.cc:196] Error closing socket: Network error: TlsSocket::Close: Broken pipe
W20260924 22:17:19.442430 2694 connection.cc:196] Error closing socket: Network error: TlsSocket::Close: Broken pipe
W20260924 22:17:19.453351 2694 connection.cc:196] Error closing socket: Network error: TlsSocket::Close: Broken pipe
[ OK ] Parameters/TestRpc.TestReopenOutboundConnections/SSL_UnixSocket (391 ms)
[ RUN ] Parameters/TestRpc.TestConnectionNetworkPlane/SSL_UnixSocket
I20260924 22:17:19.492363 2718 acceptor_pool.cc:254] collecting diagnostics on the listening RPC socket unix:/tmp/dist-test-task9GGKu8/test-tmp/rpc-test-8fd82768ae1241648e8471ae66cfc34e.sock every 8 connection(s)
I20260924 22:17:19.493109 2719 acceptor_pool.cc:254] collecting diagnostics on the listening RPC socket unix:/tmp/dist-test-task9GGKu8/test-tmp/rpc-test-8fd82768ae1241648e8471ae66cfc34e.sock every 8 connection(s)
I20260924 22:17:19.496220 2479 rpc-test.cc:772] Connecting to unix:/tmp/dist-test-task9GGKu8/test-tmp/rpc-test-8fd82768ae1241648e8471ae66cfc34e.sock
W20260924 22:17:19.585112 2717 connection.cc:196] Error closing socket: Network error: TlsSocket::Close: Broken pipe
W20260924 22:17:19.587322 2717 connection.cc:196] Error closing socket: Network error: TlsSocket::Close: Broken pipe
[ OK ] Parameters/TestRpc.TestConnectionNetworkPlane/SSL_UnixSocket (131 ms)
[ RUN ] Parameters/TestRpc.TestTCPKeepalive/SSL_UnixSocket
I20260924 22:17:19.606298 2743 acceptor_pool.cc:254] collecting diagnostics on the listening RPC socket unix:/tmp/dist-test-task9GGKu8/test-tmp/rpc-test-f93eefa56c444509a44772afea0a651d.sock every 8 connection(s)
I20260924 22:17:19.607046 2744 acceptor_pool.cc:254] collecting diagnostics on the listening RPC socket unix:/tmp/dist-test-task9GGKu8/test-tmp/rpc-test-f93eefa56c444509a44772afea0a651d.sock every 8 connection(s)
I20260924 22:17:19.640316 2747 rpc-test-base.h:222] got call: sleep_micros: 8000000 deferred: true
I20260924 22:17:27.644340 2747 rpcz_store.cc:275] Call kudu.rpc.GenericCalculatorService.Sleep from unix:<unnamed> (request call id 0) took 8004 ms. Trace:
I20260924 22:17:27.644807 2747 rpcz_store.cc:276] 0924 22:17:19.640159 (+ 0us) service_pool.cc:170] Inserting onto call queue
0924 22:17:19.640264 (+ 105us) service_pool.cc:227] Handling call
0924 22:17:27.644160 (+8003896us) inbound_call.cc:173] Queueing success response
Metrics: {}
[ OK ] Parameters/TestRpc.TestTCPKeepalive/SSL_UnixSocket (8068 ms)
[ RUN ] Parameters/TestRpc.TestMaxSmallSidecars/SSL_UnixSocket
I20260924 22:17:27.690660 2769 acceptor_pool.cc:254] collecting diagnostics on the listening RPC socket unix:/tmp/dist-test-task9GGKu8/test-tmp/rpc-test-1bf6f3c9e5aa4d8c8e51a3244aafb249.sock every 8 connection(s)
I20260924 22:17:27.691463 2770 acceptor_pool.cc:254] collecting diagnostics on the listening RPC socket unix:/tmp/dist-test-task9GGKu8/test-tmp/rpc-test-1bf6f3c9e5aa4d8c8e51a3244aafb249.sock every 8 connection(s)
W20260924 22:17:27.860980 2766 connection.cc:196] Error closing socket: Network error: TlsSocket::Close: Broken pipe
[ OK ] Parameters/TestRpc.TestMaxSmallSidecars/SSL_UnixSocket (207 ms)
[ RUN ] Parameters/TestRpc.TestCallTimeout/SSL_UnixSocket
I20260924 22:17:27.889902 2794 acceptor_pool.cc:254] collecting diagnostics on the listening RPC socket unix:/tmp/dist-test-task9GGKu8/test-tmp/rpc-test-bdfe6a36b8ea498f9eba9dea08d72438.sock every 8 connection(s)
I20260924 22:17:27.890668 2795 acceptor_pool.cc:254] collecting diagnostics on the listening RPC socket unix:/tmp/dist-test-task9GGKu8/test-tmp/rpc-test-bdfe6a36b8ea498f9eba9dea08d72438.sock every 8 connection(s)
I20260924 22:17:27.943657 2479 rpc-test-base.h:595] status: Timed out: connection negotiation to unix:/tmp/dist-test-task9GGKu8/test-tmp/rpc-test-bdfe6a36b8ea498f9eba9dea08d72438.sock for RPC Sleep timed out after 0.000s (ON_OUTBOUND_QUEUE), seconds elapsed: 0.00244507
I20260924 22:17:27.951217 2798 rpc-test-base.h:222] got call: sleep_micros: 700000
I20260924 22:17:28.145139 2479 rpc-test-base.h:595] status: Timed out: Sleep RPC to unix:/tmp/dist-test-task9GGKu8/test-tmp/rpc-test-bdfe6a36b8ea498f9eba9dea08d72438.sock timed out after 0.200s (SENT), seconds elapsed: 0.201155
I20260924 22:17:28.146653 2797 rpc-test-base.h:222] got call: sleep_micros: 2000000
W20260924 22:17:28.651890 2798 rpcz_store.cc:267] Call kudu.rpc.GenericCalculatorService.Sleep from unix:<unnamed> (request call id 1) took 700 ms (client timeout 200 ms). Trace:
W20260924 22:17:28.652293 2798 rpcz_store.cc:269] 0924 22:17:27.951043 (+ 0us) service_pool.cc:170] Inserting onto call queue
0924 22:17:27.951175 (+ 132us) service_pool.cc:227] Handling call
0924 22:17:28.651831 (+700656us) inbound_call.cc:173] Queueing success response
Metrics: {}
I20260924 22:17:29.647291 2479 rpc-test-base.h:595] status: Timed out: Sleep RPC to unix:/tmp/dist-test-task9GGKu8/test-tmp/rpc-test-bdfe6a36b8ea498f9eba9dea08d72438.sock timed out after 1.500s (SENT), seconds elapsed: 1.50184
W20260924 22:17:30.147174 2797 rpcz_store.cc:267] Call kudu.rpc.GenericCalculatorService.Sleep from unix:<unnamed> (request call id 2) took 2000 ms (client timeout 1500 ms). Trace:
W20260924 22:17:30.147496 2797 rpcz_store.cc:269] 0924 22:17:28.146366 (+ 0us) service_pool.cc:170] Inserting onto call queue
0924 22:17:28.146503 (+ 137us) service_pool.cc:227] Handling call
0924 22:17:30.147122 (+2000619us) inbound_call.cc:173] Queueing success response
Metrics: {}
W20260924 22:17:30.147991 2791 connection.cc:441] server connection from unix:<unnamed> torn down before Call kudu.rpc.GenericCalculatorService.Sleep from unix:<unnamed> (request call id 2) could send its response
[ OK ] Parameters/TestRpc.TestCallTimeout/SSL_UnixSocket (2286 ms)
[ RUN ] Parameters/TestRpc.TestServerShutsDown/SSL_UnixSocket
I20260924 22:17:30.155061 2479 rpc-test.cc:1125] Connecting to 0.0.0.0:45159
W20260924 22:17:30.165123 2811 negotiation.cc:337] Failed RPC negotiation. Trace:
0924 22:17:30.163197 (+ 0us) reactor.cc:625] Submitting negotiation task for client connection to 0.0.0.0:45159 (local address 127.0.0.1:57332)
0924 22:17:30.163971 (+ 774us) negotiation.cc:107] Waiting for socket to connect
0924 22:17:30.164007 (+ 36us) client_negotiation.cc:174] Beginning negotiation
0924 22:17:30.164235 (+ 228us) client_negotiation.cc:252] Sending NEGOTIATE NegotiatePB request
0924 22:17:30.164473 (+ 238us) negotiation.cc:327] Negotiation complete: Network error: Client connection negotiation failed: client connection to 0.0.0.0:45159: BlockingWrite error: write error: Broken pipe (error 32)
Metrics: {"client-negotiator.queue_time_us":260}
[ OK ] Parameters/TestRpc.TestServerShutsDown/SSL_UnixSocket (14 ms)
[ RUN ] Parameters/TestRpc.TimedOutOnResponseMetric/SSL_UnixSocket
I20260924 22:17:30.214789 2828 acceptor_pool.cc:254] collecting diagnostics on the listening RPC socket unix:/tmp/dist-test-task9GGKu8/test-tmp/rpc-test-b84d48aa2e5f4ca781a510dba454fc89.sock every 8 connection(s)
I20260924 22:17:30.215493 2829 acceptor_pool.cc:254] collecting diagnostics on the listening RPC socket unix:/tmp/dist-test-task9GGKu8/test-tmp/rpc-test-b84d48aa2e5f4ca781a510dba454fc89.sock every 8 connection(s)
W20260924 22:17:30.451834 2832 rpcz_store.cc:267] Call kudu.rpc_test.CalculatorService.Sleep from unix:<unnamed> (request call id 3) took 50 ms (client timeout 25 ms). Trace:
W20260924 22:17:30.452168 2832 rpcz_store.cc:269] 0924 22:17:30.401239 (+ 0us) service_pool.cc:170] Inserting onto call queue
0924 22:17:30.401353 (+ 114us) service_pool.cc:227] Handling call
0924 22:17:30.451758 (+ 50405us) inbound_call.cc:173] Queueing success response
Related trace 'test_child':
Metrics: {"test_sleep_us":50000,"child_traces":[["test_child",{"related_trace_metric":1}]]}
W20260924 22:17:30.511412 2832 rpcz_store.cc:267] Call kudu.rpc_test.CalculatorService.Sleep from unix:<unnamed> (request call id 4) took 50 ms (client timeout 50 ms). Trace:
W20260924 22:17:30.511718 2832 rpcz_store.cc:269] 0924 22:17:30.460872 (+ 0us) service_pool.cc:170] Inserting onto call queue
0924 22:17:30.461029 (+ 157us) service_pool.cc:227] Handling call
0924 22:17:30.511353 (+ 50324us) inbound_call.cc:173] Queueing success response
Related trace 'test_child':
Metrics: {"test_sleep_us":50000,"child_traces":[["test_child",{"related_trace_metric":1}]]}
[ OK ] Parameters/TestRpc.TimedOutOnResponseMetric/SSL_UnixSocket (351 ms)
[ RUN ] Parameters/TestRpc.AcceptorDispatchingTimesMetric/SSL_UnixSocket
I20260924 22:17:30.530776 2853 acceptor_pool.cc:254] collecting diagnostics on the listening RPC socket 0.0.0.0:36555 every 8 connection(s)
I20260924 22:17:30.531515 2854 acceptor_pool.cc:254] collecting diagnostics on the listening RPC socket 0.0.0.0:36555 every 8 connection(s)
W20260924 22:17:30.536243 2849 negotiation.cc:337] Failed RPC negotiation. Trace:
0924 22:17:30.535169 (+ 0us) reactor.cc:625] Submitting negotiation task for server connection from 127.0.0.1:56634 (local address 127.0.0.1:36555)
0924 22:17:30.535583 (+ 414us) server_negotiation.cc:206] Beginning negotiation
0924 22:17:30.535599 (+ 16us) server_negotiation.cc:399] Waiting for connection header
0924 22:17:30.535820 (+ 221us) negotiation.cc:327] Negotiation complete: Network error: Server connection negotiation failed: server connection from 127.0.0.1:56634: BlockingRecv error: recv got EOF from 127.0.0.1:56634 (error 108)
Metrics: {"server-negotiator.queue_time_us":113}
[ OK ] Parameters/TestRpc.AcceptorDispatchingTimesMetric/SSL_UnixSocket (21 ms)
[ RUN ] Parameters/TestRpc.TestRpcCallbackDestroysMessenger/SSL_UnixSocket
[ OK ] Parameters/TestRpc.TestRpcCallbackDestroysMessenger/SSL_UnixSocket (35 ms)
[ RUN ] Parameters/TestRpc.TestApplicationFeatureFlag/SSL_UnixSocket
I20260924 22:17:30.593153 2878 acceptor_pool.cc:254] collecting diagnostics on the listening RPC socket unix:/tmp/dist-test-task9GGKu8/test-tmp/rpc-test-e265819978f24192a02a33d067add45e.sock every 8 connection(s)
I20260924 22:17:30.593858 2879 acceptor_pool.cc:254] collecting diagnostics on the listening RPC socket unix:/tmp/dist-test-task9GGKu8/test-tmp/rpc-test-e265819978f24192a02a33d067add45e.sock every 8 connection(s)
W20260924 22:17:30.629312 2875 messenger.cc:357] Unable to handle RPC call: Not implemented: call requires unsupported application feature flags: 99
W20260924 22:17:30.633832 2875 connection.cc:196] Error closing socket: Network error: TlsSocket::Close: Broken pipe
[ OK ] Parameters/TestRpc.TestApplicationFeatureFlag/SSL_UnixSocket (60 ms)
[ RUN ] Parameters/TestRpc.TestCancellation/SSL_UnixSocket
I20260924 22:17:30.670150 2903 acceptor_pool.cc:254] collecting diagnostics on the listening RPC socket unix:/tmp/dist-test-task9GGKu8/test-tmp/rpc-test-bbe94839fa57498a961a578e40a22760.sock every 8 connection(s)
I20260924 22:17:30.670848 2904 acceptor_pool.cc:254] collecting diagnostics on the listening RPC socket unix:/tmp/dist-test-task9GGKu8/test-tmp/rpc-test-bbe94839fa57498a961a578e40a22760.sock every 8 connection(s)
I20260924 22:17:30.673887 2479 rpc-test.cc:1648] Connecting to unix:/tmp/dist-test-task9GGKu8/test-tmp/rpc-test-bbe94839fa57498a961a578e40a22760.sock
I20260924 22:17:30.777680 2479 rpc-test-base.h:595] status: Aborted: Sleep RPC to unix:/tmp/dist-test-task9GGKu8/test-tmp/rpc-test-bbe94839fa57498a961a578e40a22760.sock is cancelled in state READY, seconds elapsed: 0.000368021
I20260924 22:17:30.957435 2479 rpc-test-base.h:595] status: Aborted: Sleep RPC to unix:/tmp/dist-test-task9GGKu8/test-tmp/rpc-test-bbe94839fa57498a961a578e40a22760.sock is cancelled in state SENT, seconds elapsed: 0.000852915
I20260924 22:17:30.957813 2906 rpc-test-base.h:222] got call: sleep_micros: 510000
I20260924 22:17:31.164654 2479 rpc-test-base.h:595] status: Aborted: Sleep RPC to unix:/tmp/dist-test-task9GGKu8/test-tmp/rpc-test-bbe94839fa57498a961a578e40a22760.sock is cancelled in state SENT, seconds elapsed: 0.000760201
I20260924 22:17:31.165009 2905 rpc-test-base.h:222] got call: sleep_micros: 510000
I20260924 22:17:31.339967 2479 rpc-test-base.h:595] status: Aborted: Sleep RPC to unix:/tmp/dist-test-task9GGKu8/test-tmp/rpc-test-bbe94839fa57498a961a578e40a22760.sock is cancelled in state SENT, seconds elapsed: 0.000879546
W20260924 22:17:31.352170 2907 rpcz_store.cc:267] Call kudu.rpc.GenericCalculatorService.Sleep from unix:<unnamed> (request call id 11) took 12 ms (client timeout 10 ms). Trace:
W20260924 22:17:31.352533 2907 rpcz_store.cc:269] 0924 22:17:31.339964 (+ 0us) service_pool.cc:170] Inserting onto call queue
0924 22:17:31.351865 (+ 11901us) service_pool.cc:214] Skipping call since client already timed out
0924 22:17:31.351953 (+ 88us) inbound_call.cc:173] Queueing failure response
Metrics: {}
I20260924 22:17:31.353142 2907 rpc-test-base.h:222] got call: sleep_micros: 1500000
W20260924 22:17:31.468429 2906 rpcz_store.cc:267] Call kudu.rpc.GenericCalculatorService.Sleep from unix:<unnamed> (request call id 3) took 510 ms (client timeout 10 ms). Trace:
W20260924 22:17:31.468770 2906 rpcz_store.cc:269] 0924 22:17:30.957581 (+ 0us) service_pool.cc:170] Inserting onto call queue
0924 22:17:30.957763 (+ 182us) service_pool.cc:227] Handling call
0924 22:17:31.468367 (+510604us) inbound_call.cc:173] Queueing success response
Metrics: {}
W20260924 22:17:31.675592 2905 rpcz_store.cc:267] Call kudu.rpc.GenericCalculatorService.Sleep from unix:<unnamed> (request call id 7) took 510 ms (client timeout 10 ms). Trace:
W20260924 22:17:31.675930 2905 rpcz_store.cc:269] 0924 22:17:31.164788 (+ 0us) service_pool.cc:170] Inserting onto call queue
0924 22:17:31.164940 (+ 152us) service_pool.cc:227] Handling call
0924 22:17:31.675540 (+510600us) inbound_call.cc:173] Queueing success response
Metrics: {}
I20260924 22:17:32.341385 2479 rpc-test-base.h:595] status: Timed out: Sleep RPC to unix:/tmp/dist-test-task9GGKu8/test-tmp/rpc-test-bbe94839fa57498a961a578e40a22760.sock timed out after 1.000s (SENT), seconds elapsed: 1.00099
I20260924 22:17:32.343369 2905 rpc-test-base.h:222] got call: sleep_micros: 1500000
W20260924 22:17:32.853816 2907 rpcz_store.cc:267] Call kudu.rpc.GenericCalculatorService.Sleep from unix:<unnamed> (request call id 12) took 1512 ms (client timeout 1000 ms). Trace:
W20260924 22:17:32.854172 2907 rpcz_store.cc:269] 0924 22:17:31.341071 (+ 0us) service_pool.cc:170] Inserting onto call queue
0924 22:17:31.353110 (+ 12039us) service_pool.cc:227] Handling call
0924 22:17:32.853688 (+1500578us) inbound_call.cc:173] Queueing success response
Metrics: {}
I20260924 22:17:33.343523 2479 rpc-test-base.h:595] status: Timed out: Sleep RPC to unix:/tmp/dist-test-task9GGKu8/test-tmp/rpc-test-bbe94839fa57498a961a578e40a22760.sock timed out after 1.000s (SENT), seconds elapsed: 1.00156
W20260924 22:17:33.345108 2900 messenger.cc:357] Unable to handle RPC call: Not implemented: call requires unsupported application feature flags: 99, 1
W20260924 22:17:33.346586 2900 messenger.cc:357] Unable to handle RPC call: Not implemented: call requires unsupported application feature flags: 99, 1
W20260924 22:17:33.557407 2900 connection.cc:196] Error closing socket: Network error: TlsSocket::Close: Broken pipe
W20260924 22:17:33.843906 2905 rpcz_store.cc:267] Call kudu.rpc.GenericCalculatorService.Sleep from unix:<unnamed> (request call id 13) took 1501 ms (client timeout 1000 ms). Trace:
W20260924 22:17:33.844215 2905 rpcz_store.cc:269] 0924 22:17:32.343052 (+ 0us) service_pool.cc:170] Inserting onto call queue
0924 22:17:32.343260 (+ 208us) service_pool.cc:227] Handling call
0924 22:17:33.843855 (+1500595us) inbound_call.cc:173] Queueing success response
Metrics: {}
W20260924 22:17:33.844687 2900 connection.cc:441] server connection from unix:<unnamed> torn down before Call kudu.rpc.GenericCalculatorService.Sleep from unix:<unnamed> (request call id 13) could send its response
[ OK ] Parameters/TestRpc.TestCancellation/SSL_UnixSocket (3214 ms)
[ RUN ] Parameters/TestRpc.TestCancellationMultiThreads/SSL_UnixSocket
I20260924 22:17:33.890430 2929 acceptor_pool.cc:254] collecting diagnostics on the listening RPC socket unix:/tmp/dist-test-task9GGKu8/test-tmp/rpc-test-c3b85c276fad407ead668bcb93415672.sock every 8 connection(s)
I20260924 22:17:33.891315 2930 acceptor_pool.cc:254] collecting diagnostics on the listening RPC socket unix:/tmp/dist-test-task9GGKu8/test-tmp/rpc-test-c3b85c276fad407ead668bcb93415672.sock every 8 connection(s)
I20260924 22:17:33.894544 2479 rpc-test.cc:1808] Connecting to unix:/tmp/dist-test-task9GGKu8/test-tmp/rpc-test-c3b85c276fad407ead668bcb93415672.sock
I20260924 22:17:34.035252 2943 test_util.cc:268] Using random seed: -143825724
I20260924 22:17:34.036434 2944 test_util.cc:268] Using random seed: -143824453
I20260924 22:17:34.037907 2945 test_util.cc:268] Using random seed: -143822987
I20260924 22:17:34.039722 2946 test_util.cc:268] Using random seed: -143821341
I20260924 22:17:34.041963 2947 test_util.cc:268] Using random seed: -143819066
I20260924 22:17:34.043586 2948 test_util.cc:268] Using random seed: -143817482
I20260924 22:17:34.045738 2949 test_util.cc:268] Using random seed: -143815275
I20260924 22:17:34.047968 2950 test_util.cc:268] Using random seed: -143813515
I20260924 22:17:34.049755 2951 test_util.cc:268] Using random seed: -143811645
I20260924 22:17:34.051435 2952 test_util.cc:268] Using random seed: -143809607
I20260924 22:17:34.053251 2953 test_util.cc:268] Using random seed: -143807773
I20260924 22:17:34.055609 2954 test_util.cc:268] Using random seed: -143805438
I20260924 22:17:34.057551 2955 test_util.cc:268] Using random seed: -143803994
I20260924 22:17:34.059482 2956 test_util.cc:268] Using random seed: -143801988
I20260924 22:17:34.061877 2957 test_util.cc:268] Using random seed: -143799148
I20260924 22:17:34.063737 2958 test_util.cc:268] Using random seed: -143797243
I20260924 22:17:34.065618 2959 test_util.cc:268] Using random seed: -143795388
I20260924 22:17:34.067627 2960 test_util.cc:268] Using random seed: -143793394
I20260924 22:17:34.069617 2961 test_util.cc:268] Using random seed: -143791880
I20260924 22:17:34.071578 2962 test_util.cc:268] Using random seed: -143789446
I20260924 22:17:34.073589 2963 test_util.cc:268] Using random seed: -143787940
I20260924 22:17:34.074978 2964 test_util.cc:268] Using random seed: -143786029
I20260924 22:17:34.076959 2965 test_util.cc:268] Using random seed: -143784026
I20260924 22:17:34.078858 2966 test_util.cc:268] Using random seed: -143782154
I20260924 22:17:34.081113 2967 test_util.cc:268] Using random seed: -143780060
I20260924 22:17:34.083146 2968 test_util.cc:268] Using random seed: -143778320
I20260924 22:17:34.084607 2969 test_util.cc:268] Using random seed: -143776438
I20260924 22:17:34.086560 2970 test_util.cc:268] Using random seed: -143774478
I20260924 22:17:34.088613 2971 test_util.cc:268] Using random seed: -143772435
I20260924 22:17:34.090535 2972 test_util.cc:268] Using random seed: -143770526
W20260924 22:17:53.917243 2926 connection.cc:196] Error closing socket: Network error: TlsSocket::Close: Broken pipe
[ OK ] Parameters/TestRpc.TestCancellationMultiThreads/SSL_UnixSocket (20082 ms)
[ RUN ] Parameters/TestRpc.TestCallId/SSL_UnixSocket
I20260924 22:17:53.965659 2986 acceptor_pool.cc:254] collecting diagnostics on the listening RPC socket unix:/tmp/dist-test-task9GGKu8/test-tmp/rpc-test-2381b54e30c24204ac3a15b12de815f5.sock every 8 connection(s)
I20260924 22:17:53.966552 2987 acceptor_pool.cc:254] collecting diagnostics on the listening RPC socket unix:/tmp/dist-test-task9GGKu8/test-tmp/rpc-test-2381b54e30c24204ac3a15b12de815f5.sock every 8 connection(s)
[ OK ] Parameters/TestRpc.TestCallId/SSL_UnixSocket (90 ms)
[----------] 20 tests from Parameters/TestRpc (38742 ms total)
[----------] Global test environment tear-down
[==========] 21 tests from 2 test suites ran. (41812 ms total)
[ PASSED ] 20 tests.
[ FAILED ] 1 test, listed below:
[ FAILED ] Parameters/TestRpc.TestCallWithChainCertAndRootCA/SSL_UnixSocket, where GetParam() = (true, true)
1 FAILED TEST
I20260924 22:17:54.043162 2479 logging.cc:424] LogThrottler /data0/somelongdirectorytoavoidrpathissues/src/kudu/src/kudu/rpc/acceptor_pool.cc:285: suppressed but not reported on 3 messages since previous log ~34 seconds ago