Diagnosed failure

Parameters/TestRpc.TestCallWithChainCertAndRootCA/SSL_TCP: /data0/somelongdirectorytoavoidrpathissues/src/kudu/src/kudu/rpc/rpc-test.cc:303: Failure
Failed
Bad status: Runtime error: could not verify certificate chain (error with cert: subject=CN = localhost, ST = sadfjas, C = AS, emailAddress = sdflkdsajf, O = lskdfjlsad, OU = sldfkja, issuer=C = AS, ST = ASDfkjdhf, L = lskdjf, O = saldfja, OU = skdjf, CN = localhost, emailAddress = sadjflkadsj): : certificate has expired
Google Test trace:
/data0/somelongdirectorytoavoidrpathissues/src/kudu/src/kudu/rpc/rpc-test.cc:300: Connecting to 0.0.0.0:41343
I20260929 21:42:43.800733  1815 test_util.cc:175] -----------------------------------------------
I20260929 21:42:43.800920  1815 test_util.cc:176] Had fatal failures, leaving test files at /tmp/dist-test-taskZS1Tan/test-tmp/rpc-test.1.Parameters_TestRpc.TestCallWithChainCertAndRootCA_SSL_TCP.1790718162405644-1815-0

Full log

Note: This is test shard 2 of 8.
[==========] Running 21 tests from 2 test suites.
[----------] Global test environment set-up.
[----------] 1 test from TestRpc
[ RUN      ] TestRpc.TestMethodsByName
[       OK ] TestRpc.TestMethodsByName (6 ms)
[----------] 1 test from TestRpc (6 ms total)

[----------] 20 tests from Parameters/TestRpc
[ RUN      ] Parameters/TestRpc.TestAcceptorPoolStartStop/SSL_TCP
WARNING: Logging before InitGoogleLogging() is written to STDERR
I20260929 21:42:42.512454  1830 acceptor_pool.cc:254] collecting diagnostics on the listening RPC socket 0.0.0.0:40689 every 8 connection(s)
I20260929 21:42:42.513886  1831 acceptor_pool.cc:254] collecting diagnostics on the listening RPC socket 0.0.0.0:40689 every 8 connection(s)
I20260929 21:42:43.590092  1842 acceptor_pool.cc:254] collecting diagnostics on the listening RPC socket 0.0.0.0:33803 every 8 connection(s)
I20260929 21:42:43.591420  1843 acceptor_pool.cc:254] collecting diagnostics on the listening RPC socket 0.0.0.0:33803 every 8 connection(s)
I20260929 21:42:43.609736  1853 acceptor_pool.cc:254] collecting diagnostics on the listening RPC socket 0.0.0.0:37315 every 8 connection(s)
I20260929 21:42:43.610966  1854 acceptor_pool.cc:254] collecting diagnostics on the listening RPC socket 0.0.0.0:37315 every 8 connection(s)
I20260929 21:42:43.633579  1864 acceptor_pool.cc:254] collecting diagnostics on the listening RPC socket 0.0.0.0:43125 every 8 connection(s)
I20260929 21:42:43.634213  1865 acceptor_pool.cc:254] collecting diagnostics on the listening RPC socket 0.0.0.0:43125 every 8 connection(s)
I20260929 21:42:43.660502  1875 acceptor_pool.cc:254] collecting diagnostics on the listening RPC socket 0.0.0.0:43837 every 8 connection(s)
I20260929 21:42:43.661185  1876 acceptor_pool.cc:254] collecting diagnostics on the listening RPC socket 0.0.0.0:43837 every 8 connection(s)
[       OK ] Parameters/TestRpc.TestAcceptorPoolStartStop/SSL_TCP (1197 ms)
[ RUN      ] Parameters/TestRpc.TestCall/SSL_TCP
I20260929 21:42:43.683017  1888 acceptor_pool.cc:254] collecting diagnostics on the listening RPC socket 0.0.0.0:34149 every 8 connection(s)
I20260929 21:42:43.684896  1889 acceptor_pool.cc:254] collecting diagnostics on the listening RPC socket 0.0.0.0:34149 every 8 connection(s)
I20260929 21:42:43.689567  1815 rpc-test.cc:234] Connecting to 0.0.0.0:34149
[       OK ] Parameters/TestRpc.TestCall/SSL_TCP (89 ms)
[ RUN      ] Parameters/TestRpc.TestCallWithChainCertAndRootCA/SSL_TCP
I20260929 21:42:43.781106  1913 acceptor_pool.cc:254] collecting diagnostics on the listening RPC socket 0.0.0.0:41343 every 8 connection(s)
I20260929 21:42:43.781823  1914 acceptor_pool.cc:254] collecting diagnostics on the listening RPC socket 0.0.0.0:41343 every 8 connection(s)
/data0/somelongdirectorytoavoidrpathissues/src/kudu/src/kudu/rpc/rpc-test.cc:303: Failure
Failed
Bad status: Runtime error: could not verify certificate chain (error with cert: subject=CN = localhost, ST = sadfjas, C = AS, emailAddress = sdflkdsajf, O = lskdfjlsad, OU = sldfkja, issuer=C = AS, ST = ASDfkjdhf, L = lskdjf, O = saldfja, OU = skdjf, CN = localhost, emailAddress = sadjflkadsj): : certificate has expired
Google Test trace:
/data0/somelongdirectorytoavoidrpathissues/src/kudu/src/kudu/rpc/rpc-test.cc:300: Connecting to 0.0.0.0:41343
I20260929 21:42:43.800733  1815 test_util.cc:175] -----------------------------------------------
I20260929 21:42:43.800920  1815 test_util.cc:176] Had fatal failures, leaving test files at /tmp/dist-test-taskZS1Tan/test-tmp/rpc-test.1.Parameters_TestRpc.TestCallWithChainCertAndRootCA_SSL_TCP.1790718162405644-1815-0
[  FAILED  ] Parameters/TestRpc.TestCallWithChainCertAndRootCA/SSL_TCP, where GetParam() = (true, false) (46 ms)
[ RUN      ] Parameters/TestRpc.TestCallWithBadPasswordProtectedKey/SSL_TCP
[       OK ] Parameters/TestRpc.TestCallWithBadPasswordProtectedKey/SSL_TCP (30 ms)
[ RUN      ] Parameters/TestRpc.TestInvalidMethodCall/SSL_TCP
I20260929 21:42:43.855332  1950 acceptor_pool.cc:254] collecting diagnostics on the listening RPC socket 0.0.0.0:40701 every 8 connection(s)
I20260929 21:42:43.856046  1951 acceptor_pool.cc:254] collecting diagnostics on the listening RPC socket 0.0.0.0:40701 every 8 connection(s)
I20260929 21:42:43.859289  1815 rpc-test.cc:406] Connecting to 0.0.0.0:40701
[       OK ] Parameters/TestRpc.TestInvalidMethodCall/SSL_TCP (61 ms)
[ RUN      ] Parameters/TestRpc.TestHighFDs/SSL_TCP
I20260929 21:42:44.124416  1975 acceptor_pool.cc:254] collecting diagnostics on the listening RPC socket 0.0.0.0:43339 every 8 connection(s)
I20260929 21:42:44.125077  1976 acceptor_pool.cc:254] collecting diagnostics on the listening RPC socket 0.0.0.0:43339 every 8 connection(s)
[       OK ] Parameters/TestRpc.TestHighFDs/SSL_TCP (281 ms)
[ RUN      ] Parameters/TestRpc.TestConnectionAlwaysKeepalive/SSL_TCP
I20260929 21:42:44.196484  1998 acceptor_pool.cc:254] collecting diagnostics on the listening RPC socket 0.0.0.0:35327 every 8 connection(s)
I20260929 21:42:44.197145  1999 acceptor_pool.cc:254] collecting diagnostics on the listening RPC socket 0.0.0.0:35327 every 8 connection(s)
I20260929 21:42:44.200210  1815 rpc-test.cc:532] Connecting to 0.0.0.0:35327
[       OK ] Parameters/TestRpc.TestConnectionAlwaysKeepalive/SSL_TCP (3059 ms)
[ RUN      ] Parameters/TestRpc.TestReopenOutboundConnections/SSL_TCP
I20260929 21:42:47.256503  2021 acceptor_pool.cc:254] collecting diagnostics on the listening RPC socket 0.0.0.0:38137 every 8 connection(s)
I20260929 21:42:47.257246  2022 acceptor_pool.cc:254] collecting diagnostics on the listening RPC socket 0.0.0.0:38137 every 8 connection(s)
I20260929 21:42:47.260281  1815 rpc-test.cc:658] Connecting to 0.0.0.0:38137
[       OK ] Parameters/TestRpc.TestReopenOutboundConnections/SSL_TCP (399 ms)
[ RUN      ] Parameters/TestRpc.TestConnectionNetworkPlane/SSL_TCP
I20260929 21:42:47.670348  2044 acceptor_pool.cc:254] collecting diagnostics on the listening RPC socket 0.0.0.0:34443 every 8 connection(s)
I20260929 21:42:47.671044  2045 acceptor_pool.cc:254] collecting diagnostics on the listening RPC socket 0.0.0.0:34443 every 8 connection(s)
I20260929 21:42:47.674072  1815 rpc-test.cc:772] Connecting to 0.0.0.0:34443
[       OK ] Parameters/TestRpc.TestConnectionNetworkPlane/SSL_TCP (88 ms)
[ RUN      ] Parameters/TestRpc.TestTCPKeepalive/SSL_TCP
I20260929 21:42:47.741307  2069 acceptor_pool.cc:254] collecting diagnostics on the listening RPC socket 0.0.0.0:36623 every 8 connection(s)
I20260929 21:42:47.742022  2070 acceptor_pool.cc:254] collecting diagnostics on the listening RPC socket 0.0.0.0:36623 every 8 connection(s)
I20260929 21:42:47.793000  2073 rpc-test-base.h:222] got call: sleep_micros: 8000000 deferred: true
I20260929 21:42:55.797396  2073 rpcz_store.cc:275] Call kudu.rpc.GenericCalculatorService.Sleep from 127.0.0.1:58432 (request call id 0) took 8004 ms. Trace:
I20260929 21:42:55.797825  2073 rpcz_store.cc:276] 0929 21:42:47.792754 (+     0us) service_pool.cc:170] Inserting onto call queue
0929 21:42:47.792853 (+    99us) service_pool.cc:227] Handling call
0929 21:42:55.797156 (+8004303us) inbound_call.cc:173] Queueing success response
Metrics: {}
[       OK ] Parameters/TestRpc.TestTCPKeepalive/SSL_TCP (8088 ms)
[ RUN      ] Parameters/TestRpc.TestMaxSmallSidecars/SSL_TCP
I20260929 21:42:55.841385  2095 acceptor_pool.cc:254] collecting diagnostics on the listening RPC socket 0.0.0.0:45549 every 8 connection(s)
I20260929 21:42:55.842105  2096 acceptor_pool.cc:254] collecting diagnostics on the listening RPC socket 0.0.0.0:45549 every 8 connection(s)
[       OK ] Parameters/TestRpc.TestMaxSmallSidecars/SSL_TCP (199 ms)
[ RUN      ] Parameters/TestRpc.TestCallTimeout/SSL_TCP
I20260929 21:42:56.056977  2120 acceptor_pool.cc:254] collecting diagnostics on the listening RPC socket 0.0.0.0:36709 every 8 connection(s)
I20260929 21:42:56.057700  2121 acceptor_pool.cc:254] collecting diagnostics on the listening RPC socket 0.0.0.0:36709 every 8 connection(s)
I20260929 21:42:56.084384  1815 rpc-test-base.h:595] status: Timed out: connection negotiation to 0.0.0.0:36709 for RPC Sleep timed out after 0.000s (ON_OUTBOUND_QUEUE), seconds elapsed: 0.00243093
I20260929 21:42:56.091693  2124 rpc-test-base.h:222] got call: sleep_micros: 700000
I20260929 21:42:56.285597  1815 rpc-test-base.h:595] status: Timed out: Sleep RPC to 0.0.0.0:36709 timed out after 0.200s (SENT), seconds elapsed: 0.200765
I20260929 21:42:56.287081  2123 rpc-test-base.h:222] got call: sleep_micros: 2000000
W20260929 21:42:56.792362  2124 rpcz_store.cc:267] Call kudu.rpc.GenericCalculatorService.Sleep from 127.0.0.1:42872 (request call id 1) took 700 ms (client timeout 200 ms). Trace:
W20260929 21:42:56.792698  2124 rpcz_store.cc:269] 0929 21:42:56.091529 (+     0us) service_pool.cc:170] Inserting onto call queue
0929 21:42:56.091636 (+   107us) service_pool.cc:227] Handling call
0929 21:42:56.792294 (+700658us) inbound_call.cc:173] Queueing success response
Metrics: {}
I20260929 21:42:57.788287  1815 rpc-test-base.h:595] status: Timed out: Sleep RPC to 0.0.0.0:36709 timed out after 1.500s (SENT), seconds elapsed: 1.50234
W20260929 21:42:58.287622  2123 rpcz_store.cc:267] Call kudu.rpc.GenericCalculatorService.Sleep from 127.0.0.1:42872 (request call id 2) took 2000 ms (client timeout 1500 ms). Trace:
W20260929 21:42:58.287931  2123 rpcz_store.cc:269] 0929 21:42:56.286789 (+     0us) service_pool.cc:170] Inserting onto call queue
0929 21:42:56.286935 (+   146us) service_pool.cc:227] Handling call
0929 21:42:58.287568 (+2000633us) inbound_call.cc:173] Queueing success response
Metrics: {}
W20260929 21:42:58.288482  2119 connection.cc:441] server connection from 127.0.0.1:42872 torn down before Call kudu.rpc.GenericCalculatorService.Sleep from 127.0.0.1:42872 (request call id 2) could send its response
[       OK ] Parameters/TestRpc.TestCallTimeout/SSL_TCP (2285 ms)
[ RUN      ] Parameters/TestRpc.TestServerShutsDown/SSL_TCP
I20260929 21:42:58.296551  1815 rpc-test.cc:1125] Connecting to 0.0.0.0:36233
W20260929 21:42:58.310876  2137 negotiation.cc:337] Failed RPC negotiation. Trace:
0929 21:42:58.309250 (+     0us) reactor.cc:625] Submitting negotiation task for client connection to 0.0.0.0:36233 (local address 127.0.0.1:53710)
0929 21:42:58.309748 (+   498us) negotiation.cc:107] Waiting for socket to connect
0929 21:42:58.309778 (+    30us) client_negotiation.cc:174] Beginning negotiation
0929 21:42:58.310033 (+   255us) client_negotiation.cc:252] Sending NEGOTIATE NegotiatePB request
0929 21:42:58.310254 (+   221us) negotiation.cc:327] Negotiation complete: Network error: Client connection negotiation failed: client connection to 0.0.0.0:36233: BlockingWrite error: write error: Broken pipe (error 32)
Metrics: {"client-negotiator.queue_time_us":175}
[       OK ] Parameters/TestRpc.TestServerShutsDown/SSL_TCP (18 ms)
[ RUN      ] Parameters/TestRpc.TimedOutOnResponseMetric/SSL_TCP
I20260929 21:42:58.338644  2154 acceptor_pool.cc:254] collecting diagnostics on the listening RPC socket 0.0.0.0:38087 every 8 connection(s)
I20260929 21:42:58.339349  2155 acceptor_pool.cc:254] collecting diagnostics on the listening RPC socket 0.0.0.0:38087 every 8 connection(s)
W20260929 21:42:58.580956  2158 rpcz_store.cc:267] Call kudu.rpc_test.CalculatorService.Sleep from 127.0.0.1:50212 (request call id 3) took 50 ms (client timeout 25 ms). Trace:
W20260929 21:42:58.581305  2158 rpcz_store.cc:269] 0929 21:42:58.530293 (+     0us) service_pool.cc:170] Inserting onto call queue
0929 21:42:58.530448 (+   155us) service_pool.cc:227] Handling call
0929 21:42:58.580874 (+ 50426us) inbound_call.cc:173] Queueing success response
Related trace 'test_child':
Metrics: {"test_sleep_us":50000,"child_traces":[["test_child",{"related_trace_metric":1}]]}
W20260929 21:42:58.640597  2158 rpcz_store.cc:267] Call kudu.rpc_test.CalculatorService.Sleep from 127.0.0.1:50212 (request call id 4) took 50 ms (client timeout 50 ms). Trace:
W20260929 21:42:58.640934  2158 rpcz_store.cc:269] 0929 21:42:58.590086 (+     0us) service_pool.cc:170] Inserting onto call queue
0929 21:42:58.590187 (+   101us) service_pool.cc:227] Handling call
0929 21:42:58.640532 (+ 50345us) inbound_call.cc:173] Queueing success response
Related trace 'test_child':
Metrics: {"test_sleep_us":50000,"child_traces":[["test_child",{"related_trace_metric":1}]]}
[       OK ] Parameters/TestRpc.TimedOutOnResponseMetric/SSL_TCP (335 ms)
[ RUN      ] Parameters/TestRpc.AcceptorDispatchingTimesMetric/SSL_TCP
I20260929 21:42:58.660912  2179 acceptor_pool.cc:254] collecting diagnostics on the listening RPC socket 0.0.0.0:46545 every 8 connection(s)
I20260929 21:42:58.661598  2180 acceptor_pool.cc:254] collecting diagnostics on the listening RPC socket 0.0.0.0:46545 every 8 connection(s)
W20260929 21:42:58.666376  2175 negotiation.cc:337] Failed RPC negotiation. Trace:
0929 21:42:58.665219 (+     0us) reactor.cc:625] Submitting negotiation task for server connection from 127.0.0.1:53824 (local address 127.0.0.1:46545)
0929 21:42:58.665657 (+   438us) server_negotiation.cc:206] Beginning negotiation
0929 21:42:58.665675 (+    18us) server_negotiation.cc:399] Waiting for connection header
0929 21:42:58.665907 (+   232us) negotiation.cc:327] Negotiation complete: Network error: Server connection negotiation failed: server connection from 127.0.0.1:53824: BlockingRecv error: recv got EOF from 127.0.0.1:53824 (error 108)
Metrics: {"server-negotiator.queue_time_us":130}
[       OK ] Parameters/TestRpc.AcceptorDispatchingTimesMetric/SSL_TCP (22 ms)
[ RUN      ] Parameters/TestRpc.TestRpcCallbackDestroysMessenger/SSL_TCP
[       OK ] Parameters/TestRpc.TestRpcCallbackDestroysMessenger/SSL_TCP (64 ms)
[ RUN      ] Parameters/TestRpc.TestApplicationFeatureFlag/SSL_TCP
I20260929 21:42:58.754062  2204 acceptor_pool.cc:254] collecting diagnostics on the listening RPC socket 0.0.0.0:43125 every 8 connection(s)
I20260929 21:42:58.754791  2205 acceptor_pool.cc:254] collecting diagnostics on the listening RPC socket 0.0.0.0:43125 every 8 connection(s)
W20260929 21:42:58.793699  2201 messenger.cc:357] Unable to handle RPC call: Not implemented: call requires unsupported application feature flags: 99
[       OK ] Parameters/TestRpc.TestApplicationFeatureFlag/SSL_TCP (65 ms)
[ RUN      ] Parameters/TestRpc.TestCancellation/SSL_TCP
I20260929 21:42:58.829082  2229 acceptor_pool.cc:254] collecting diagnostics on the listening RPC socket 0.0.0.0:36873 every 8 connection(s)
I20260929 21:42:58.829767  2230 acceptor_pool.cc:254] collecting diagnostics on the listening RPC socket 0.0.0.0:36873 every 8 connection(s)
I20260929 21:42:58.832676  1815 rpc-test.cc:1648] Connecting to 0.0.0.0:36873
I20260929 21:42:58.929860  1815 rpc-test-base.h:595] status: Aborted: Sleep RPC to 0.0.0.0:36873 is cancelled in state READY, seconds elapsed: 0.000434961
I20260929 21:42:59.066529  1815 rpc-test-base.h:595] status: Aborted: Sleep RPC to 0.0.0.0:36873 is cancelled in state SENT, seconds elapsed: 0.000864743
I20260929 21:42:59.103684  2232 rpc-test-base.h:222] got call: sleep_micros: 510000
I20260929 21:42:59.231508  1815 rpc-test-base.h:595] status: Aborted: Sleep RPC to 0.0.0.0:36873 is cancelled in state SENT, seconds elapsed: 0.000757748
I20260929 21:42:59.270450  2231 rpc-test-base.h:222] got call: sleep_micros: 510000
I20260929 21:42:59.385156  1815 rpc-test-base.h:595] status: Aborted: Sleep RPC to 0.0.0.0:36873 is cancelled in state SENT, seconds elapsed: 0.00087247
W20260929 21:42:59.423148  2233 rpcz_store.cc:267] Call kudu.rpc.GenericCalculatorService.Sleep from 127.0.0.1:54278 (request call id 11) took 14 ms (client timeout 10 ms). Trace:
W20260929 21:42:59.423465  2233 rpcz_store.cc:269] 0929 21:42:59.408361 (+     0us) service_pool.cc:170] Inserting onto call queue
0929 21:42:59.422871 (+ 14510us) service_pool.cc:214] Skipping call since client already timed out
0929 21:42:59.422979 (+   108us) inbound_call.cc:173] Queueing failure response
Metrics: {}
I20260929 21:42:59.424072  2233 rpc-test-base.h:222] got call: sleep_micros: 1500000
W20260929 21:42:59.614447  2232 rpcz_store.cc:267] Call kudu.rpc.GenericCalculatorService.Sleep from 127.0.0.1:54278 (request call id 3) took 511 ms (client timeout 10 ms). Trace:
W20260929 21:42:59.614760  2232 rpcz_store.cc:269] 0929 21:42:59.103443 (+     0us) service_pool.cc:170] Inserting onto call queue
0929 21:42:59.103613 (+   170us) service_pool.cc:227] Handling call
0929 21:42:59.614392 (+510779us) inbound_call.cc:173] Queueing success response
Metrics: {}
W20260929 21:42:59.781080  2231 rpcz_store.cc:267] Call kudu.rpc.GenericCalculatorService.Sleep from 127.0.0.1:54278 (request call id 7) took 510 ms (client timeout 10 ms). Trace:
W20260929 21:42:59.781422  2231 rpcz_store.cc:269] 0929 21:42:59.270210 (+     0us) service_pool.cc:170] Inserting onto call queue
0929 21:42:59.270364 (+   154us) service_pool.cc:227] Handling call
0929 21:42:59.781028 (+510664us) inbound_call.cc:173] Queueing success response
Metrics: {}
I20260929 21:43:00.387113  1815 rpc-test-base.h:595] status: Timed out: Sleep RPC to 0.0.0.0:36873 timed out after 1.000s (SENT), seconds elapsed: 1.00157
I20260929 21:43:00.388350  2231 rpc-test-base.h:222] got call: sleep_micros: 1500000
W20260929 21:43:00.924620  2233 rpcz_store.cc:267] Call kudu.rpc.GenericCalculatorService.Sleep from 127.0.0.1:54278 (request call id 12) took 1515 ms (client timeout 1000 ms). Trace:
W20260929 21:43:00.924962  2233 rpcz_store.cc:269] 0929 21:42:59.408701 (+     0us) service_pool.cc:170] Inserting onto call queue
0929 21:42:59.424027 (+ 15326us) service_pool.cc:227] Handling call
0929 21:43:00.924570 (+1500543us) inbound_call.cc:173] Queueing success response
Metrics: {}
I20260929 21:43:01.388552  1815 rpc-test-base.h:595] status: Timed out: Sleep RPC to 0.0.0.0:36873 timed out after 1.000s (SENT), seconds elapsed: 1.00115
W20260929 21:43:01.389940  2228 messenger.cc:357] Unable to handle RPC call: Not implemented: call requires unsupported application feature flags: 99, 1
W20260929 21:43:01.391369  2228 messenger.cc:357] Unable to handle RPC call: Not implemented: call requires unsupported application feature flags: 99, 1
W20260929 21:43:01.888887  2231 rpcz_store.cc:267] Call kudu.rpc.GenericCalculatorService.Sleep from 127.0.0.1:54278 (request call id 13) took 1500 ms (client timeout 1000 ms). Trace:
W20260929 21:43:01.889209  2231 rpcz_store.cc:269] 0929 21:43:00.388170 (+     0us) service_pool.cc:170] Inserting onto call queue
0929 21:43:00.388301 (+   131us) service_pool.cc:227] Handling call
0929 21:43:01.888836 (+1500535us) inbound_call.cc:173] Queueing success response
Metrics: {}
W20260929 21:43:01.889842  2228 connection.cc:441] server connection from 127.0.0.1:54278 torn down before Call kudu.rpc.GenericCalculatorService.Sleep from 127.0.0.1:54278 (request call id 13) could send its response
[       OK ] Parameters/TestRpc.TestCancellation/SSL_TCP (3094 ms)
[ RUN      ] Parameters/TestRpc.TestCancellationMultiThreads/SSL_TCP
I20260929 21:43:01.933828  2254 acceptor_pool.cc:254] collecting diagnostics on the listening RPC socket 0.0.0.0:43275 every 8 connection(s)
I20260929 21:43:01.934492  2255 acceptor_pool.cc:254] collecting diagnostics on the listening RPC socket 0.0.0.0:43275 every 8 connection(s)
I20260929 21:43:01.937577  1815 rpc-test.cc:1808] Connecting to 0.0.0.0:43275
I20260929 21:43:02.078016  2268 test_util.cc:268] Using random seed: 287487523
I20260929 21:43:02.079361  2269 test_util.cc:268] Using random seed: 287488854
I20260929 21:43:02.080657  2270 test_util.cc:268] Using random seed: 287490168
I20260929 21:43:02.082023  2271 test_util.cc:268] Using random seed: 287491509
I20260929 21:43:02.083570  2272 test_util.cc:268] Using random seed: 287492942
I20260929 21:43:02.084895  2273 test_util.cc:268] Using random seed: 287494285
I20260929 21:43:02.086269  2274 test_util.cc:268] Using random seed: 287495648
I20260929 21:43:02.087824  2275 test_util.cc:268] Using random seed: 287497187
I20260929 21:43:02.089521  2276 test_util.cc:268] Using random seed: 287498867
I20260929 21:43:02.090874  2277 test_util.cc:268] Using random seed: 287500254
I20260929 21:43:02.092046  2278 test_util.cc:268] Using random seed: 287501456
I20260929 21:43:02.093250  2279 test_util.cc:268] Using random seed: 287502669
I20260929 21:43:02.094918  2280 test_util.cc:268] Using random seed: 287504257
I20260929 21:43:02.096673  2281 test_util.cc:268] Using random seed: 287506005
I20260929 21:43:02.098099  2282 test_util.cc:268] Using random seed: 287507478
I20260929 21:43:02.099601  2283 test_util.cc:268] Using random seed: 287508973
I20260929 21:43:02.101250  2284 test_util.cc:268] Using random seed: 287510577
I20260929 21:43:02.102803  2285 test_util.cc:268] Using random seed: 287512170
I20260929 21:43:02.104200  2286 test_util.cc:268] Using random seed: 287513580
I20260929 21:43:02.105954  2287 test_util.cc:268] Using random seed: 287514943
I20260929 21:43:02.107733  2288 test_util.cc:268] Using random seed: 287517108
I20260929 21:43:02.109213  2289 test_util.cc:268] Using random seed: 287518588
I20260929 21:43:02.110939  2290 test_util.cc:268] Using random seed: 287520314
I20260929 21:43:02.113523  2291 test_util.cc:268] Using random seed: 287522860
I20260929 21:43:02.115151  2292 test_util.cc:268] Using random seed: 287524487
I20260929 21:43:02.116825  2293 test_util.cc:268] Using random seed: 287526189
I20260929 21:43:02.118403  2294 test_util.cc:268] Using random seed: 287527747
I20260929 21:43:02.119939  2295 test_util.cc:268] Using random seed: 287529297
I20260929 21:43:02.121668  2296 test_util.cc:268] Using random seed: 287531057
I20260929 21:43:02.123248  2297 test_util.cc:268] Using random seed: 287532596
[       OK ] Parameters/TestRpc.TestCancellationMultiThreads/SSL_TCP (17318 ms)
[ RUN      ] Parameters/TestRpc.TestCallId/SSL_TCP
I20260929 21:43:19.246809  2311 acceptor_pool.cc:254] collecting diagnostics on the listening RPC socket 0.0.0.0:34285 every 8 connection(s)
I20260929 21:43:19.247542  2312 acceptor_pool.cc:254] collecting diagnostics on the listening RPC socket 0.0.0.0:34285 every 8 connection(s)
[       OK ] Parameters/TestRpc.TestCallId/SSL_TCP (99 ms)
[----------] 20 tests from Parameters/TestRpc (36846 ms total)

[----------] Global test environment tear-down
[==========] 21 tests from 2 test suites ran. (36853 ms total)
[  PASSED  ] 20 tests.
[  FAILED  ] 1 test, listed below:
[  FAILED  ] Parameters/TestRpc.TestCallWithChainCertAndRootCA/SSL_TCP, where GetParam() = (true, false)

 1 FAILED TEST