Diagnosed failure

Parameters/TestRpc.TestCallWithChainCertAndChainCA/SSL_TCP: /data0/somelongdirectorytoavoidrpathissues/src/kudu/src/kudu/rpc/rpc-test.cc:270: Failure
Failed
Bad status: Runtime error: could not verify certificate chain (error with cert: subject=CN = localhost, ST = sadfjas, C = AS, emailAddress = sdflkdsajf, O = lskdfjlsad, OU = sldfkja, issuer=C = AS, ST = ASDfkjdhf, L = lskdjf, O = saldfja, OU = skdjf, CN = localhost, emailAddress = sadjflkadsj): : certificate has expired
Google Test trace:
/data0/somelongdirectorytoavoidrpathissues/src/kudu/src/kudu/rpc/rpc-test.cc:267: Connecting to 0.0.0.0:44751
I20260929 14:04:22.018728 14204 test_util.cc:175] -----------------------------------------------
I20260929 14:04:22.018832 14204 test_util.cc:176] Had fatal failures, leaving test files at /tmp/dist-test-taskiQteHH/test-tmp/rpc-test.5.Parameters_TestRpc.TestCallWithChainCertAndChainCA_SSL_TCP.1790690661909592-14204-0

Full log

Note: This is test shard 6 of 8.
[==========] Running 21 tests from 2 test suites.
[----------] Global test environment set-up.
[----------] 20 tests from Parameters/TestRpc
[ RUN      ] Parameters/TestRpc.TestMessengerCreateDestroy/SSL_TCP
WARNING: Logging before InitGoogleLogging() is written to STDERR
I20260929 14:04:21.952309 14204 rpc-test.cc:169] started messenger TestCreateDestroy
[       OK ] Parameters/TestRpc.TestMessengerCreateDestroy/SSL_TCP (26 ms)
[ RUN      ] Parameters/TestRpc.TestNegotiationDeadlock/SSL_TCP
I20260929 14:04:21.969184 14224 acceptor_pool.cc:254] collecting diagnostics on the listening RPC socket 0.0.0.0:35161 every 8 connection(s)
I20260929 14:04:21.969485 14225 acceptor_pool.cc:254] collecting diagnostics on the listening RPC socket 0.0.0.0:35161 every 8 connection(s)
[       OK ] Parameters/TestRpc.TestNegotiationDeadlock/SSL_TCP (34 ms)
[ RUN      ] Parameters/TestRpc.TestCallWithChainCertAndChainCA/SSL_TCP
I20260929 14:04:22.007536 14240 acceptor_pool.cc:254] collecting diagnostics on the listening RPC socket 0.0.0.0:44751 every 8 connection(s)
I20260929 14:04:22.007867 14241 acceptor_pool.cc:254] collecting diagnostics on the listening RPC socket 0.0.0.0:44751 every 8 connection(s)
/data0/somelongdirectorytoavoidrpathissues/src/kudu/src/kudu/rpc/rpc-test.cc:270: Failure
Failed
Bad status: Runtime error: could not verify certificate chain (error with cert: subject=CN = localhost, ST = sadfjas, C = AS, emailAddress = sdflkdsajf, O = lskdfjlsad, OU = sldfkja, issuer=C = AS, ST = ASDfkjdhf, L = lskdjf, O = saldfja, OU = skdjf, CN = localhost, emailAddress = sadjflkadsj): : certificate has expired
Google Test trace:
/data0/somelongdirectorytoavoidrpathissues/src/kudu/src/kudu/rpc/rpc-test.cc:267: Connecting to 0.0.0.0:44751
I20260929 14:04:22.018728 14204 test_util.cc:175] -----------------------------------------------
I20260929 14:04:22.018832 14204 test_util.cc:176] Had fatal failures, leaving test files at /tmp/dist-test-taskiQteHH/test-tmp/rpc-test.5.Parameters_TestRpc.TestCallWithChainCertAndChainCA_SSL_TCP.1790690661909592-14204-0
[  FAILED  ] Parameters/TestRpc.TestCallWithChainCertAndChainCA/SSL_TCP, where GetParam() = (true, false) (28 ms)
[ RUN      ] Parameters/TestRpc.TestCallWithPasswordProtectedKey/SSL_TCP
I20260929 14:04:22.036872 14265 acceptor_pool.cc:254] collecting diagnostics on the listening RPC socket 0.0.0.0:38935 every 8 connection(s)
I20260929 14:04:22.037122 14266 acceptor_pool.cc:254] collecting diagnostics on the listening RPC socket 0.0.0.0:38935 every 8 connection(s)
[       OK ] Parameters/TestRpc.TestCallWithPasswordProtectedKey/SSL_TCP (54 ms)
[ RUN      ] Parameters/TestRpc.TestCallToBadServer/SSL_TCP
I20260929 14:04:22.096053 14204 rpc-test.cc:394] Status: Network error: Client connection negotiation failed: client connection to 0.0.0.0:0: connect: Connection refused (error 111)
I20260929 14:04:22.096890 14204 rpc-test.cc:394] Status: Network error: Client connection negotiation failed: client connection to 0.0.0.0:0: connect: Connection refused (error 111)
I20260929 14:04:22.097645 14204 rpc-test.cc:394] Status: Network error: Client connection negotiation failed: client connection to 0.0.0.0:0: connect: Connection refused (error 111)
I20260929 14:04:22.098328 14204 rpc-test.cc:394] Status: Network error: Client connection negotiation failed: client connection to 0.0.0.0:0: connect: Connection refused (error 111)
I20260929 14:04:22.099076 14204 rpc-test.cc:394] Status: Network error: Client connection negotiation failed: client connection to 0.0.0.0:0: connect: Connection refused (error 111)
[       OK ] Parameters/TestRpc.TestCallToBadServer/SSL_TCP (27 ms)
[ RUN      ] Parameters/TestRpc.TestWrongService/SSL_TCP
I20260929 14:04:22.111256 14300 acceptor_pool.cc:254] collecting diagnostics on the listening RPC socket 0.0.0.0:43137 every 8 connection(s)
I20260929 14:04:22.111505 14301 acceptor_pool.cc:254] collecting diagnostics on the listening RPC socket 0.0.0.0:43137 every 8 connection(s)
I20260929 14:04:22.151273 14298 messenger.cc:345] service WrongServiceName not registered on TestServer
[       OK ] Parameters/TestRpc.TestWrongService/SSL_TCP (55 ms)
[ RUN      ] Parameters/TestRpc.TestConnectionKeepalive/SSL_TCP
I20260929 14:04:22.176687 14323 acceptor_pool.cc:254] collecting diagnostics on the listening RPC socket 0.0.0.0:40097 every 8 connection(s)
I20260929 14:04:22.176920 14324 acceptor_pool.cc:254] collecting diagnostics on the listening RPC socket 0.0.0.0:40097 every 8 connection(s)
I20260929 14:04:22.177810 14204 rpc-test.cc:488] Connecting to 0.0.0.0:40097
[       OK ] Parameters/TestRpc.TestConnectionKeepalive/SSL_TCP (1045 ms)
[ RUN      ] Parameters/TestRpc.TestClientConnectionMetrics/SSL_TCP
I20260929 14:04:23.216123 14348 acceptor_pool.cc:254] collecting diagnostics on the listening RPC socket 0.0.0.0:41001 every 8 connection(s)
I20260929 14:04:23.216413 14349 acceptor_pool.cc:254] collecting diagnostics on the listening RPC socket 0.0.0.0:41001 every 8 connection(s)
I20260929 14:04:23.217319 14204 rpc-test.cc:569] Connecting to 0.0.0.0:41001
[       OK ] Parameters/TestRpc.TestClientConnectionMetrics/SSL_TCP (19699 ms)
[ RUN      ] Parameters/TestRpc.TestCredentialsPolicy/SSL_TCP
I20260929 14:04:42.945147 14371 acceptor_pool.cc:254] collecting diagnostics on the listening RPC socket 0.0.0.0:44381 every 8 connection(s)
I20260929 14:04:42.945370 14372 acceptor_pool.cc:254] collecting diagnostics on the listening RPC socket 0.0.0.0:44381 every 8 connection(s)
I20260929 14:04:42.946501 14204 rpc-test.cc:700] Connecting to 0.0.0.0:44381
[       OK ] Parameters/TestRpc.TestCredentialsPolicy/SSL_TCP (79 ms)
[ RUN      ] Parameters/TestRpc.TestCallLongerThanKeepalive/SSL_TCP
I20260929 14:04:42.991665 14396 acceptor_pool.cc:254] collecting diagnostics on the listening RPC socket 0.0.0.0:43853 every 8 connection(s)
I20260929 14:04:42.991925 14397 acceptor_pool.cc:254] collecting diagnostics on the listening RPC socket 0.0.0.0:43853 every 8 connection(s)
I20260929 14:04:43.009523 14400 rpc-test-base.h:222] got call: sleep_micros: 3000000 deferred: true
I20260929 14:04:46.011197 14400 rpcz_store.cc:275] Call kudu.rpc.GenericCalculatorService.Sleep from 127.0.0.1:40030 (request call id 0) took 3001 ms. Trace:
I20260929 14:04:46.011356 14400 rpcz_store.cc:276] 0929 14:04:43.009405 (+     0us) service_pool.cc:170] Inserting onto call queue
0929 14:04:43.009469 (+    64us) service_pool.cc:227] Handling call
0929 14:04:46.011151 (+3001682us) inbound_call.cc:173] Queueing success response
Metrics: {}
[       OK ] Parameters/TestRpc.TestCallLongerThanKeepalive/SSL_TCP (3036 ms)
[ RUN      ] Parameters/TestRpc.TestRpcSidecar/SSL_TCP
I20260929 14:04:46.083998 14421 acceptor_pool.cc:254] collecting diagnostics on the listening RPC socket 0.0.0.0:46099 every 8 connection(s)
I20260929 14:04:46.084223 14422 acceptor_pool.cc:254] collecting diagnostics on the listening RPC socket 0.0.0.0:46099 every 8 connection(s)
[       OK ] Parameters/TestRpc.TestRpcSidecar/SSL_TCP (173 ms)
[ RUN      ] Parameters/TestRpc.TestRpcSidecarLimits/SSL_TCP
I20260929 14:04:48.272986 14446 acceptor_pool.cc:254] collecting diagnostics on the listening RPC socket 0.0.0.0:45395 every 8 connection(s)
I20260929 14:04:48.273243 14447 acceptor_pool.cc:254] collecting diagnostics on the listening RPC socket 0.0.0.0:45395 every 8 connection(s)
W20260929 14:04:48.287397 14204 serialization.cc:72] Serialized kudu.rpc_test.PushStringsRequestPB (2147483654 bytes) is larger than the maximum configured RPC message size (52428800 bytes). Sending anyway, but peer may reject the data.
W20260929 14:04:48.294059 14444 connection.cc:535] server connection from 127.0.0.1:44358 recv error: Network error: RPC frame had a length of 2147483714, but we only support messages up to 52428800 bytes long.
W20260929 14:04:48.294230 14444 connection.cc:158] shutting down server connection from 127.0.0.1:44358 with pending inbound data: 4/2147483714 bytes received; last active 0 ns ago: status Network error: RPC frame had a length of 2147483714, but we only support messages up to 52428800 bytes long.
W20260929 14:04:48.294840 14459 connection.cc:196] Error closing socket: Network error: TlsSocket::Close: Connection reset by peer
I20260929 14:04:48.315759 14471 acceptor_pool.cc:254] collecting diagnostics on the listening RPC socket 0.0.0.0:41817 every 8 connection(s)
I20260929 14:04:48.316156 14472 acceptor_pool.cc:254] collecting diagnostics on the listening RPC socket 0.0.0.0:41817 every 8 connection(s)
W20260929 14:04:54.000422 14469 connection.cc:577] server connection from 127.0.0.1:52034: received bad data: 'Corruption: Invalid packet: message had a length of 2147483710, but we only support messages up to 2147483647 bytes
'
[       OK ] Parameters/TestRpc.TestRpcSidecarLimits/SSL_TCP (8279 ms)
[ RUN      ] Parameters/TestRpc.TestCallTimeoutDoesntAffectNegotiation/SSL_TCP
I20260929 14:04:54.487303 14496 acceptor_pool.cc:254] collecting diagnostics on the listening RPC socket 0.0.0.0:37671 every 8 connection(s)
I20260929 14:04:54.487576 14497 acceptor_pool.cc:254] collecting diagnostics on the listening RPC socket 0.0.0.0:37671 every 8 connection(s)
W20260929 14:04:54.502702 14492 negotiation.cc:266] Injecting 500ms delay in negotiation
I20260929 14:04:54.553246 14204 rpc-test-base.h:595] status: Timed out: connection negotiation to 0.0.0.0:37671 for RPC Sleep timed out after 0.050s (ON_OUTBOUND_QUEUE), seconds elapsed: 0.051071
[       OK ] Parameters/TestRpc.TestCallTimeoutDoesntAffectNegotiation/SSL_TCP (542 ms)
[ RUN      ] Parameters/TestRpc.TestRpcHandlerLatencyMetric/SSL_TCP
I20260929 14:04:55.027055 14521 acceptor_pool.cc:254] collecting diagnostics on the listening RPC socket 0.0.0.0:36721 every 8 connection(s)
I20260929 14:04:55.027262 14522 acceptor_pool.cc:254] collecting diagnostics on the listening RPC socket 0.0.0.0:36721 every 8 connection(s)
I20260929 14:04:55.085435 14204 rpc-test.cc:1236] Sleep() min lat: 20653
I20260929 14:04:55.085525 14204 rpc-test.cc:1237] Sleep() mean lat: 20653
I20260929 14:04:55.085564 14204 rpc-test.cc:1238] Sleep() max lat: 20653
I20260929 14:04:55.085584 14204 rpc-test.cc:1239] Sleep() #calls: 1
[       OK ] Parameters/TestRpc.TestRpcHandlerLatencyMetric/SSL_TCP (77 ms)
[ RUN      ] Parameters/TestRpc.TimedOutOnResponseMetricServiceQueue/SSL_TCP
I20260929 14:04:55.103953 14547 acceptor_pool.cc:254] collecting diagnostics on the listening RPC socket 0.0.0.0:36921 every 8 connection(s)
I20260929 14:04:55.104135 14548 acceptor_pool.cc:254] collecting diagnostics on the listening RPC socket 0.0.0.0:36921 every 8 connection(s)
W20260929 14:04:55.158941 14549 rpcz_store.cc:267] Call kudu.rpc_test.CalculatorService.Sleep from 127.0.0.1:40428 (request call id 2) took 20 ms (client timeout 20 ms). Trace:
W20260929 14:04:55.159190 14549 rpcz_store.cc:269] 0929 14:04:55.138417 (+     0us) service_pool.cc:170] Inserting onto call queue
0929 14:04:55.158877 (+ 20460us) service_pool.cc:214] Skipping call since client already timed out
0929 14:04:55.158922 (+    45us) inbound_call.cc:173] Queueing failure response
Metrics: {}
[       OK ] Parameters/TestRpc.TimedOutOnResponseMetricServiceQueue/SSL_TCP (72 ms)
[ RUN      ] Parameters/TestRpc.RpcPendingConnectionsMetric/SSL_TCP
I20260929 14:04:55.167912 14570 acceptor_pool.cc:254] collecting diagnostics on the listening RPC socket 0.0.0.0:37517 every 8 connection(s)
I20260929 14:04:55.168115 14571 acceptor_pool.cc:254] collecting diagnostics on the listening RPC socket 0.0.0.0:37517 every 8 connection(s)
W20260929 14:04:55.170217 14566 negotiation.cc:337] Failed RPC negotiation. Trace:
0929 14:04:55.169542 (+     0us) reactor.cc:625] Submitting negotiation task for server connection from 127.0.0.1:53352 (local address 127.0.0.1:37517)
0929 14:04:55.169704 (+   162us) server_negotiation.cc:206] Beginning negotiation
0929 14:04:55.169708 (+     4us) server_negotiation.cc:399] Waiting for connection header
0929 14:04:55.169896 (+   188us) negotiation.cc:327] Negotiation complete: Network error: Server connection negotiation failed: server connection from 127.0.0.1:53352: BlockingRecv error: recv got EOF from 127.0.0.1:53352 (error 108)
Metrics: {"server-negotiator.queue_time_us":55}
[       OK ] Parameters/TestRpc.RpcPendingConnectionsMetric/SSL_TCP (19 ms)
[ RUN      ] Parameters/TestRpc.TestRpcContextClientDeadline/SSL_TCP
I20260929 14:04:55.196061 14586 acceptor_pool.cc:254] collecting diagnostics on the listening RPC socket 0.0.0.0:34345 every 8 connection(s)
I20260929 14:04:55.196290 14587 acceptor_pool.cc:254] collecting diagnostics on the listening RPC socket 0.0.0.0:34345 every 8 connection(s)
[       OK ] Parameters/TestRpc.TestRpcContextClientDeadline/SSL_TCP (62 ms)
[ RUN      ] Parameters/TestRpc.TestApplicationFeatureFlagUnsupportedServer/SSL_TCP
I20260929 14:04:55.267115 14611 acceptor_pool.cc:254] collecting diagnostics on the listening RPC socket 0.0.0.0:45411 every 8 connection(s)
I20260929 14:04:55.267386 14612 acceptor_pool.cc:254] collecting diagnostics on the listening RPC socket 0.0.0.0:45411 every 8 connection(s)
[       OK ] Parameters/TestRpc.TestApplicationFeatureFlagUnsupportedServer/SSL_TCP (54 ms)
[ RUN      ] Parameters/TestRpc.TestCancellationAsync/SSL_TCP
I20260929 14:04:55.323210 14636 acceptor_pool.cc:254] collecting diagnostics on the listening RPC socket 0.0.0.0:40125 every 8 connection(s)
I20260929 14:04:55.323464 14637 acceptor_pool.cc:254] collecting diagnostics on the listening RPC socket 0.0.0.0:40125 every 8 connection(s)
I20260929 14:04:55.324441 14204 rpc-test.cc:1716] Connecting to 0.0.0.0:40125
I20260929 14:04:55.347200 14204 test_util.cc:268] Using random seed: -1429439518
I20260929 14:04:55.379369 14640 rpc-test-base.h:240] got call: sleep_micros: 500 pattern: 4294967295 num_repetitions: 2097152 sidecar_idx: 0
I20260929 14:04:55.398332 14639 rpc-test-base.h:240] got call: sleep_micros: 500 pattern: 4294967295 num_repetitions: 2097152 sidecar_idx: 0
I20260929 14:04:55.431668 14638 rpc-test-base.h:240] got call: sleep_micros: 500 pattern: 4294967295 num_repetitions: 2097152 sidecar_idx: 0
I20260929 14:04:55.465787 14639 rpc-test-base.h:240] got call: sleep_micros: 500 pattern: 4294967295 num_repetitions: 2097152 sidecar_idx: 0
I20260929 14:04:55.497741 14640 rpc-test-base.h:240] got call: sleep_micros: 500 pattern: 4294967295 num_repetitions: 2097152 sidecar_idx: 0
I20260929 14:04:55.530401 14639 rpc-test-base.h:240] got call: sleep_micros: 500 pattern: 4294967295 num_repetitions: 2097152 sidecar_idx: 0
W20260929 14:04:55.562438 14633 connection.cc:698] server connection from 127.0.0.1:33484 send error: Network error: failed to write to TLS socket: Broken pipe
W20260929 14:04:55.562588 14633 connection.cc:441] server connection from 127.0.0.1:33484 torn down before Call kudu.rpc.GenericCalculatorService.SleepWithSidecar from 127.0.0.1:33484 (request call id 9) could send its response
W20260929 14:04:55.562877 14633 connection.cc:196] Error closing socket: Network error: TlsSocket::Close: Success
W20260929 14:04:55.580446 14633 connection.cc:441] server connection from 127.0.0.1:33484 torn down before Call kudu.rpc.GenericCalculatorService.SleepWithSidecar from 127.0.0.1:33484 (request call id 8) could send its response
[       OK ] Parameters/TestRpc.TestCancellationAsync/SSL_TCP (283 ms)
[ RUN      ] Parameters/TestRpc.TestPerformanceBySocketType/SSL_TCP
I20260929 14:04:55.601622 14661 acceptor_pool.cc:254] collecting diagnostics on the listening RPC socket 0.0.0.0:41389 every 8 connection(s)
I20260929 14:04:55.601830 14662 acceptor_pool.cc:254] collecting diagnostics on the listening RPC socket 0.0.0.0:41389 every 8 connection(s)
I20260929 14:04:55.602695 14204 rpc-test.cc:1846] Connecting to 0.0.0.0:41389
I20260929 14:04:58.596112 14204 rpc-test.cc:1859] Sending 1024MB via ssl-enabled tcp socket: real 2.961s	user 2.734s	sys 2.234s
I20260929 14:05:01.632046 14204 rpc-test.cc:1859] Sending 1024MB via ssl-enabled tcp socket: real 3.036s	user 2.845s	sys 2.256s
I20260929 14:05:04.654430 14204 rpc-test.cc:1859] Sending 1024MB via ssl-enabled tcp socket: real 3.022s	user 2.789s	sys 2.256s
I20260929 14:05:07.712850 14204 rpc-test.cc:1859] Sending 1024MB via ssl-enabled tcp socket: real 3.058s	user 2.821s	sys 2.280s
I20260929 14:05:10.686674 14204 rpc-test.cc:1859] Sending 1024MB via ssl-enabled tcp socket: real 2.974s	user 2.819s	sys 2.178s
[       OK ] Parameters/TestRpc.TestPerformanceBySocketType/SSL_TCP (15111 ms)
[----------] 20 tests from Parameters/TestRpc (48766 ms total)

[----------] 1 test from Parameters/TestRpcSocketTxRxQueue
[ RUN      ] Parameters/TestRpcSocketTxRxQueue.OverCapacity/0
W20260929 14:05:10.990697 14696 negotiation.cc:337] Failed RPC negotiation. Trace:
0929 14:05:10.704882 (+     0us) reactor.cc:625] Submitting negotiation task for client connection to 0.0.0.0:45955 (local address 127.0.0.1:54656)
0929 14:05:10.705075 (+   193us) negotiation.cc:107] Waiting for socket to connect
0929 14:05:10.705106 (+    31us) client_negotiation.cc:174] Beginning negotiation
0929 14:05:10.705216 (+   110us) client_negotiation.cc:252] Sending NEGOTIATE NegotiatePB request
0929 14:05:10.990271 (+285055us) negotiation.cc:327] Negotiation complete: Network error: Client connection negotiation failed: client connection to 0.0.0.0:45955: BlockingRecv error: recv error from unknown peer: Transport endpoint is not connected (error 107)
Metrics: {"client-negotiator.queue_time_us":57}
W20260929 14:05:10.991065 14678 negotiation.cc:337] Failed RPC negotiation. Trace:
0929 14:05:10.699726 (+     0us) reactor.cc:625] Submitting negotiation task for client connection to 0.0.0.0:45955 (local address 127.0.0.1:54648)
0929 14:05:10.699894 (+   168us) negotiation.cc:107] Waiting for socket to connect
0929 14:05:10.699912 (+    18us) client_negotiation.cc:174] Beginning negotiation
0929 14:05:10.700022 (+   110us) client_negotiation.cc:252] Sending NEGOTIATE NegotiatePB request
0929 14:05:10.990271 (+290249us) negotiation.cc:327] Negotiation complete: Network error: Client connection negotiation failed: client connection to 0.0.0.0:45955: BlockingRecv error: recv error from unknown peer: Transport endpoint is not connected (error 107)
Metrics: {"client-negotiator.queue_time_us":49}
W20260929 14:05:10.990638 14687 negotiation.cc:337] Failed RPC negotiation. Trace:
0929 14:05:10.702465 (+     0us) reactor.cc:625] Submitting negotiation task for client connection to 0.0.0.0:45955 (local address 127.0.0.1:54654)
0929 14:05:10.702628 (+   163us) negotiation.cc:107] Waiting for socket to connect
0929 14:05:10.702645 (+    17us) client_negotiation.cc:174] Beginning negotiation
0929 14:05:10.702756 (+   111us) client_negotiation.cc:252] Sending NEGOTIATE NegotiatePB request
0929 14:05:10.990306 (+287550us) negotiation.cc:327] Negotiation complete: Network error: Client connection negotiation failed: client connection to 0.0.0.0:45955: BlockingRecv error: recv error from unknown peer: Transport endpoint is not connected (error 107)
Metrics: {"client-negotiator.queue_time_us":33}
W20260929 14:05:10.991703 14723 negotiation.cc:337] Failed RPC negotiation. Trace:
0929 14:05:10.712868 (+     0us) reactor.cc:625] Submitting negotiation task for client connection to 0.0.0.0:45955 (local address 127.0.0.1:54698)
0929 14:05:10.713081 (+   213us) negotiation.cc:107] Waiting for socket to connect
0929 14:05:10.713095 (+    14us) client_negotiation.cc:174] Beginning negotiation
0929 14:05:10.713185 (+    90us) client_negotiation.cc:252] Sending NEGOTIATE NegotiatePB request
0929 14:05:10.990621 (+277436us) negotiation.cc:327] Negotiation complete: Network error: Client connection negotiation failed: client connection to 0.0.0.0:45955: BlockingRecv error: recv error from unknown peer: Transport endpoint is not connected (error 107)
Metrics: {"client-negotiator.queue_time_us":58}
W20260929 14:05:10.992265 14714 negotiation.cc:337] Failed RPC negotiation. Trace:
0929 14:05:10.709837 (+     0us) reactor.cc:625] Submitting negotiation task for client connection to 0.0.0.0:45955 (local address 127.0.0.1:54682)
0929 14:05:10.710028 (+   191us) negotiation.cc:107] Waiting for socket to connect
0929 14:05:10.710042 (+    14us) client_negotiation.cc:174] Beginning negotiation
0929 14:05:10.710119 (+    77us) client_negotiation.cc:252] Sending NEGOTIATE NegotiatePB request
0929 14:05:10.990692 (+280573us) negotiation.cc:327] Negotiation complete: Network error: Client connection negotiation failed: client connection to 0.0.0.0:45955: BlockingRecv error: recv error from unknown peer: Transport endpoint is not connected (error 107)
Metrics: {"client-negotiator.queue_time_us":49}
W20260929 14:05:10.992298 14705 negotiation.cc:337] Failed RPC negotiation. Trace:
0929 14:05:10.707380 (+     0us) reactor.cc:625] Submitting negotiation task for client connection to 0.0.0.0:45955 (local address 127.0.0.1:54670)
0929 14:05:10.707538 (+   158us) negotiation.cc:107] Waiting for socket to connect
0929 14:05:10.707556 (+    18us) client_negotiation.cc:174] Beginning negotiation
0929 14:05:10.707645 (+    89us) client_negotiation.cc:252] Sending NEGOTIATE NegotiatePB request
0929 14:05:10.990271 (+282626us) negotiation.cc:327] Negotiation complete: Network error: Client connection negotiation failed: client connection to 0.0.0.0:45955: BlockingRecv error: recv error from unknown peer: Transport endpoint is not connected (error 107)
Metrics: {"client-negotiator.queue_time_us":53}
[       OK ] Parameters/TestRpcSocketTxRxQueue.OverCapacity/0 (1078 ms)
[----------] 1 test from Parameters/TestRpcSocketTxRxQueue (1078 ms total)

[----------] Global test environment tear-down
[==========] 21 tests from 2 test suites ran. (49845 ms total)
[  PASSED  ] 20 tests.
[  FAILED  ] 1 test, listed below:
[  FAILED  ] Parameters/TestRpc.TestCallWithChainCertAndChainCA/SSL_TCP, where GetParam() = (true, false)

 1 FAILED TEST