Diagnosed failure

Parameters/TestRpc.TestCallWithChainCertAndChainCA/SSL_TCP: /data0/somelongdirectorytoavoidrpathissues/src/kudu/src/kudu/rpc/rpc-test.cc:270: Failure
Failed
Bad status: Runtime error: could not verify certificate chain (error with cert: subject=CN = localhost, ST = sadfjas, C = AS, emailAddress = sdflkdsajf, O = lskdfjlsad, OU = sldfkja, issuer=C = AS, ST = ASDfkjdhf, L = lskdjf, O = saldfja, OU = skdjf, CN = localhost, emailAddress = sadjflkadsj): : certificate has expired
Google Test trace:
/data0/somelongdirectorytoavoidrpathissues/src/kudu/src/kudu/rpc/rpc-test.cc:267: Connecting to 0.0.0.0:42001
I20260927 06:57:17.622804   379 test_util.cc:175] -----------------------------------------------
I20260927 06:57:17.622898   379 test_util.cc:176] Had fatal failures, leaving test files at /tmp/dist-test-task5hPxrH/test-tmp/rpc-test.5.Parameters_TestRpc.TestCallWithChainCertAndChainCA_SSL_TCP.1790492237486502-379-0

Full log

Note: This is test shard 6 of 8.
[==========] Running 21 tests from 2 test suites.
[----------] Global test environment set-up.
[----------] 20 tests from Parameters/TestRpc
[ RUN      ] Parameters/TestRpc.TestMessengerCreateDestroy/SSL_TCP
WARNING: Logging before InitGoogleLogging() is written to STDERR
I20260927 06:57:17.536751   379 rpc-test.cc:169] started messenger TestCreateDestroy
[       OK ] Parameters/TestRpc.TestMessengerCreateDestroy/SSL_TCP (35 ms)
[ RUN      ] Parameters/TestRpc.TestNegotiationDeadlock/SSL_TCP
I20260927 06:57:17.581990   399 acceptor_pool.cc:254] collecting diagnostics on the listening RPC socket 0.0.0.0:38825 every 8 connection(s)
I20260927 06:57:17.582261   400 acceptor_pool.cc:254] collecting diagnostics on the listening RPC socket 0.0.0.0:38825 every 8 connection(s)
[       OK ] Parameters/TestRpc.TestNegotiationDeadlock/SSL_TCP (62 ms)
[ RUN      ] Parameters/TestRpc.TestCallWithChainCertAndChainCA/SSL_TCP
I20260927 06:57:17.611610   415 acceptor_pool.cc:254] collecting diagnostics on the listening RPC socket 0.0.0.0:42001 every 8 connection(s)
I20260927 06:57:17.611909   416 acceptor_pool.cc:254] collecting diagnostics on the listening RPC socket 0.0.0.0:42001 every 8 connection(s)
/data0/somelongdirectorytoavoidrpathissues/src/kudu/src/kudu/rpc/rpc-test.cc:270: Failure
Failed
Bad status: Runtime error: could not verify certificate chain (error with cert: subject=CN = localhost, ST = sadfjas, C = AS, emailAddress = sdflkdsajf, O = lskdfjlsad, OU = sldfkja, issuer=C = AS, ST = ASDfkjdhf, L = lskdjf, O = saldfja, OU = skdjf, CN = localhost, emailAddress = sadjflkadsj): : certificate has expired
Google Test trace:
/data0/somelongdirectorytoavoidrpathissues/src/kudu/src/kudu/rpc/rpc-test.cc:267: Connecting to 0.0.0.0:42001
I20260927 06:57:17.622804   379 test_util.cc:175] -----------------------------------------------
I20260927 06:57:17.622898   379 test_util.cc:176] Had fatal failures, leaving test files at /tmp/dist-test-task5hPxrH/test-tmp/rpc-test.5.Parameters_TestRpc.TestCallWithChainCertAndChainCA_SSL_TCP.1790492237486502-379-0
[  FAILED  ] Parameters/TestRpc.TestCallWithChainCertAndChainCA/SSL_TCP, where GetParam() = (true, false) (19 ms)
[ RUN      ] Parameters/TestRpc.TestCallWithPasswordProtectedKey/SSL_TCP
I20260927 06:57:17.640291   440 acceptor_pool.cc:254] collecting diagnostics on the listening RPC socket 0.0.0.0:38675 every 8 connection(s)
I20260927 06:57:17.640512   441 acceptor_pool.cc:254] collecting diagnostics on the listening RPC socket 0.0.0.0:38675 every 8 connection(s)
[       OK ] Parameters/TestRpc.TestCallWithPasswordProtectedKey/SSL_TCP (50 ms)
[ RUN      ] Parameters/TestRpc.TestCallToBadServer/SSL_TCP
I20260927 06:57:17.705019   379 rpc-test.cc:394] Status: Network error: Client connection negotiation failed: client connection to 0.0.0.0:0: connect: Connection refused (error 111)
I20260927 06:57:17.705751   379 rpc-test.cc:394] Status: Network error: Client connection negotiation failed: client connection to 0.0.0.0:0: connect: Connection refused (error 111)
I20260927 06:57:17.706373   379 rpc-test.cc:394] Status: Network error: Client connection negotiation failed: client connection to 0.0.0.0:0: connect: Connection refused (error 111)
I20260927 06:57:17.706981   379 rpc-test.cc:394] Status: Network error: Client connection negotiation failed: client connection to 0.0.0.0:0: connect: Connection refused (error 111)
I20260927 06:57:17.707568   379 rpc-test.cc:394] Status: Network error: Client connection negotiation failed: client connection to 0.0.0.0:0: connect: Connection refused (error 111)
[       OK ] Parameters/TestRpc.TestCallToBadServer/SSL_TCP (35 ms)
[ RUN      ] Parameters/TestRpc.TestWrongService/SSL_TCP
I20260927 06:57:17.721860   475 acceptor_pool.cc:254] collecting diagnostics on the listening RPC socket 0.0.0.0:44293 every 8 connection(s)
I20260927 06:57:17.722031   476 acceptor_pool.cc:254] collecting diagnostics on the listening RPC socket 0.0.0.0:44293 every 8 connection(s)
I20260927 06:57:17.739362   473 messenger.cc:345] service WrongServiceName not registered on TestServer
[       OK ] Parameters/TestRpc.TestWrongService/SSL_TCP (34 ms)
[ RUN      ] Parameters/TestRpc.TestConnectionKeepalive/SSL_TCP
I20260927 06:57:17.753389   498 acceptor_pool.cc:254] collecting diagnostics on the listening RPC socket 0.0.0.0:35599 every 8 connection(s)
I20260927 06:57:17.753712   499 acceptor_pool.cc:254] collecting diagnostics on the listening RPC socket 0.0.0.0:35599 every 8 connection(s)
I20260927 06:57:17.754577   379 rpc-test.cc:488] Connecting to 0.0.0.0:35599
[       OK ] Parameters/TestRpc.TestConnectionKeepalive/SSL_TCP (1047 ms)
[ RUN      ] Parameters/TestRpc.TestClientConnectionMetrics/SSL_TCP
I20260927 06:57:18.811939   523 acceptor_pool.cc:254] collecting diagnostics on the listening RPC socket 0.0.0.0:42631 every 8 connection(s)
I20260927 06:57:18.812115   524 acceptor_pool.cc:254] collecting diagnostics on the listening RPC socket 0.0.0.0:42631 every 8 connection(s)
I20260927 06:57:18.813311   379 rpc-test.cc:569] Connecting to 0.0.0.0:42631
[       OK ] Parameters/TestRpc.TestClientConnectionMetrics/SSL_TCP (18420 ms)
[ RUN      ] Parameters/TestRpc.TestCredentialsPolicy/SSL_TCP
I20260927 06:57:37.230754   546 acceptor_pool.cc:254] collecting diagnostics on the listening RPC socket 0.0.0.0:36821 every 8 connection(s)
I20260927 06:57:37.230952   547 acceptor_pool.cc:254] collecting diagnostics on the listening RPC socket 0.0.0.0:36821 every 8 connection(s)
I20260927 06:57:37.231832   379 rpc-test.cc:700] Connecting to 0.0.0.0:36821
[       OK ] Parameters/TestRpc.TestCredentialsPolicy/SSL_TCP (59 ms)
[ RUN      ] Parameters/TestRpc.TestCallLongerThanKeepalive/SSL_TCP
I20260927 06:57:37.285214   571 acceptor_pool.cc:254] collecting diagnostics on the listening RPC socket 0.0.0.0:39957 every 8 connection(s)
I20260927 06:57:37.285434   572 acceptor_pool.cc:254] collecting diagnostics on the listening RPC socket 0.0.0.0:39957 every 8 connection(s)
I20260927 06:57:37.304706   575 rpc-test-base.h:222] got call: sleep_micros: 3000000 deferred: true
I20260927 06:57:40.306427   575 rpcz_store.cc:275] Call kudu.rpc.GenericCalculatorService.Sleep from 127.0.0.1:45244 (request call id 0) took 3001 ms. Trace:
I20260927 06:57:40.306591   575 rpcz_store.cc:276] 0927 06:57:37.304603 (+     0us) service_pool.cc:170] Inserting onto call queue
0927 06:57:37.304659 (+    56us) service_pool.cc:227] Handling call
0927 06:57:40.306378 (+3001719us) inbound_call.cc:173] Queueing success response
Metrics: {}
[       OK ] Parameters/TestRpc.TestCallLongerThanKeepalive/SSL_TCP (3039 ms)
[ RUN      ] Parameters/TestRpc.TestRpcSidecar/SSL_TCP
I20260927 06:57:40.340555   596 acceptor_pool.cc:254] collecting diagnostics on the listening RPC socket 0.0.0.0:42029 every 8 connection(s)
I20260927 06:57:40.340741   597 acceptor_pool.cc:254] collecting diagnostics on the listening RPC socket 0.0.0.0:42029 every 8 connection(s)
[       OK ] Parameters/TestRpc.TestRpcSidecar/SSL_TCP (135 ms)
[ RUN      ] Parameters/TestRpc.TestRpcSidecarLimits/SSL_TCP
I20260927 06:57:42.480271   621 acceptor_pool.cc:254] collecting diagnostics on the listening RPC socket 0.0.0.0:42269 every 8 connection(s)
I20260927 06:57:42.480489   622 acceptor_pool.cc:254] collecting diagnostics on the listening RPC socket 0.0.0.0:42269 every 8 connection(s)
W20260927 06:57:42.491405   379 serialization.cc:72] Serialized kudu.rpc_test.PushStringsRequestPB (2147483654 bytes) is larger than the maximum configured RPC message size (52428800 bytes). Sending anyway, but peer may reject the data.
W20260927 06:57:42.497444   618 connection.cc:535] server connection from 127.0.0.1:59442 recv error: Network error: RPC frame had a length of 2147483714, but we only support messages up to 52428800 bytes long.
W20260927 06:57:42.497558   618 connection.cc:158] shutting down server connection from 127.0.0.1:59442 with pending inbound data: 4/2147483714 bytes received; last active 0 ns ago: status Network error: RPC frame had a length of 2147483714, but we only support messages up to 52428800 bytes long.
W20260927 06:57:42.498025   634 connection.cc:196] Error closing socket: Network error: TlsSocket::Close: Connection reset by peer
I20260927 06:57:42.523044   646 acceptor_pool.cc:254] collecting diagnostics on the listening RPC socket 0.0.0.0:40435 every 8 connection(s)
I20260927 06:57:42.523105   647 acceptor_pool.cc:254] collecting diagnostics on the listening RPC socket 0.0.0.0:40435 every 8 connection(s)
W20260927 06:57:47.477238   643 connection.cc:577] server connection from 127.0.0.1:35948: received bad data: 'Corruption: Invalid packet: message had a length of 2147483710, but we only support messages up to 2147483647 bytes
'
[       OK ] Parameters/TestRpc.TestRpcSidecarLimits/SSL_TCP (7446 ms)
[ RUN      ] Parameters/TestRpc.TestCallTimeoutDoesntAffectNegotiation/SSL_TCP
I20260927 06:57:47.910598   671 acceptor_pool.cc:254] collecting diagnostics on the listening RPC socket 0.0.0.0:36305 every 8 connection(s)
I20260927 06:57:47.910853   672 acceptor_pool.cc:254] collecting diagnostics on the listening RPC socket 0.0.0.0:36305 every 8 connection(s)
W20260927 06:57:47.935561   667 negotiation.cc:266] Injecting 500ms delay in negotiation
I20260927 06:57:47.985296   379 rpc-test-base.h:595] status: Timed out: connection negotiation to 0.0.0.0:36305 for RPC Sleep timed out after 0.050s (ON_OUTBOUND_QUEUE), seconds elapsed: 0.050366
[       OK ] Parameters/TestRpc.TestCallTimeoutDoesntAffectNegotiation/SSL_TCP (550 ms)
[ RUN      ] Parameters/TestRpc.TestRpcHandlerLatencyMetric/SSL_TCP
I20260927 06:57:48.479899   696 acceptor_pool.cc:254] collecting diagnostics on the listening RPC socket 0.0.0.0:43925 every 8 connection(s)
I20260927 06:57:48.480082   697 acceptor_pool.cc:254] collecting diagnostics on the listening RPC socket 0.0.0.0:43925 every 8 connection(s)
I20260927 06:57:48.519125   379 rpc-test.cc:1236] Sleep() min lat: 20616
I20260927 06:57:48.519229   379 rpc-test.cc:1237] Sleep() mean lat: 20616
I20260927 06:57:48.519290   379 rpc-test.cc:1238] Sleep() max lat: 20616
I20260927 06:57:48.519346   379 rpc-test.cc:1239] Sleep() #calls: 1
[       OK ] Parameters/TestRpc.TestRpcHandlerLatencyMetric/SSL_TCP (78 ms)
[ RUN      ] Parameters/TestRpc.TimedOutOnResponseMetricServiceQueue/SSL_TCP
I20260927 06:57:48.534857   722 acceptor_pool.cc:254] collecting diagnostics on the listening RPC socket 0.0.0.0:44645 every 8 connection(s)
I20260927 06:57:48.535063   723 acceptor_pool.cc:254] collecting diagnostics on the listening RPC socket 0.0.0.0:44645 every 8 connection(s)
W20260927 06:57:48.596870   724 rpcz_store.cc:267] Call kudu.rpc_test.CalculatorService.Sleep from 127.0.0.1:37008 (request call id 2) took 20 ms (client timeout 20 ms). Trace:
W20260927 06:57:48.597035   724 rpcz_store.cc:269] 0927 06:57:48.576432 (+     0us) service_pool.cc:170] Inserting onto call queue
0927 06:57:48.596748 (+ 20316us) service_pool.cc:214] Skipping call since client already timed out
0927 06:57:48.596828 (+    80us) inbound_call.cc:173] Queueing failure response
Metrics: {}
[       OK ] Parameters/TestRpc.TimedOutOnResponseMetricServiceQueue/SSL_TCP (77 ms)
[ RUN      ] Parameters/TestRpc.RpcPendingConnectionsMetric/SSL_TCP
I20260927 06:57:48.605587   745 acceptor_pool.cc:254] collecting diagnostics on the listening RPC socket 0.0.0.0:34613 every 8 connection(s)
I20260927 06:57:48.605818   746 acceptor_pool.cc:254] collecting diagnostics on the listening RPC socket 0.0.0.0:34613 every 8 connection(s)
W20260927 06:57:48.614719   741 negotiation.cc:337] Failed RPC negotiation. Trace:
0927 06:57:48.613891 (+     0us) reactor.cc:625] Submitting negotiation task for server connection from 127.0.0.1:33098 (local address 127.0.0.1:34613)
0927 06:57:48.614091 (+   200us) server_negotiation.cc:206] Beginning negotiation
0927 06:57:48.614098 (+     7us) server_negotiation.cc:399] Waiting for connection header
0927 06:57:48.614281 (+   183us) negotiation.cc:327] Negotiation complete: Network error: Server connection negotiation failed: server connection from 127.0.0.1:33098: BlockingRecv error: recv got EOF from 127.0.0.1:33098 (error 108)
Metrics: {"server-negotiator.queue_time_us":43}
[       OK ] Parameters/TestRpc.RpcPendingConnectionsMetric/SSL_TCP (25 ms)
[ RUN      ] Parameters/TestRpc.TestRpcContextClientDeadline/SSL_TCP
I20260927 06:57:48.643712   761 acceptor_pool.cc:254] collecting diagnostics on the listening RPC socket 0.0.0.0:41337 every 8 connection(s)
I20260927 06:57:48.643921   762 acceptor_pool.cc:254] collecting diagnostics on the listening RPC socket 0.0.0.0:41337 every 8 connection(s)
[       OK ] Parameters/TestRpc.TestRpcContextClientDeadline/SSL_TCP (65 ms)
[ RUN      ] Parameters/TestRpc.TestApplicationFeatureFlagUnsupportedServer/SSL_TCP
I20260927 06:57:48.710167   786 acceptor_pool.cc:254] collecting diagnostics on the listening RPC socket 0.0.0.0:41709 every 8 connection(s)
I20260927 06:57:48.710388   787 acceptor_pool.cc:254] collecting diagnostics on the listening RPC socket 0.0.0.0:41709 every 8 connection(s)
[       OK ] Parameters/TestRpc.TestApplicationFeatureFlagUnsupportedServer/SSL_TCP (40 ms)
[ RUN      ] Parameters/TestRpc.TestCancellationAsync/SSL_TCP
I20260927 06:57:48.747433   811 acceptor_pool.cc:254] collecting diagnostics on the listening RPC socket 0.0.0.0:38473 every 8 connection(s)
I20260927 06:57:48.747644   812 acceptor_pool.cc:254] collecting diagnostics on the listening RPC socket 0.0.0.0:38473 every 8 connection(s)
I20260927 06:57:48.748407   379 rpc-test.cc:1716] Connecting to 0.0.0.0:38473
I20260927 06:57:48.770512   379 test_util.cc:268] Using random seed: 2007446706
I20260927 06:57:48.804813   815 rpc-test-base.h:240] got call: sleep_micros: 500 pattern: 4294967295 num_repetitions: 2097152 sidecar_idx: 0
I20260927 06:57:48.822968   814 rpc-test-base.h:240] got call: sleep_micros: 500 pattern: 4294967295 num_repetitions: 2097152 sidecar_idx: 0
I20260927 06:57:48.847534   813 rpc-test-base.h:240] got call: sleep_micros: 500 pattern: 4294967295 num_repetitions: 2097152 sidecar_idx: 0
I20260927 06:57:48.880671   815 rpc-test-base.h:240] got call: sleep_micros: 500 pattern: 4294967295 num_repetitions: 2097152 sidecar_idx: 0
I20260927 06:57:48.905467   814 rpc-test-base.h:240] got call: sleep_micros: 500 pattern: 4294967295 num_repetitions: 2097152 sidecar_idx: 0
I20260927 06:57:48.930891   813 rpc-test-base.h:240] got call: sleep_micros: 500 pattern: 4294967295 num_repetitions: 2097152 sidecar_idx: 0
W20260927 06:57:48.955251   808 connection.cc:196] Error closing socket: Network error: TlsSocket::Close: Broken pipe
W20260927 06:57:48.961452   808 connection.cc:441] server connection from 127.0.0.1:60936 torn down before Call kudu.rpc.GenericCalculatorService.SleepWithSidecar from 127.0.0.1:60936 (request call id 7) could send its response
W20260927 06:57:48.970181   808 connection.cc:441] server connection from 127.0.0.1:60936 torn down before Call kudu.rpc.GenericCalculatorService.SleepWithSidecar from 127.0.0.1:60936 (request call id 8) could send its response
[       OK ] Parameters/TestRpc.TestCancellationAsync/SSL_TCP (240 ms)
[ RUN      ] Parameters/TestRpc.TestPerformanceBySocketType/SSL_TCP
I20260927 06:57:48.991628   836 acceptor_pool.cc:254] collecting diagnostics on the listening RPC socket 0.0.0.0:36721 every 8 connection(s)
I20260927 06:57:48.991849   837 acceptor_pool.cc:254] collecting diagnostics on the listening RPC socket 0.0.0.0:36721 every 8 connection(s)
I20260927 06:57:48.992626   379 rpc-test.cc:1846] Connecting to 0.0.0.0:36721
I20260927 06:57:51.766036   379 rpc-test.cc:1859] Sending 1024MB via ssl-enabled tcp socket: real 2.756s	user 2.622s	sys 1.965s
I20260927 06:57:54.579502   379 rpc-test.cc:1859] Sending 1024MB via ssl-enabled tcp socket: real 2.813s	user 2.554s	sys 2.139s
I20260927 06:57:57.358080   379 rpc-test.cc:1859] Sending 1024MB via ssl-enabled tcp socket: real 2.778s	user 2.582s	sys 2.049s
I20260927 06:58:00.125093   379 rpc-test.cc:1859] Sending 1024MB via ssl-enabled tcp socket: real 2.767s	user 2.580s	sys 1.994s
I20260927 06:58:03.035760   379 rpc-test.cc:1859] Sending 1024MB via ssl-enabled tcp socket: real 2.911s	user 2.808s	sys 2.050s
[       OK ] Parameters/TestRpc.TestPerformanceBySocketType/SSL_TCP (14069 ms)
[----------] 20 tests from Parameters/TestRpc (45537 ms total)

[----------] 1 test from Parameters/TestRpcSocketTxRxQueue
[ RUN      ] Parameters/TestRpcSocketTxRxQueue.OverCapacity/0
W20260927 06:58:03.335879   862 negotiation.cc:337] Failed RPC negotiation. Trace:
0927 06:58:03.048985 (+     0us) reactor.cc:625] Submitting negotiation task for client connection to 0.0.0.0:36941 (local address 127.0.0.1:39144)
0927 06:58:03.049136 (+   151us) negotiation.cc:107] Waiting for socket to connect
0927 06:58:03.049153 (+    17us) client_negotiation.cc:174] Beginning negotiation
0927 06:58:03.049252 (+    99us) client_negotiation.cc:252] Sending NEGOTIATE NegotiatePB request
0927 06:58:03.335537 (+286285us) negotiation.cc:327] Negotiation complete: Network error: Client connection negotiation failed: client connection to 0.0.0.0:36941: BlockingRecv error: recv error from unknown peer: Transport endpoint is not connected (error 107)
Metrics: {"client-negotiator.queue_time_us":41}
W20260927 06:58:03.336061   889 negotiation.cc:337] Failed RPC negotiation. Trace:
0927 06:58:03.056612 (+     0us) reactor.cc:625] Submitting negotiation task for client connection to 0.0.0.0:36941 (local address 127.0.0.1:39162)
0927 06:58:03.056771 (+   159us) negotiation.cc:107] Waiting for socket to connect
0927 06:58:03.056786 (+    15us) client_negotiation.cc:174] Beginning negotiation
0927 06:58:03.056879 (+    93us) client_negotiation.cc:252] Sending NEGOTIATE NegotiatePB request
0927 06:58:03.335747 (+278868us) negotiation.cc:327] Negotiation complete: Network error: Client connection negotiation failed: client connection to 0.0.0.0:36941: BlockingRecv error: recv error from unknown peer: Transport endpoint is not connected (error 107)
Metrics: {"client-negotiator.queue_time_us":50}
W20260927 06:58:03.336113   898 negotiation.cc:337] Failed RPC negotiation. Trace:
0927 06:58:03.059440 (+     0us) reactor.cc:625] Submitting negotiation task for client connection to 0.0.0.0:36941 (local address 127.0.0.1:39174)
0927 06:58:03.059673 (+   233us) negotiation.cc:107] Waiting for socket to connect
0927 06:58:03.059689 (+    16us) client_negotiation.cc:174] Beginning negotiation
0927 06:58:03.059793 (+   104us) client_negotiation.cc:252] Sending NEGOTIATE NegotiatePB request
0927 06:58:03.335855 (+276062us) negotiation.cc:327] Negotiation complete: Network error: Client connection negotiation failed: client connection to 0.0.0.0:36941: BlockingRecv error: recv error from unknown peer: Transport endpoint is not connected (error 107)
Metrics: {"client-negotiator.queue_time_us":53}
W20260927 06:58:03.336552   880 negotiation.cc:337] Failed RPC negotiation. Trace:
0927 06:58:03.054030 (+     0us) reactor.cc:625] Submitting negotiation task for client connection to 0.0.0.0:36941 (local address 127.0.0.1:39158)
0927 06:58:03.054187 (+   157us) negotiation.cc:107] Waiting for socket to connect
0927 06:58:03.054206 (+    19us) client_negotiation.cc:174] Beginning negotiation
0927 06:58:03.054299 (+    93us) client_negotiation.cc:252] Sending NEGOTIATE NegotiatePB request
0927 06:58:03.335504 (+281205us) negotiation.cc:327] Negotiation complete: Network error: Client connection negotiation failed: client connection to 0.0.0.0:36941: BlockingRecv error: recv error from unknown peer: Transport endpoint is not connected (error 107)
Metrics: {"client-negotiator.queue_time_us":47}
W20260927 06:58:03.337119   853 negotiation.cc:337] Failed RPC negotiation. Trace:
0927 06:58:03.046702 (+     0us) reactor.cc:625] Submitting negotiation task for client connection to 0.0.0.0:36941 (local address 127.0.0.1:39134)
0927 06:58:03.046858 (+   156us) negotiation.cc:107] Waiting for socket to connect
0927 06:58:03.046876 (+    18us) client_negotiation.cc:174] Beginning negotiation
0927 06:58:03.046978 (+   102us) client_negotiation.cc:252] Sending NEGOTIATE NegotiatePB request
0927 06:58:03.335491 (+288513us) negotiation.cc:327] Negotiation complete: Network error: Client connection negotiation failed: client connection to 0.0.0.0:36941: BlockingRecv error: recv error from unknown peer: Transport endpoint is not connected (error 107)
Metrics: {"client-negotiator.queue_time_us":44}
W20260927 06:58:03.337139   871 negotiation.cc:337] Failed RPC negotiation. Trace:
0927 06:58:03.051502 (+     0us) reactor.cc:625] Submitting negotiation task for client connection to 0.0.0.0:36941 (local address 127.0.0.1:39148)
0927 06:58:03.051654 (+   152us) negotiation.cc:107] Waiting for socket to connect
0927 06:58:03.051670 (+    16us) client_negotiation.cc:174] Beginning negotiation
0927 06:58:03.051769 (+    99us) client_negotiation.cc:252] Sending NEGOTIATE NegotiatePB request
0927 06:58:03.335582 (+283813us) negotiation.cc:327] Negotiation complete: Network error: Client connection negotiation failed: client connection to 0.0.0.0:36941: BlockingRecv error: recv error from unknown peer: Transport endpoint is not connected (error 107)
Metrics: {"client-negotiator.queue_time_us":51}
[       OK ] Parameters/TestRpcSocketTxRxQueue.OverCapacity/0 (1064 ms)
[----------] 1 test from Parameters/TestRpcSocketTxRxQueue (1064 ms total)

[----------] Global test environment tear-down
[==========] 21 tests from 2 test suites ran. (46602 ms total)
[  PASSED  ] 20 tests.
[  FAILED  ] 1 test, listed below:
[  FAILED  ] Parameters/TestRpc.TestCallWithChainCertAndChainCA/SSL_TCP, where GetParam() = (true, false)

 1 FAILED TEST