Diagnosed failure

Parameters/TestRpc.TestCallWithChainCertAndChainCA/SSL_TCP: /data0/somelongdirectorytoavoidrpathissues/src/kudu/src/kudu/rpc/rpc-test.cc:270: Failure
Failed
Bad status: Runtime error: could not verify certificate chain (error with cert: subject=CN = localhost, ST = sadfjas, C = AS, emailAddress = sdflkdsajf, O = lskdfjlsad, OU = sldfkja, issuer=C = AS, ST = ASDfkjdhf, L = lskdjf, O = saldfja, OU = skdjf, CN = localhost, emailAddress = sadjflkadsj): : certificate has expired
Google Test trace:
/data0/somelongdirectorytoavoidrpathissues/src/kudu/src/kudu/rpc/rpc-test.cc:267: Connecting to 0.0.0.0:41669
I20260926 19:30:00.702114   379 test_util.cc:175] -----------------------------------------------
I20260926 19:30:00.702193   379 test_util.cc:176] Had fatal failures, leaving test files at /tmp/dist-test-task9XuW6T/test-tmp/rpc-test.5.Parameters_TestRpc.TestCallWithChainCertAndChainCA_SSL_TCP.1790451000550278-379-0

Full log

Note: This is test shard 6 of 8.
[==========] Running 21 tests from 2 test suites.
[----------] Global test environment set-up.
[----------] 20 tests from Parameters/TestRpc
[ RUN      ] Parameters/TestRpc.TestMessengerCreateDestroy/SSL_TCP
WARNING: Logging before InitGoogleLogging() is written to STDERR
I20260926 19:30:00.610263   379 rpc-test.cc:169] started messenger TestCreateDestroy
[       OK ] Parameters/TestRpc.TestMessengerCreateDestroy/SSL_TCP (44 ms)
[ RUN      ] Parameters/TestRpc.TestNegotiationDeadlock/SSL_TCP
I20260926 19:30:00.652119   399 acceptor_pool.cc:254] collecting diagnostics on the listening RPC socket 0.0.0.0:37199 every 8 connection(s)
I20260926 19:30:00.652273   400 acceptor_pool.cc:254] collecting diagnostics on the listening RPC socket 0.0.0.0:37199 every 8 connection(s)
[       OK ] Parameters/TestRpc.TestNegotiationDeadlock/SSL_TCP (58 ms)
[ RUN      ] Parameters/TestRpc.TestCallWithChainCertAndChainCA/SSL_TCP
I20260926 19:30:00.691031   415 acceptor_pool.cc:254] collecting diagnostics on the listening RPC socket 0.0.0.0:41669 every 8 connection(s)
I20260926 19:30:00.691366   416 acceptor_pool.cc:254] collecting diagnostics on the listening RPC socket 0.0.0.0:41669 every 8 connection(s)
/data0/somelongdirectorytoavoidrpathissues/src/kudu/src/kudu/rpc/rpc-test.cc:270: Failure
Failed
Bad status: Runtime error: could not verify certificate chain (error with cert: subject=CN = localhost, ST = sadfjas, C = AS, emailAddress = sdflkdsajf, O = lskdfjlsad, OU = sldfkja, issuer=C = AS, ST = ASDfkjdhf, L = lskdjf, O = saldfja, OU = skdjf, CN = localhost, emailAddress = sadjflkadsj): : certificate has expired
Google Test trace:
/data0/somelongdirectorytoavoidrpathissues/src/kudu/src/kudu/rpc/rpc-test.cc:267: Connecting to 0.0.0.0:41669
I20260926 19:30:00.702114   379 test_util.cc:175] -----------------------------------------------
I20260926 19:30:00.702193   379 test_util.cc:176] Had fatal failures, leaving test files at /tmp/dist-test-task9XuW6T/test-tmp/rpc-test.5.Parameters_TestRpc.TestCallWithChainCertAndChainCA_SSL_TCP.1790451000550278-379-0
[  FAILED  ] Parameters/TestRpc.TestCallWithChainCertAndChainCA/SSL_TCP, where GetParam() = (true, false) (30 ms)
[ RUN      ] Parameters/TestRpc.TestCallWithPasswordProtectedKey/SSL_TCP
I20260926 19:30:00.718345   440 acceptor_pool.cc:254] collecting diagnostics on the listening RPC socket 0.0.0.0:44881 every 8 connection(s)
I20260926 19:30:00.718568   441 acceptor_pool.cc:254] collecting diagnostics on the listening RPC socket 0.0.0.0:44881 every 8 connection(s)
[       OK ] Parameters/TestRpc.TestCallWithPasswordProtectedKey/SSL_TCP (49 ms)
[ RUN      ] Parameters/TestRpc.TestCallToBadServer/SSL_TCP
I20260926 19:30:00.762634   379 rpc-test.cc:394] Status: Network error: Client connection negotiation failed: client connection to 0.0.0.0:0: connect: Connection refused (error 111)
I20260926 19:30:00.763403   379 rpc-test.cc:394] Status: Network error: Client connection negotiation failed: client connection to 0.0.0.0:0: connect: Connection refused (error 111)
I20260926 19:30:00.764000   379 rpc-test.cc:394] Status: Network error: Client connection negotiation failed: client connection to 0.0.0.0:0: connect: Connection refused (error 111)
I20260926 19:30:00.764592   379 rpc-test.cc:394] Status: Network error: Client connection negotiation failed: client connection to 0.0.0.0:0: connect: Connection refused (error 111)
I20260926 19:30:00.765208   379 rpc-test.cc:394] Status: Network error: Client connection negotiation failed: client connection to 0.0.0.0:0: connect: Connection refused (error 111)
[       OK ] Parameters/TestRpc.TestCallToBadServer/SSL_TCP (14 ms)
[ RUN      ] Parameters/TestRpc.TestWrongService/SSL_TCP
I20260926 19:30:00.801280   475 acceptor_pool.cc:254] collecting diagnostics on the listening RPC socket 0.0.0.0:41937 every 8 connection(s)
I20260926 19:30:00.801569   476 acceptor_pool.cc:254] collecting diagnostics on the listening RPC socket 0.0.0.0:41937 every 8 connection(s)
I20260926 19:30:00.820005   473 messenger.cc:345] service WrongServiceName not registered on TestServer
[       OK ] Parameters/TestRpc.TestWrongService/SSL_TCP (57 ms)
[ RUN      ] Parameters/TestRpc.TestConnectionKeepalive/SSL_TCP
I20260926 19:30:00.837209   498 acceptor_pool.cc:254] collecting diagnostics on the listening RPC socket 0.0.0.0:36209 every 8 connection(s)
I20260926 19:30:00.837491   499 acceptor_pool.cc:254] collecting diagnostics on the listening RPC socket 0.0.0.0:36209 every 8 connection(s)
I20260926 19:30:00.838351   379 rpc-test.cc:488] Connecting to 0.0.0.0:36209
[       OK ] Parameters/TestRpc.TestConnectionKeepalive/SSL_TCP (1058 ms)
[ RUN      ] Parameters/TestRpc.TestClientConnectionMetrics/SSL_TCP
I20260926 19:30:01.911455   523 acceptor_pool.cc:254] collecting diagnostics on the listening RPC socket 0.0.0.0:42527 every 8 connection(s)
I20260926 19:30:01.911742   524 acceptor_pool.cc:254] collecting diagnostics on the listening RPC socket 0.0.0.0:42527 every 8 connection(s)
I20260926 19:30:01.912686   379 rpc-test.cc:569] Connecting to 0.0.0.0:42527
[       OK ] Parameters/TestRpc.TestClientConnectionMetrics/SSL_TCP (19705 ms)
[ RUN      ] Parameters/TestRpc.TestCredentialsPolicy/SSL_TCP
I20260926 19:30:21.626307   546 acceptor_pool.cc:254] collecting diagnostics on the listening RPC socket 0.0.0.0:39303 every 8 connection(s)
I20260926 19:30:21.626559   547 acceptor_pool.cc:254] collecting diagnostics on the listening RPC socket 0.0.0.0:39303 every 8 connection(s)
I20260926 19:30:21.627851   379 rpc-test.cc:700] Connecting to 0.0.0.0:39303
[       OK ] Parameters/TestRpc.TestCredentialsPolicy/SSL_TCP (87 ms)
[ RUN      ] Parameters/TestRpc.TestCallLongerThanKeepalive/SSL_TCP
I20260926 19:30:21.706188   571 acceptor_pool.cc:254] collecting diagnostics on the listening RPC socket 0.0.0.0:34213 every 8 connection(s)
I20260926 19:30:21.706503   572 acceptor_pool.cc:254] collecting diagnostics on the listening RPC socket 0.0.0.0:34213 every 8 connection(s)
I20260926 19:30:21.722874   575 rpc-test-base.h:222] got call: sleep_micros: 3000000 deferred: true
I20260926 19:30:24.724788   575 rpcz_store.cc:275] Call kudu.rpc.GenericCalculatorService.Sleep from 127.0.0.1:47828 (request call id 0) took 3002 ms. Trace:
I20260926 19:30:24.724969   575 rpcz_store.cc:276] 0926 19:30:21.722769 (+     0us) service_pool.cc:170] Inserting onto call queue
0926 19:30:21.722829 (+    60us) service_pool.cc:227] Handling call
0926 19:30:24.724734 (+3001905us) inbound_call.cc:173] Queueing success response
Metrics: {}
[       OK ] Parameters/TestRpc.TestCallLongerThanKeepalive/SSL_TCP (3053 ms)
[ RUN      ] Parameters/TestRpc.TestRpcSidecar/SSL_TCP
I20260926 19:30:24.753356   596 acceptor_pool.cc:254] collecting diagnostics on the listening RPC socket 0.0.0.0:37559 every 8 connection(s)
I20260926 19:30:24.753674   597 acceptor_pool.cc:254] collecting diagnostics on the listening RPC socket 0.0.0.0:37559 every 8 connection(s)
[       OK ] Parameters/TestRpc.TestRpcSidecar/SSL_TCP (123 ms)
[ RUN      ] Parameters/TestRpc.TestRpcSidecarLimits/SSL_TCP
I20260926 19:30:27.153774   621 acceptor_pool.cc:254] collecting diagnostics on the listening RPC socket 0.0.0.0:41791 every 8 connection(s)
I20260926 19:30:27.154083   622 acceptor_pool.cc:254] collecting diagnostics on the listening RPC socket 0.0.0.0:41791 every 8 connection(s)
W20260926 19:30:27.200126   379 serialization.cc:72] Serialized kudu.rpc_test.PushStringsRequestPB (2147483654 bytes) is larger than the maximum configured RPC message size (52428800 bytes). Sending anyway, but peer may reject the data.
W20260926 19:30:27.207059   618 connection.cc:535] server connection from 127.0.0.1:60880 recv error: Network error: RPC frame had a length of 2147483714, but we only support messages up to 52428800 bytes long.
W20260926 19:30:27.207226   618 connection.cc:158] shutting down server connection from 127.0.0.1:60880 with pending inbound data: 4/2147483714 bytes received; last active 0 ns ago: status Network error: RPC frame had a length of 2147483714, but we only support messages up to 52428800 bytes long.
W20260926 19:30:27.207921   634 connection.cc:196] Error closing socket: Network error: TlsSocket::Close: Connection reset by peer
I20260926 19:30:27.241657   646 acceptor_pool.cc:254] collecting diagnostics on the listening RPC socket 0.0.0.0:33833 every 8 connection(s)
I20260926 19:30:27.241858   647 acceptor_pool.cc:254] collecting diagnostics on the listening RPC socket 0.0.0.0:33833 every 8 connection(s)
W20260926 19:30:32.885430   645 connection.cc:577] server connection from 127.0.0.1:55126: received bad data: 'Corruption: Invalid packet: message had a length of 2147483710, but we only support messages up to 2147483647 bytes
'
[       OK ] Parameters/TestRpc.TestRpcSidecarLimits/SSL_TCP (8542 ms)
[ RUN      ] Parameters/TestRpc.TestCallTimeoutDoesntAffectNegotiation/SSL_TCP
I20260926 19:30:33.414646   671 acceptor_pool.cc:254] collecting diagnostics on the listening RPC socket 0.0.0.0:37693 every 8 connection(s)
I20260926 19:30:33.414922   672 acceptor_pool.cc:254] collecting diagnostics on the listening RPC socket 0.0.0.0:37693 every 8 connection(s)
W20260926 19:30:33.433779   667 negotiation.cc:266] Injecting 500ms delay in negotiation
I20260926 19:30:33.484333   379 rpc-test-base.h:595] status: Timed out: connection negotiation to 0.0.0.0:37693 for RPC Sleep timed out after 0.050s (ON_OUTBOUND_QUEUE), seconds elapsed: 0.0513891
[       OK ] Parameters/TestRpc.TestCallTimeoutDoesntAffectNegotiation/SSL_TCP (548 ms)
[ RUN      ] Parameters/TestRpc.TestRpcHandlerLatencyMetric/SSL_TCP
I20260926 19:30:33.957777   696 acceptor_pool.cc:254] collecting diagnostics on the listening RPC socket 0.0.0.0:45855 every 8 connection(s)
I20260926 19:30:33.957988   697 acceptor_pool.cc:254] collecting diagnostics on the listening RPC socket 0.0.0.0:45855 every 8 connection(s)
I20260926 19:30:33.997066   379 rpc-test.cc:1236] Sleep() min lat: 20838
I20260926 19:30:33.997181   379 rpc-test.cc:1237] Sleep() mean lat: 20838
I20260926 19:30:33.997228   379 rpc-test.cc:1238] Sleep() max lat: 20838
I20260926 19:30:33.997251   379 rpc-test.cc:1239] Sleep() #calls: 1
[       OK ] Parameters/TestRpc.TestRpcHandlerLatencyMetric/SSL_TCP (57 ms)
[ RUN      ] Parameters/TestRpc.TimedOutOnResponseMetricServiceQueue/SSL_TCP
I20260926 19:30:34.023831   722 acceptor_pool.cc:254] collecting diagnostics on the listening RPC socket 0.0.0.0:41111 every 8 connection(s)
I20260926 19:30:34.024035   723 acceptor_pool.cc:254] collecting diagnostics on the listening RPC socket 0.0.0.0:41111 every 8 connection(s)
W20260926 19:30:34.092132   724 rpcz_store.cc:267] Call kudu.rpc_test.CalculatorService.Sleep from 127.0.0.1:45498 (request call id 2) took 20 ms (client timeout 20 ms). Trace:
W20260926 19:30:34.092357   724 rpcz_store.cc:269] 0926 19:30:34.071519 (+     0us) service_pool.cc:170] Inserting onto call queue
0926 19:30:34.092037 (+ 20518us) service_pool.cc:214] Skipping call since client already timed out
0926 19:30:34.092107 (+    70us) inbound_call.cc:173] Queueing failure response
Metrics: {}
[       OK ] Parameters/TestRpc.TimedOutOnResponseMetricServiceQueue/SSL_TCP (93 ms)
[ RUN      ] Parameters/TestRpc.RpcPendingConnectionsMetric/SSL_TCP
I20260926 19:30:34.102530   745 acceptor_pool.cc:254] collecting diagnostics on the listening RPC socket 0.0.0.0:38771 every 8 connection(s)
I20260926 19:30:34.102766   746 acceptor_pool.cc:254] collecting diagnostics on the listening RPC socket 0.0.0.0:38771 every 8 connection(s)
W20260926 19:30:34.114187   741 negotiation.cc:337] Failed RPC negotiation. Trace:
0926 19:30:34.113183 (+     0us) reactor.cc:625] Submitting negotiation task for server connection from 127.0.0.1:54994 (local address 127.0.0.1:38771)
0926 19:30:34.113455 (+   272us) server_negotiation.cc:206] Beginning negotiation
0926 19:30:34.113463 (+     8us) server_negotiation.cc:399] Waiting for connection header
0926 19:30:34.113685 (+   222us) negotiation.cc:327] Negotiation complete: Network error: Server connection negotiation failed: server connection from 127.0.0.1:54994: BlockingRecv error: recv got EOF from 127.0.0.1:54994 (error 108)
Metrics: {"server-negotiator.queue_time_us":94}
[       OK ] Parameters/TestRpc.RpcPendingConnectionsMetric/SSL_TCP (30 ms)
[ RUN      ] Parameters/TestRpc.TestRpcContextClientDeadline/SSL_TCP
I20260926 19:30:34.145222   761 acceptor_pool.cc:254] collecting diagnostics on the listening RPC socket 0.0.0.0:45043 every 8 connection(s)
I20260926 19:30:34.145445   762 acceptor_pool.cc:254] collecting diagnostics on the listening RPC socket 0.0.0.0:45043 every 8 connection(s)
[       OK ] Parameters/TestRpc.TestRpcContextClientDeadline/SSL_TCP (70 ms)
[ RUN      ] Parameters/TestRpc.TestApplicationFeatureFlagUnsupportedServer/SSL_TCP
I20260926 19:30:34.240223   786 acceptor_pool.cc:254] collecting diagnostics on the listening RPC socket 0.0.0.0:35817 every 8 connection(s)
I20260926 19:30:34.240481   787 acceptor_pool.cc:254] collecting diagnostics on the listening RPC socket 0.0.0.0:35817 every 8 connection(s)
[       OK ] Parameters/TestRpc.TestApplicationFeatureFlagUnsupportedServer/SSL_TCP (70 ms)
[ RUN      ] Parameters/TestRpc.TestCancellationAsync/SSL_TCP
I20260926 19:30:34.317801   811 acceptor_pool.cc:254] collecting diagnostics on the listening RPC socket 0.0.0.0:45233 every 8 connection(s)
I20260926 19:30:34.318045   812 acceptor_pool.cc:254] collecting diagnostics on the listening RPC socket 0.0.0.0:45233 every 8 connection(s)
I20260926 19:30:34.318898   379 rpc-test.cc:1716] Connecting to 0.0.0.0:45233
I20260926 19:30:34.332455   379 test_util.cc:268] Using random seed: -572285694
I20260926 19:30:34.372241   815 rpc-test-base.h:240] got call: sleep_micros: 500 pattern: 4294967295 num_repetitions: 2097152 sidecar_idx: 0
I20260926 19:30:34.399317   814 rpc-test-base.h:240] got call: sleep_micros: 500 pattern: 4294967295 num_repetitions: 2097152 sidecar_idx: 0
I20260926 19:30:34.435446   815 rpc-test-base.h:240] got call: sleep_micros: 500 pattern: 4294967295 num_repetitions: 2097152 sidecar_idx: 0
I20260926 19:30:34.466393   814 rpc-test-base.h:240] got call: sleep_micros: 500 pattern: 4294967295 num_repetitions: 2097152 sidecar_idx: 0
I20260926 19:30:34.498044   815 rpc-test-base.h:240] got call: sleep_micros: 500 pattern: 4294967295 num_repetitions: 2097152 sidecar_idx: 0
I20260926 19:30:34.529815   814 rpc-test-base.h:240] got call: sleep_micros: 500 pattern: 4294967295 num_repetitions: 2097152 sidecar_idx: 0
W20260926 19:30:34.550303   810 connection.cc:196] Error closing socket: Network error: TlsSocket::Close: Broken pipe
W20260926 19:30:34.556589   810 connection.cc:441] server connection from 127.0.0.1:36458 torn down before Call kudu.rpc.GenericCalculatorService.SleepWithSidecar from 127.0.0.1:36458 (request call id 7) could send its response
W20260926 19:30:34.575140   810 connection.cc:441] server connection from 127.0.0.1:36458 torn down before Call kudu.rpc.GenericCalculatorService.SleepWithSidecar from 127.0.0.1:36458 (request call id 8) could send its response
[       OK ] Parameters/TestRpc.TestCancellationAsync/SSL_TCP (310 ms)
[ RUN      ] Parameters/TestRpc.TestPerformanceBySocketType/SSL_TCP
I20260926 19:30:34.595992   836 acceptor_pool.cc:254] collecting diagnostics on the listening RPC socket 0.0.0.0:46275 every 8 connection(s)
I20260926 19:30:34.596233   837 acceptor_pool.cc:254] collecting diagnostics on the listening RPC socket 0.0.0.0:46275 every 8 connection(s)
I20260926 19:30:34.597234   379 rpc-test.cc:1846] Connecting to 0.0.0.0:46275
I20260926 19:30:37.966007   379 rpc-test.cc:1859] Sending 1024MB via ssl-enabled tcp socket: real 3.359s	user 2.810s	sys 2.733s
I20260926 19:30:41.314949   379 rpc-test.cc:1859] Sending 1024MB via ssl-enabled tcp socket: real 3.349s	user 2.918s	sys 2.646s
I20260926 19:30:44.675109   379 rpc-test.cc:1859] Sending 1024MB via ssl-enabled tcp socket: real 3.360s	user 2.943s	sys 2.672s
I20260926 19:30:47.697996   379 rpc-test.cc:1859] Sending 1024MB via ssl-enabled tcp socket: real 3.023s	user 2.924s	sys 2.151s
I20260926 19:30:50.541433   379 rpc-test.cc:1859] Sending 1024MB via ssl-enabled tcp socket: real 2.843s	user 2.581s	sys 2.162s
[       OK ] Parameters/TestRpc.TestPerformanceBySocketType/SSL_TCP (15968 ms)
[----------] 20 tests from Parameters/TestRpc (49979 ms total)

[----------] 1 test from Parameters/TestRpcSocketTxRxQueue
[ RUN      ] Parameters/TestRpcSocketTxRxQueue.OverCapacity/0
W20260926 19:30:50.841682   871 negotiation.cc:337] Failed RPC negotiation. Trace:
0926 19:30:50.556881 (+     0us) reactor.cc:625] Submitting negotiation task for client connection to 0.0.0.0:40771 (local address 127.0.0.1:55418)
0926 19:30:50.557039 (+   158us) negotiation.cc:107] Waiting for socket to connect
0926 19:30:50.557061 (+    22us) client_negotiation.cc:174] Beginning negotiation
0926 19:30:50.557129 (+    68us) client_negotiation.cc:252] Sending NEGOTIATE NegotiatePB request
0926 19:30:50.841290 (+284161us) negotiation.cc:327] Negotiation complete: Network error: Client connection negotiation failed: client connection to 0.0.0.0:40771: BlockingRecv error: recv error from unknown peer: Transport endpoint is not connected (error 107)
Metrics: {"client-negotiator.queue_time_us":61}
W20260926 19:30:50.842084   853 negotiation.cc:337] Failed RPC negotiation. Trace:
0926 19:30:50.552501 (+     0us) reactor.cc:625] Submitting negotiation task for client connection to 0.0.0.0:40771 (local address 127.0.0.1:55402)
0926 19:30:50.552666 (+   165us) negotiation.cc:107] Waiting for socket to connect
0926 19:30:50.552683 (+    17us) client_negotiation.cc:174] Beginning negotiation
0926 19:30:50.552789 (+   106us) client_negotiation.cc:252] Sending NEGOTIATE NegotiatePB request
0926 19:30:50.841167 (+288378us) negotiation.cc:327] Negotiation complete: Network error: Client connection negotiation failed: client connection to 0.0.0.0:40771: BlockingRecv error: recv error from unknown peer: Transport endpoint is not connected (error 107)
Metrics: {"client-negotiator.queue_time_us":50}
W20260926 19:30:50.842393   862 negotiation.cc:337] Failed RPC negotiation. Trace:
0926 19:30:50.554663 (+     0us) reactor.cc:625] Submitting negotiation task for client connection to 0.0.0.0:40771 (local address 127.0.0.1:55404)
0926 19:30:50.554826 (+   163us) negotiation.cc:107] Waiting for socket to connect
0926 19:30:50.554840 (+    14us) client_negotiation.cc:174] Beginning negotiation
0926 19:30:50.554923 (+    83us) client_negotiation.cc:252] Sending NEGOTIATE NegotiatePB request
0926 19:30:50.841352 (+286429us) negotiation.cc:327] Negotiation complete: Network error: Client connection negotiation failed: client connection to 0.0.0.0:40771: BlockingRecv error: recv error from unknown peer: Transport endpoint is not connected (error 107)
Metrics: {"client-negotiator.queue_time_us":51}
W20260926 19:30:50.843915   880 negotiation.cc:337] Failed RPC negotiation. Trace:
0926 19:30:50.559318 (+     0us) reactor.cc:625] Submitting negotiation task for client connection to 0.0.0.0:40771 (local address 127.0.0.1:55428)
0926 19:30:50.559457 (+   139us) negotiation.cc:107] Waiting for socket to connect
0926 19:30:50.559470 (+    13us) client_negotiation.cc:174] Beginning negotiation
0926 19:30:50.559555 (+    85us) client_negotiation.cc:252] Sending NEGOTIATE NegotiatePB request
0926 19:30:50.841167 (+281612us) negotiation.cc:327] Negotiation complete: Network error: Client connection negotiation failed: client connection to 0.0.0.0:40771: BlockingRecv error: recv error from unknown peer: Transport endpoint is not connected (error 107)
Metrics: {"client-negotiator.queue_time_us":28}
W20260926 19:30:50.845685   898 negotiation.cc:337] Failed RPC negotiation. Trace:
0926 19:30:50.564477 (+     0us) reactor.cc:625] Submitting negotiation task for client connection to 0.0.0.0:40771 (local address 127.0.0.1:55440)
0926 19:30:50.564668 (+   191us) negotiation.cc:107] Waiting for socket to connect
0926 19:30:50.564683 (+    15us) client_negotiation.cc:174] Beginning negotiation
0926 19:30:50.564773 (+    90us) client_negotiation.cc:252] Sending NEGOTIATE NegotiatePB request
0926 19:30:50.841425 (+276652us) negotiation.cc:327] Negotiation complete: Network error: Client connection negotiation failed: client connection to 0.0.0.0:40771: BlockingRecv error: recv error from unknown peer: Transport endpoint is not connected (error 107)
Metrics: {"client-negotiator.queue_time_us":57}
W20260926 19:30:50.847256   889 negotiation.cc:337] Failed RPC negotiation. Trace:
0926 19:30:50.561704 (+     0us) reactor.cc:625] Submitting negotiation task for client connection to 0.0.0.0:40771 (local address 127.0.0.1:55436)
0926 19:30:50.561852 (+   148us) negotiation.cc:107] Waiting for socket to connect
0926 19:30:50.561869 (+    17us) client_negotiation.cc:174] Beginning negotiation
0926 19:30:50.561965 (+    96us) client_negotiation.cc:252] Sending NEGOTIATE NegotiatePB request
0926 19:30:50.842215 (+280250us) negotiation.cc:327] Negotiation complete: Network error: Client connection negotiation failed: client connection to 0.0.0.0:40771: BlockingRecv error: recv error from unknown peer: Transport endpoint is not connected (error 107)
Metrics: {"client-negotiator.queue_time_us":29}
[       OK ] Parameters/TestRpcSocketTxRxQueue.OverCapacity/0 (1058 ms)
[----------] 1 test from Parameters/TestRpcSocketTxRxQueue (1058 ms total)

[----------] Global test environment tear-down
[==========] 21 tests from 2 test suites ran. (51038 ms total)
[  PASSED  ] 20 tests.
[  FAILED  ] 1 test, listed below:
[  FAILED  ] Parameters/TestRpc.TestCallWithChainCertAndChainCA/SSL_TCP, where GetParam() = (true, false)

 1 FAILED TEST