Diagnosed failure
Parameters/TestRpc.TestCallWithChainCertAndChainCA/SSL_UnixSocket: /data0/somelongdirectorytoavoidrpathissues/src/kudu/src/kudu/rpc/rpc-test.cc:270: Failure
Failed
Bad status: Runtime error: could not verify certificate chain (error with cert: subject=CN = localhost, ST = sadfjas, C = AS, emailAddress = sdflkdsajf, O = lskdfjlsad, OU = sldfkja, issuer=C = AS, ST = ASDfkjdhf, L = lskdjf, O = saldfja, OU = skdjf, CN = localhost, emailAddress = sadjflkadsj): : certificate has expired
Google Test trace:
/data0/somelongdirectorytoavoidrpathissues/src/kudu/src/kudu/rpc/rpc-test.cc:267: Connecting to unix:/tmp/dist-test-tasknQ0V69/test-tmp/rpc-test-d42df941553b4be9a3f2e4110bcf6870.sock
I20260924 14:27:48.163043 14694 test_util.cc:175] -----------------------------------------------
I20260924 14:27:48.163239 14694 test_util.cc:176] Had fatal failures, leaving test files at /tmp/dist-test-tasknQ0V69/test-tmp/rpc-test.6.Parameters_TestRpc.TestCallWithChainCertAndChainCA_SSL_UnixSocket.1790260066784695-14694-0
Full log
Note: This is test shard 7 of 8.
[==========] Running 21 tests from 2 test suites.
[----------] Global test environment set-up.
[----------] 20 tests from Parameters/TestRpc
[ RUN ] Parameters/TestRpc.TestMessengerCreateDestroy/SSL_UnixSocket
WARNING: Logging before InitGoogleLogging() is written to STDERR
I20260924 14:27:46.878190 14694 rpc-test.cc:169] started messenger TestCreateDestroy
[ OK ] Parameters/TestRpc.TestMessengerCreateDestroy/SSL_UnixSocket (1176 ms)
[ RUN ] Parameters/TestRpc.TestNegotiationDeadlock/SSL_UnixSocket
I20260924 14:27:48.041834 14716 acceptor_pool.cc:254] collecting diagnostics on the listening RPC socket unix:/tmp/dist-test-tasknQ0V69/test-tmp/rpc-test-df0e77ba29674824a53fefac9d6c495b.sock every 8 connection(s)
I20260924 14:27:48.043598 14717 acceptor_pool.cc:254] collecting diagnostics on the listening RPC socket unix:/tmp/dist-test-tasknQ0V69/test-tmp/rpc-test-df0e77ba29674824a53fefac9d6c495b.sock every 8 connection(s)
[ OK ] Parameters/TestRpc.TestNegotiationDeadlock/SSL_UnixSocket (82 ms)
[ RUN ] Parameters/TestRpc.TestCallWithChainCertAndChainCA/SSL_UnixSocket
I20260924 14:27:48.132193 14732 acceptor_pool.cc:254] collecting diagnostics on the listening RPC socket unix:/tmp/dist-test-tasknQ0V69/test-tmp/rpc-test-d42df941553b4be9a3f2e4110bcf6870.sock every 8 connection(s)
I20260924 14:27:48.134552 14733 acceptor_pool.cc:254] collecting diagnostics on the listening RPC socket unix:/tmp/dist-test-tasknQ0V69/test-tmp/rpc-test-d42df941553b4be9a3f2e4110bcf6870.sock every 8 connection(s)
/data0/somelongdirectorytoavoidrpathissues/src/kudu/src/kudu/rpc/rpc-test.cc:270: Failure
Failed
Bad status: Runtime error: could not verify certificate chain (error with cert: subject=CN = localhost, ST = sadfjas, C = AS, emailAddress = sdflkdsajf, O = lskdfjlsad, OU = sldfkja, issuer=C = AS, ST = ASDfkjdhf, L = lskdjf, O = saldfja, OU = skdjf, CN = localhost, emailAddress = sadjflkadsj): : certificate has expired
Google Test trace:
/data0/somelongdirectorytoavoidrpathissues/src/kudu/src/kudu/rpc/rpc-test.cc:267: Connecting to unix:/tmp/dist-test-tasknQ0V69/test-tmp/rpc-test-d42df941553b4be9a3f2e4110bcf6870.sock
I20260924 14:27:48.163043 14694 test_util.cc:175] -----------------------------------------------
I20260924 14:27:48.163239 14694 test_util.cc:176] Had fatal failures, leaving test files at /tmp/dist-test-tasknQ0V69/test-tmp/rpc-test.6.Parameters_TestRpc.TestCallWithChainCertAndChainCA_SSL_UnixSocket.1790260066784695-14694-0
[ FAILED ] Parameters/TestRpc.TestCallWithChainCertAndChainCA/SSL_UnixSocket, where GetParam() = (true, true) (64 ms)
[ RUN ] Parameters/TestRpc.TestCallWithPasswordProtectedKey/SSL_UnixSocket
I20260924 14:27:48.186391 14757 acceptor_pool.cc:254] collecting diagnostics on the listening RPC socket unix:/tmp/dist-test-tasknQ0V69/test-tmp/rpc-test-0cecb8000f7044368226402be90dc5f4.sock every 8 connection(s)
I20260924 14:27:48.187147 14758 acceptor_pool.cc:254] collecting diagnostics on the listening RPC socket unix:/tmp/dist-test-tasknQ0V69/test-tmp/rpc-test-0cecb8000f7044368226402be90dc5f4.sock every 8 connection(s)
W20260924 14:27:48.234723 14754 connection.cc:196] Error closing socket: Network error: TlsSocket::Close: Broken pipe
[ OK ] Parameters/TestRpc.TestCallWithPasswordProtectedKey/SSL_UnixSocket (82 ms)
[ RUN ] Parameters/TestRpc.TestCallToBadServer/SSL_UnixSocket
I20260924 14:27:48.274791 14694 rpc-test.cc:394] Status: Network error: Client connection negotiation failed: client connection to 0.0.0.0:0: connect: Connection refused (error 111)
I20260924 14:27:48.276257 14694 rpc-test.cc:394] Status: Network error: Client connection negotiation failed: client connection to 0.0.0.0:0: connect: Connection refused (error 111)
I20260924 14:27:48.277596 14694 rpc-test.cc:394] Status: Network error: Client connection negotiation failed: client connection to 0.0.0.0:0: connect: Connection refused (error 111)
I20260924 14:27:48.279017 14694 rpc-test.cc:394] Status: Network error: Client connection negotiation failed: client connection to 0.0.0.0:0: connect: Connection refused (error 111)
I20260924 14:27:48.280397 14694 rpc-test.cc:394] Status: Network error: Client connection negotiation failed: client connection to 0.0.0.0:0: connect: Connection refused (error 111)
[ OK ] Parameters/TestRpc.TestCallToBadServer/SSL_UnixSocket (37 ms)
[ RUN ] Parameters/TestRpc.TestWrongService/SSL_UnixSocket
I20260924 14:27:48.301338 14792 acceptor_pool.cc:254] collecting diagnostics on the listening RPC socket unix:/tmp/dist-test-tasknQ0V69/test-tmp/rpc-test-d68e65f1cd3d415891bfb7f36e17a082.sock every 8 connection(s)
I20260924 14:27:48.302250 14793 acceptor_pool.cc:254] collecting diagnostics on the listening RPC socket unix:/tmp/dist-test-tasknQ0V69/test-tmp/rpc-test-d68e65f1cd3d415891bfb7f36e17a082.sock every 8 connection(s)
I20260924 14:27:48.347782 14789 messenger.cc:345] service WrongServiceName not registered on TestServer
[ OK ] Parameters/TestRpc.TestWrongService/SSL_UnixSocket (72 ms)
[ RUN ] Parameters/TestRpc.TestConnectionKeepalive/SSL_UnixSocket
I20260924 14:27:48.382212 14815 acceptor_pool.cc:254] collecting diagnostics on the listening RPC socket unix:/tmp/dist-test-tasknQ0V69/test-tmp/rpc-test-ee0ab470fdf44b539e07d2983d9ffa56.sock every 8 connection(s)
I20260924 14:27:48.383020 14816 acceptor_pool.cc:254] collecting diagnostics on the listening RPC socket unix:/tmp/dist-test-tasknQ0V69/test-tmp/rpc-test-ee0ab470fdf44b539e07d2983d9ffa56.sock every 8 connection(s)
I20260924 14:27:48.386667 14694 rpc-test.cc:488] Connecting to unix:/tmp/dist-test-tasknQ0V69/test-tmp/rpc-test-ee0ab470fdf44b539e07d2983d9ffa56.sock
W20260924 14:27:48.860322 14828 connection.cc:196] Error closing socket: Network error: TlsSocket::Close: Broken pipe
[ OK ] Parameters/TestRpc.TestConnectionKeepalive/SSL_UnixSocket (1071 ms)
[ RUN ] Parameters/TestRpc.TestClientConnectionMetrics/SSL_UnixSocket
I20260924 14:27:49.465370 14840 acceptor_pool.cc:254] collecting diagnostics on the listening RPC socket unix:/tmp/dist-test-tasknQ0V69/test-tmp/rpc-test-2a9a732a148a467c966a20a6c6da9643.sock every 8 connection(s)
I20260924 14:27:49.466178 14841 acceptor_pool.cc:254] collecting diagnostics on the listening RPC socket unix:/tmp/dist-test-tasknQ0V69/test-tmp/rpc-test-2a9a732a148a467c966a20a6c6da9643.sock every 8 connection(s)
I20260924 14:27:49.469549 14694 rpc-test.cc:569] Connecting to unix:/tmp/dist-test-tasknQ0V69/test-tmp/rpc-test-2a9a732a148a467c966a20a6c6da9643.sock
W20260924 14:30:10.553325 14837 connection.cc:196] Error closing socket: Network error: TlsSocket::Close: Broken pipe
[ OK ] Parameters/TestRpc.TestClientConnectionMetrics/SSL_UnixSocket (141133 ms)
[ RUN ] Parameters/TestRpc.TestCredentialsPolicy/SSL_UnixSocket
I20260924 14:30:10.599223 14877 acceptor_pool.cc:254] collecting diagnostics on the listening RPC socket unix:/tmp/dist-test-tasknQ0V69/test-tmp/rpc-test-cde29fc6efe34eae9e8d0f3cd213260b.sock every 8 connection(s)
I20260924 14:30:10.600126 14878 acceptor_pool.cc:254] collecting diagnostics on the listening RPC socket unix:/tmp/dist-test-tasknQ0V69/test-tmp/rpc-test-cde29fc6efe34eae9e8d0f3cd213260b.sock every 8 connection(s)
I20260924 14:30:10.603585 14694 rpc-test.cc:700] Connecting to unix:/tmp/dist-test-tasknQ0V69/test-tmp/rpc-test-cde29fc6efe34eae9e8d0f3cd213260b.sock
W20260924 14:30:10.655133 14876 connection.cc:196] Error closing socket: Network error: TlsSocket::Close: Broken pipe
[ OK ] Parameters/TestRpc.TestCredentialsPolicy/SSL_UnixSocket (116 ms)
[ RUN ] Parameters/TestRpc.TestCallLongerThanKeepalive/SSL_UnixSocket
I20260924 14:30:10.708094 14902 acceptor_pool.cc:254] collecting diagnostics on the listening RPC socket unix:/tmp/dist-test-tasknQ0V69/test-tmp/rpc-test-da02db6ad8dd47db8928efcadbb2ae85.sock every 8 connection(s)
I20260924 14:30:10.709154 14903 acceptor_pool.cc:254] collecting diagnostics on the listening RPC socket unix:/tmp/dist-test-tasknQ0V69/test-tmp/rpc-test-da02db6ad8dd47db8928efcadbb2ae85.sock every 8 connection(s)
I20260924 14:30:10.764519 14906 rpc-test-base.h:222] got call: sleep_micros: 3000000 deferred: true
I20260924 14:30:13.769011 14906 rpcz_store.cc:275] Call kudu.rpc.GenericCalculatorService.Sleep from unix:<unnamed> (request call id 0) took 3004 ms. Trace:
I20260924 14:30:13.769377 14906 rpcz_store.cc:276] 0924 14:30:10.764353 (+ 0us) service_pool.cc:170] Inserting onto call queue
0924 14:30:10.764462 (+ 109us) service_pool.cc:227] Handling call
0924 14:30:13.768953 (+3004491us) inbound_call.cc:173] Queueing success response
Metrics: {}
[ OK ] Parameters/TestRpc.TestCallLongerThanKeepalive/SSL_UnixSocket (3101 ms)
[ RUN ] Parameters/TestRpc.TestRpcSidecar/SSL_UnixSocket
I20260924 14:30:13.808663 14927 acceptor_pool.cc:254] collecting diagnostics on the listening RPC socket unix:/tmp/dist-test-tasknQ0V69/test-tmp/rpc-test-35949a7896784c5faed1a3392c540301.sock every 8 connection(s)
I20260924 14:30:13.809423 14928 acceptor_pool.cc:254] collecting diagnostics on the listening RPC socket unix:/tmp/dist-test-tasknQ0V69/test-tmp/rpc-test-35949a7896784c5faed1a3392c540301.sock every 8 connection(s)
W20260924 14:30:14.333676 14924 connection.cc:196] Error closing socket: Network error: TlsSocket::Close: Broken pipe
[ OK ] Parameters/TestRpc.TestRpcSidecar/SSL_UnixSocket (559 ms)
[ RUN ] Parameters/TestRpc.TestRpcSidecarLimits/SSL_UnixSocket
I20260924 14:30:38.718354 14955 acceptor_pool.cc:254] collecting diagnostics on the listening RPC socket unix:/tmp/dist-test-tasknQ0V69/test-tmp/rpc-test-073b069d43ab41f08c9d9832b2e20451.sock every 8 connection(s)
I20260924 14:30:38.719522 14956 acceptor_pool.cc:254] collecting diagnostics on the listening RPC socket unix:/tmp/dist-test-tasknQ0V69/test-tmp/rpc-test-073b069d43ab41f08c9d9832b2e20451.sock every 8 connection(s)
W20260924 14:30:38.740859 14694 serialization.cc:72] Serialized kudu.rpc_test.PushStringsRequestPB (2147483654 bytes) is larger than the maximum configured RPC message size (52428800 bytes). Sending anyway, but peer may reject the data.
W20260924 14:30:38.752661 14952 connection.cc:535] server connection from unix:<unnamed> recv error: Network error: RPC frame had a length of 2147483714, but we only support messages up to 52428800 bytes long.
W20260924 14:30:38.753086 14952 connection.cc:158] shutting down server connection from unix:<unnamed> with pending inbound data: 4/2147483714 bytes received; last active 0 ns ago: status Network error: RPC frame had a length of 2147483714, but we only support messages up to 52428800 bytes long.
W20260924 14:30:38.754673 14968 connection.cc:698] client connection to unix:/tmp/dist-test-tasknQ0V69/test-tmp/rpc-test-073b069d43ab41f08c9d9832b2e20451.sock send error: Network error: failed to write to TLS socket: Broken pipe
W20260924 14:30:38.755604 14968 connection.cc:196] Error closing socket: Network error: TlsSocket::Close: Success
[ OK ] Parameters/TestRpc.TestRpcSidecarLimits/SSL_UnixSocket (25056 ms)
[ RUN ] Parameters/TestRpc.TestCallTimeoutDoesntAffectNegotiation/SSL_UnixSocket
I20260924 14:30:39.419101 14980 acceptor_pool.cc:254] collecting diagnostics on the listening RPC socket unix:/tmp/dist-test-tasknQ0V69/test-tmp/rpc-test-78826efb527043eda46a7718e5006f66.sock every 8 connection(s)
I20260924 14:30:39.419831 14981 acceptor_pool.cc:254] collecting diagnostics on the listening RPC socket unix:/tmp/dist-test-tasknQ0V69/test-tmp/rpc-test-78826efb527043eda46a7718e5006f66.sock every 8 connection(s)
W20260924 14:30:39.469511 14976 negotiation.cc:266] Injecting 500ms delay in negotiation
I20260924 14:30:39.519157 14694 rpc-test-base.h:595] status: Timed out: connection negotiation to unix:/tmp/dist-test-tasknQ0V69/test-tmp/rpc-test-78826efb527043eda46a7718e5006f66.sock for RPC Sleep timed out after 0.050s (ON_OUTBOUND_QUEUE), seconds elapsed: 0.0506924
W20260924 14:30:39.983829 14977 connection.cc:196] Error closing socket: Network error: TlsSocket::Close: Broken pipe
[ OK ] Parameters/TestRpc.TestCallTimeoutDoesntAffectNegotiation/SSL_UnixSocket (592 ms)
[ RUN ] Parameters/TestRpc.TestRpcHandlerLatencyMetric/SSL_UnixSocket
I20260924 14:30:40.019461 15005 acceptor_pool.cc:254] collecting diagnostics on the listening RPC socket unix:/tmp/dist-test-tasknQ0V69/test-tmp/rpc-test-6de1e7c440c14fdeabd7c3281b55e7e6.sock every 8 connection(s)
I20260924 14:30:40.020210 15006 acceptor_pool.cc:254] collecting diagnostics on the listening RPC socket unix:/tmp/dist-test-tasknQ0V69/test-tmp/rpc-test-6de1e7c440c14fdeabd7c3281b55e7e6.sock every 8 connection(s)
I20260924 14:30:40.082932 14694 rpc-test.cc:1236] Sleep() min lat: 21774
I20260924 14:30:40.083164 14694 rpc-test.cc:1237] Sleep() mean lat: 21774
I20260924 14:30:40.083312 14694 rpc-test.cc:1238] Sleep() max lat: 21774
I20260924 14:30:40.083424 14694 rpc-test.cc:1239] Sleep() #calls: 1
W20260924 14:30:40.086951 15002 connection.cc:196] Error closing socket: Network error: TlsSocket::Close: Broken pipe
[ OK ] Parameters/TestRpc.TestRpcHandlerLatencyMetric/SSL_UnixSocket (103 ms)
[ RUN ] Parameters/TestRpc.TimedOutOnResponseMetricServiceQueue/SSL_UnixSocket
I20260924 14:30:40.114109 15031 acceptor_pool.cc:254] collecting diagnostics on the listening RPC socket unix:/tmp/dist-test-tasknQ0V69/test-tmp/rpc-test-9e9be3e7c5474f948f51a76d7884102f.sock every 8 connection(s)
I20260924 14:30:40.114866 15032 acceptor_pool.cc:254] collecting diagnostics on the listening RPC socket unix:/tmp/dist-test-tasknQ0V69/test-tmp/rpc-test-9e9be3e7c5474f948f51a76d7884102f.sock every 8 connection(s)
W20260924 14:30:40.187475 15033 rpcz_store.cc:267] Call kudu.rpc_test.CalculatorService.Sleep from unix:<unnamed> (request call id 2) took 20 ms (client timeout 20 ms). Trace:
W20260924 14:30:40.187949 15033 rpcz_store.cc:269] 0924 14:30:40.167033 (+ 0us) service_pool.cc:170] Inserting onto call queue
0924 14:30:40.187319 (+ 20286us) service_pool.cc:214] Skipping call since client already timed out
0924 14:30:40.187418 (+ 99us) inbound_call.cc:173] Queueing failure response
Metrics: {}
W20260924 14:30:40.190847 15028 connection.cc:196] Error closing socket: Network error: TlsSocket::Close: Broken pipe
[ OK ] Parameters/TestRpc.TimedOutOnResponseMetricServiceQueue/SSL_UnixSocket (103 ms)
[ RUN ] Parameters/TestRpc.RpcPendingConnectionsMetric/SSL_UnixSocket
I20260924 14:30:40.206184 15054 acceptor_pool.cc:254] collecting diagnostics on the listening RPC socket 0.0.0.0:44355 every 8 connection(s)
I20260924 14:30:40.206965 15055 acceptor_pool.cc:254] collecting diagnostics on the listening RPC socket 0.0.0.0:44355 every 8 connection(s)
W20260924 14:30:40.212406 15050 negotiation.cc:337] Failed RPC negotiation. Trace:
0924 14:30:40.211102 (+ 0us) reactor.cc:625] Submitting negotiation task for server connection from 127.0.0.1:35662 (local address 127.0.0.1:44355)
0924 14:30:40.211503 (+ 401us) server_negotiation.cc:206] Beginning negotiation
0924 14:30:40.211521 (+ 18us) server_negotiation.cc:399] Waiting for connection header
0924 14:30:40.211777 (+ 256us) negotiation.cc:327] Negotiation complete: Network error: Server connection negotiation failed: server connection from 127.0.0.1:35662: BlockingRecv error: recv got EOF from 127.0.0.1:35662 (error 108)
Metrics: {"server-negotiator.queue_time_us":107}
[ OK ] Parameters/TestRpc.RpcPendingConnectionsMetric/SSL_UnixSocket (31 ms)
[ RUN ] Parameters/TestRpc.TestRpcContextClientDeadline/SSL_UnixSocket
I20260924 14:30:40.266429 15070 acceptor_pool.cc:254] collecting diagnostics on the listening RPC socket unix:/tmp/dist-test-tasknQ0V69/test-tmp/rpc-test-bd9de44314f749e2ae609ae80f037514.sock every 8 connection(s)
I20260924 14:30:40.267360 15071 acceptor_pool.cc:254] collecting diagnostics on the listening RPC socket unix:/tmp/dist-test-tasknQ0V69/test-tmp/rpc-test-bd9de44314f749e2ae609ae80f037514.sock every 8 connection(s)
[ OK ] Parameters/TestRpc.TestRpcContextClientDeadline/SSL_UnixSocket (122 ms)
[ RUN ] Parameters/TestRpc.TestApplicationFeatureFlagUnsupportedServer/SSL_UnixSocket
I20260924 14:30:40.369837 15095 acceptor_pool.cc:254] collecting diagnostics on the listening RPC socket unix:/tmp/dist-test-tasknQ0V69/test-tmp/rpc-test-06e52dfe06a64f2181f9f9a8ccc35298.sock every 8 connection(s)
I20260924 14:30:40.370630 15096 acceptor_pool.cc:254] collecting diagnostics on the listening RPC socket unix:/tmp/dist-test-tasknQ0V69/test-tmp/rpc-test-06e52dfe06a64f2181f9f9a8ccc35298.sock every 8 connection(s)
[ OK ] Parameters/TestRpc.TestApplicationFeatureFlagUnsupportedServer/SSL_UnixSocket (55 ms)
[ RUN ] Parameters/TestRpc.TestCancellationAsync/SSL_UnixSocket
I20260924 14:30:40.429322 15120 acceptor_pool.cc:254] collecting diagnostics on the listening RPC socket unix:/tmp/dist-test-tasknQ0V69/test-tmp/rpc-test-a547c33903534621a1108a06c600ef64.sock every 8 connection(s)
I20260924 14:30:40.430099 15121 acceptor_pool.cc:254] collecting diagnostics on the listening RPC socket unix:/tmp/dist-test-tasknQ0V69/test-tmp/rpc-test-a547c33903534621a1108a06c600ef64.sock every 8 connection(s)
I20260924 14:30:40.433454 14694 rpc-test.cc:1716] Connecting to unix:/tmp/dist-test-tasknQ0V69/test-tmp/rpc-test-a547c33903534621a1108a06c600ef64.sock
I20260924 14:30:40.456152 14694 test_util.cc:268] Using random seed: 1907366332
I20260924 14:30:40.708714 15124 rpc-test-base.h:240] got call: sleep_micros: 500 pattern: 4294967295 num_repetitions: 2097152 sidecar_idx: 0
I20260924 14:30:40.934684 15124 rpc-test-base.h:240] got call: sleep_micros: 500 pattern: 4294967295 num_repetitions: 2097152 sidecar_idx: 0
I20260924 14:30:41.170275 15124 rpc-test-base.h:240] got call: sleep_micros: 500 pattern: 4294967295 num_repetitions: 2097152 sidecar_idx: 0
I20260924 14:30:41.503793 15123 rpc-test-base.h:240] got call: sleep_micros: 500 pattern: 4294967295 num_repetitions: 2097152 sidecar_idx: 0
I20260924 14:30:41.688544 15124 rpc-test-base.h:240] got call: sleep_micros: 500 pattern: 4294967295 num_repetitions: 2097152 sidecar_idx: 0
I20260924 14:30:41.922060 15123 rpc-test-base.h:240] got call: sleep_micros: 500 pattern: 4294967295 num_repetitions: 2097152 sidecar_idx: 0
I20260924 14:30:42.183040 15124 rpc-test-base.h:240] got call: sleep_micros: 500 pattern: 4294967295 num_repetitions: 2097152 sidecar_idx: 0
I20260924 14:30:42.408072 15124 rpc-test-base.h:240] got call: sleep_micros: 500 pattern: 4294967295 num_repetitions: 2097152 sidecar_idx: 0
I20260924 14:30:42.625098 15124 rpc-test-base.h:240] got call: sleep_micros: 500 pattern: 4294967295 num_repetitions: 2097152 sidecar_idx: 0
W20260924 14:30:42.640091 15117 connection.cc:196] Error closing socket: Network error: TlsSocket::Close: Broken pipe
W20260924 14:30:42.762995 15117 connection.cc:441] server connection from unix:<unnamed> torn down before Call kudu.rpc.GenericCalculatorService.SleepWithSidecar from unix:<unnamed> (request call id 9) could send its response
[ OK ] Parameters/TestRpc.TestCancellationAsync/SSL_UnixSocket (2369 ms)
[ RUN ] Parameters/TestRpc.TestPerformanceBySocketType/SSL_UnixSocket
I20260924 14:30:42.882938 15145 acceptor_pool.cc:254] collecting diagnostics on the listening RPC socket unix:/tmp/dist-test-tasknQ0V69/test-tmp/rpc-test-bec80e186b4f46ed942d89d4f36e2655.sock every 8 connection(s)
I20260924 14:30:42.883729 15146 acceptor_pool.cc:254] collecting diagnostics on the listening RPC socket unix:/tmp/dist-test-tasknQ0V69/test-tmp/rpc-test-bec80e186b4f46ed942d89d4f36e2655.sock every 8 connection(s)
I20260924 14:30:42.887022 14694 rpc-test.cc:1846] Connecting to unix:/tmp/dist-test-tasknQ0V69/test-tmp/rpc-test-bec80e186b4f46ed942d89d4f36e2655.sock
I20260924 14:31:05.288048 14694 rpc-test.cc:1859] Sending 1024MB via ssl-enabled unix socket: real 22.385s user 20.524s sys 13.390s
I20260924 14:31:27.227913 14694 rpc-test.cc:1859] Sending 1024MB via ssl-enabled unix socket: real 21.939s user 19.797s sys 13.163s
I20260924 14:31:49.396310 14694 rpc-test.cc:1859] Sending 1024MB via ssl-enabled unix socket: real 22.168s user 20.188s sys 13.316s
I20260924 14:32:11.507506 14694 rpc-test.cc:1859] Sending 1024MB via ssl-enabled unix socket: real 22.111s user 19.745s sys 13.546s
I20260924 14:32:33.685992 14694 rpc-test.cc:1859] Sending 1024MB via ssl-enabled unix socket: real 22.178s user 20.177s sys 13.318s
W20260924 14:32:33.692147 15142 connection.cc:196] Error closing socket: Network error: TlsSocket::Close: Broken pipe
[ OK ] Parameters/TestRpc.TestPerformanceBySocketType/SSL_UnixSocket (110931 ms)
[----------] 20 tests from Parameters/TestRpc (286866 ms total)
[----------] 1 test from Parameters/TestRpcSocketTxRxQueue
[ RUN ] Parameters/TestRpcSocketTxRxQueue.AcceptorRxQueueSizeMetric/0
I20260924 14:32:33.721262 15181 acceptor_pool.cc:254] collecting diagnostics on the listening RPC socket 0.0.0.0:46077 every 1 connection(s)
I20260924 14:32:33.722162 15182 acceptor_pool.cc:254] collecting diagnostics on the listening RPC socket 0.0.0.0:46077 every 1 connection(s)
W20260924 14:32:33.727828 15177 negotiation.cc:337] Failed RPC negotiation. Trace:
0924 14:32:33.726159 (+ 0us) reactor.cc:625] Submitting negotiation task for server connection from 127.0.0.1:45506 (local address 127.0.0.1:46077)
0924 14:32:33.726690 (+ 531us) server_negotiation.cc:206] Beginning negotiation
0924 14:32:33.726714 (+ 24us) server_negotiation.cc:399] Waiting for connection header
0924 14:32:33.726951 (+ 237us) negotiation.cc:327] Negotiation complete: Network error: Server connection negotiation failed: server connection from 127.0.0.1:45506: BlockingRecv error: recv got EOF from 127.0.0.1:45506 (error 108)
Metrics: {"server-negotiator.queue_time_us":116}
[ OK ] Parameters/TestRpcSocketTxRxQueue.AcceptorRxQueueSizeMetric/0 (29 ms)
[----------] 1 test from Parameters/TestRpcSocketTxRxQueue (29 ms total)
[----------] Global test environment tear-down
[==========] 21 tests from 2 test suites ran. (286896 ms total)
[ PASSED ] 20 tests.
[ FAILED ] 1 test, listed below:
[ FAILED ] Parameters/TestRpc.TestCallWithChainCertAndChainCA/SSL_UnixSocket, where GetParam() = (true, true)
1 FAILED TEST