Diagnosed failure
Parameters/TestRpc.TestCallWithChainCertAndChainCA/SSL_UnixSocket: /data0/somelongdirectorytoavoidrpathissues/src/kudu/src/kudu/rpc/rpc-test.cc:270: Failure
Failed
Bad status: Runtime error: could not verify certificate chain (error with cert: subject=CN = localhost, ST = sadfjas, C = AS, emailAddress = sdflkdsajf, O = lskdfjlsad, OU = sldfkja, issuer=C = AS, ST = ASDfkjdhf, L = lskdjf, O = saldfja, OU = skdjf, CN = localhost, emailAddress = sadjflkadsj): : certificate has expired
Google Test trace:
/data0/somelongdirectorytoavoidrpathissues/src/kudu/src/kudu/rpc/rpc-test.cc:267: Connecting to unix:/tmp/dist-test-task5N71Ne/test-tmp/rpc-test-a80bb55cada7452d943c056eafadc2e4.sock
I20260925 19:34:38.090580 2454 test_util.cc:175] -----------------------------------------------
I20260925 19:34:38.090799 2454 test_util.cc:176] Had fatal failures, leaving test files at /tmp/dist-test-task5N71Ne/test-tmp/rpc-test.6.Parameters_TestRpc.TestCallWithChainCertAndChainCA_SSL_UnixSocket.1790364876694021-2454-0
Full log
Note: This is test shard 7 of 8.
[==========] Running 21 tests from 2 test suites.
[----------] Global test environment set-up.
[----------] 20 tests from Parameters/TestRpc
[ RUN ] Parameters/TestRpc.TestMessengerCreateDestroy/SSL_UnixSocket
WARNING: Logging before InitGoogleLogging() is written to STDERR
I20260925 19:34:36.811092 2454 rpc-test.cc:169] started messenger TestCreateDestroy
[ OK ] Parameters/TestRpc.TestMessengerCreateDestroy/SSL_UnixSocket (1184 ms)
[ RUN ] Parameters/TestRpc.TestNegotiationDeadlock/SSL_UnixSocket
I20260925 19:34:37.977420 2476 acceptor_pool.cc:254] collecting diagnostics on the listening RPC socket unix:/tmp/dist-test-task5N71Ne/test-tmp/rpc-test-e2de5184f25c4101bfb1b0d9bca1436f.sock every 8 connection(s)
I20260925 19:34:37.978543 2477 acceptor_pool.cc:254] collecting diagnostics on the listening RPC socket unix:/tmp/dist-test-task5N71Ne/test-tmp/rpc-test-e2de5184f25c4101bfb1b0d9bca1436f.sock every 8 connection(s)
[ OK ] Parameters/TestRpc.TestNegotiationDeadlock/SSL_UnixSocket (96 ms)
[ RUN ] Parameters/TestRpc.TestCallWithChainCertAndChainCA/SSL_UnixSocket
I20260925 19:34:38.061148 2492 acceptor_pool.cc:254] collecting diagnostics on the listening RPC socket unix:/tmp/dist-test-task5N71Ne/test-tmp/rpc-test-a80bb55cada7452d943c056eafadc2e4.sock every 8 connection(s)
I20260925 19:34:38.063478 2493 acceptor_pool.cc:254] collecting diagnostics on the listening RPC socket unix:/tmp/dist-test-task5N71Ne/test-tmp/rpc-test-a80bb55cada7452d943c056eafadc2e4.sock every 8 connection(s)
/data0/somelongdirectorytoavoidrpathissues/src/kudu/src/kudu/rpc/rpc-test.cc:270: Failure
Failed
Bad status: Runtime error: could not verify certificate chain (error with cert: subject=CN = localhost, ST = sadfjas, C = AS, emailAddress = sdflkdsajf, O = lskdfjlsad, OU = sldfkja, issuer=C = AS, ST = ASDfkjdhf, L = lskdjf, O = saldfja, OU = skdjf, CN = localhost, emailAddress = sadjflkadsj): : certificate has expired
Google Test trace:
/data0/somelongdirectorytoavoidrpathissues/src/kudu/src/kudu/rpc/rpc-test.cc:267: Connecting to unix:/tmp/dist-test-task5N71Ne/test-tmp/rpc-test-a80bb55cada7452d943c056eafadc2e4.sock
I20260925 19:34:38.090580 2454 test_util.cc:175] -----------------------------------------------
I20260925 19:34:38.090799 2454 test_util.cc:176] Had fatal failures, leaving test files at /tmp/dist-test-task5N71Ne/test-tmp/rpc-test.6.Parameters_TestRpc.TestCallWithChainCertAndChainCA_SSL_UnixSocket.1790364876694021-2454-0
[ FAILED ] Parameters/TestRpc.TestCallWithChainCertAndChainCA/SSL_UnixSocket, where GetParam() = (true, true) (62 ms)
[ RUN ] Parameters/TestRpc.TestCallWithPasswordProtectedKey/SSL_UnixSocket
I20260925 19:34:38.121595 2517 acceptor_pool.cc:254] collecting diagnostics on the listening RPC socket unix:/tmp/dist-test-task5N71Ne/test-tmp/rpc-test-632a84d6d4bb40248a93e255cefe5c07.sock every 8 connection(s)
I20260925 19:34:38.122385 2518 acceptor_pool.cc:254] collecting diagnostics on the listening RPC socket unix:/tmp/dist-test-task5N71Ne/test-tmp/rpc-test-632a84d6d4bb40248a93e255cefe5c07.sock every 8 connection(s)
W20260925 19:34:38.165794 2514 connection.cc:196] Error closing socket: Network error: TlsSocket::Close: Broken pipe
[ OK ] Parameters/TestRpc.TestCallWithPasswordProtectedKey/SSL_UnixSocket (81 ms)
[ RUN ] Parameters/TestRpc.TestCallToBadServer/SSL_UnixSocket
I20260925 19:34:38.193159 2454 rpc-test.cc:394] Status: Network error: Client connection negotiation failed: client connection to 0.0.0.0:0: connect: Connection refused (error 111)
I20260925 19:34:38.194670 2454 rpc-test.cc:394] Status: Network error: Client connection negotiation failed: client connection to 0.0.0.0:0: connect: Connection refused (error 111)
I20260925 19:34:38.195995 2454 rpc-test.cc:394] Status: Network error: Client connection negotiation failed: client connection to 0.0.0.0:0: connect: Connection refused (error 111)
I20260925 19:34:38.197247 2454 rpc-test.cc:394] Status: Network error: Client connection negotiation failed: client connection to 0.0.0.0:0: connect: Connection refused (error 111)
I20260925 19:34:38.198572 2454 rpc-test.cc:394] Status: Network error: Client connection negotiation failed: client connection to 0.0.0.0:0: connect: Connection refused (error 111)
[ OK ] Parameters/TestRpc.TestCallToBadServer/SSL_UnixSocket (28 ms)
[ RUN ] Parameters/TestRpc.TestWrongService/SSL_UnixSocket
I20260925 19:34:38.215334 2552 acceptor_pool.cc:254] collecting diagnostics on the listening RPC socket unix:/tmp/dist-test-task5N71Ne/test-tmp/rpc-test-9697c56a56da42e9b7ee9761431b5652.sock every 8 connection(s)
I20260925 19:34:38.216225 2553 acceptor_pool.cc:254] collecting diagnostics on the listening RPC socket unix:/tmp/dist-test-task5N71Ne/test-tmp/rpc-test-9697c56a56da42e9b7ee9761431b5652.sock every 8 connection(s)
I20260925 19:34:38.244932 2549 messenger.cc:345] service WrongServiceName not registered on TestServer
W20260925 19:34:38.248005 2549 connection.cc:196] Error closing socket: Network error: TlsSocket::Close: Broken pipe
[ OK ] Parameters/TestRpc.TestWrongService/SSL_UnixSocket (52 ms)
[ RUN ] Parameters/TestRpc.TestConnectionKeepalive/SSL_UnixSocket
I20260925 19:34:38.270087 2575 acceptor_pool.cc:254] collecting diagnostics on the listening RPC socket unix:/tmp/dist-test-task5N71Ne/test-tmp/rpc-test-7a8bd1aecbf54cc28b0fe85ebc7c2f24.sock every 8 connection(s)
I20260925 19:34:38.270814 2576 acceptor_pool.cc:254] collecting diagnostics on the listening RPC socket unix:/tmp/dist-test-task5N71Ne/test-tmp/rpc-test-7a8bd1aecbf54cc28b0fe85ebc7c2f24.sock every 8 connection(s)
I20260925 19:34:38.274080 2454 rpc-test.cc:488] Connecting to unix:/tmp/dist-test-task5N71Ne/test-tmp/rpc-test-7a8bd1aecbf54cc28b0fe85ebc7c2f24.sock
W20260925 19:34:38.757004 2588 connection.cc:196] Error closing socket: Network error: TlsSocket::Close: Broken pipe
[ OK ] Parameters/TestRpc.TestConnectionKeepalive/SSL_UnixSocket (1071 ms)
[ RUN ] Parameters/TestRpc.TestClientConnectionMetrics/SSL_UnixSocket
I20260925 19:34:39.350632 2600 acceptor_pool.cc:254] collecting diagnostics on the listening RPC socket unix:/tmp/dist-test-task5N71Ne/test-tmp/rpc-test-fe0a36220c774ca6a080c6d80f280494.sock every 8 connection(s)
I20260925 19:34:39.351414 2601 acceptor_pool.cc:254] collecting diagnostics on the listening RPC socket unix:/tmp/dist-test-task5N71Ne/test-tmp/rpc-test-fe0a36220c774ca6a080c6d80f280494.sock every 8 connection(s)
I20260925 19:34:39.354586 2454 rpc-test.cc:569] Connecting to unix:/tmp/dist-test-task5N71Ne/test-tmp/rpc-test-fe0a36220c774ca6a080c6d80f280494.sock
W20260925 19:36:58.735909 2597 connection.cc:196] Error closing socket: Network error: TlsSocket::Close: Broken pipe
[ OK ] Parameters/TestRpc.TestClientConnectionMetrics/SSL_UnixSocket (139418 ms)
[ RUN ] Parameters/TestRpc.TestCredentialsPolicy/SSL_UnixSocket
I20260925 19:36:58.771663 2637 acceptor_pool.cc:254] collecting diagnostics on the listening RPC socket unix:/tmp/dist-test-task5N71Ne/test-tmp/rpc-test-e82504bc9cda4994925fabbb8f756573.sock every 8 connection(s)
I20260925 19:36:58.772512 2638 acceptor_pool.cc:254] collecting diagnostics on the listening RPC socket unix:/tmp/dist-test-task5N71Ne/test-tmp/rpc-test-e82504bc9cda4994925fabbb8f756573.sock every 8 connection(s)
I20260925 19:36:58.775906 2454 rpc-test.cc:700] Connecting to unix:/tmp/dist-test-task5N71Ne/test-tmp/rpc-test-e82504bc9cda4994925fabbb8f756573.sock
W20260925 19:36:58.811184 2636 connection.cc:196] Error closing socket: Network error: TlsSocket::Close: Broken pipe
[ OK ] Parameters/TestRpc.TestCredentialsPolicy/SSL_UnixSocket (87 ms)
[ RUN ] Parameters/TestRpc.TestCallLongerThanKeepalive/SSL_UnixSocket
I20260925 19:36:58.856190 2662 acceptor_pool.cc:254] collecting diagnostics on the listening RPC socket unix:/tmp/dist-test-task5N71Ne/test-tmp/rpc-test-17f8e15866cd48bb9b7132fae77843e4.sock every 8 connection(s)
I20260925 19:36:58.856899 2663 acceptor_pool.cc:254] collecting diagnostics on the listening RPC socket unix:/tmp/dist-test-task5N71Ne/test-tmp/rpc-test-17f8e15866cd48bb9b7132fae77843e4.sock every 8 connection(s)
I20260925 19:36:58.893131 2666 rpc-test-base.h:222] got call: sleep_micros: 3000000 deferred: true
I20260925 19:37:01.897497 2666 rpcz_store.cc:275] Call kudu.rpc.GenericCalculatorService.Sleep from unix:<unnamed> (request call id 0) took 3004 ms. Trace:
I20260925 19:37:01.897794 2666 rpcz_store.cc:276] 0925 19:36:58.892981 (+ 0us) service_pool.cc:170] Inserting onto call queue
0925 19:36:58.893076 (+ 95us) service_pool.cc:227] Handling call
0925 19:37:01.897440 (+3004364us) inbound_call.cc:173] Queueing success response
Metrics: {}
[ OK ] Parameters/TestRpc.TestCallLongerThanKeepalive/SSL_UnixSocket (3074 ms)
[ RUN ] Parameters/TestRpc.TestRpcSidecar/SSL_UnixSocket
I20260925 19:37:01.931485 2687 acceptor_pool.cc:254] collecting diagnostics on the listening RPC socket unix:/tmp/dist-test-task5N71Ne/test-tmp/rpc-test-0fbe26f96c944da7b0c4caa610504873.sock every 8 connection(s)
I20260925 19:37:01.932250 2688 acceptor_pool.cc:254] collecting diagnostics on the listening RPC socket unix:/tmp/dist-test-task5N71Ne/test-tmp/rpc-test-0fbe26f96c944da7b0c4caa610504873.sock every 8 connection(s)
[ OK ] Parameters/TestRpc.TestRpcSidecar/SSL_UnixSocket (530 ms)
[ RUN ] Parameters/TestRpc.TestRpcSidecarLimits/SSL_UnixSocket
I20260925 19:37:19.306505 2714 acceptor_pool.cc:254] collecting diagnostics on the listening RPC socket unix:/tmp/dist-test-task5N71Ne/test-tmp/rpc-test-4ecc42cc35944c018197cd82650b777b.sock every 8 connection(s)
I20260925 19:37:19.307319 2715 acceptor_pool.cc:254] collecting diagnostics on the listening RPC socket unix:/tmp/dist-test-task5N71Ne/test-tmp/rpc-test-4ecc42cc35944c018197cd82650b777b.sock every 8 connection(s)
W20260925 19:37:19.332453 2454 serialization.cc:72] Serialized kudu.rpc_test.PushStringsRequestPB (2147483654 bytes) is larger than the maximum configured RPC message size (52428800 bytes). Sending anyway, but peer may reject the data.
W20260925 19:37:19.342919 2711 connection.cc:535] server connection from unix:<unnamed> recv error: Network error: RPC frame had a length of 2147483714, but we only support messages up to 52428800 bytes long.
W20260925 19:37:19.343212 2711 connection.cc:158] shutting down server connection from unix:<unnamed> with pending inbound data: 4/2147483714 bytes received; last active 0 ns ago: status Network error: RPC frame had a length of 2147483714, but we only support messages up to 52428800 bytes long.
W20260925 19:37:19.344058 2727 connection.cc:698] client connection to unix:/tmp/dist-test-task5N71Ne/test-tmp/rpc-test-4ecc42cc35944c018197cd82650b777b.sock send error: Network error: failed to write to TLS socket: Broken pipe
W20260925 19:37:19.344617 2727 connection.cc:196] Error closing socket: Network error: TlsSocket::Close: Success
[ OK ] Parameters/TestRpc.TestRpcSidecarLimits/SSL_UnixSocket (17533 ms)
[ RUN ] Parameters/TestRpc.TestCallTimeoutDoesntAffectNegotiation/SSL_UnixSocket
I20260925 19:37:19.993072 2739 acceptor_pool.cc:254] collecting diagnostics on the listening RPC socket unix:/tmp/dist-test-task5N71Ne/test-tmp/rpc-test-41c57254e02a429bbc1f4a37d30795ef.sock every 8 connection(s)
I20260925 19:37:19.993813 2740 acceptor_pool.cc:254] collecting diagnostics on the listening RPC socket unix:/tmp/dist-test-task5N71Ne/test-tmp/rpc-test-41c57254e02a429bbc1f4a37d30795ef.sock every 8 connection(s)
W20260925 19:37:20.017583 2735 negotiation.cc:266] Injecting 500ms delay in negotiation
I20260925 19:37:20.067704 2454 rpc-test-base.h:595] status: Timed out: connection negotiation to unix:/tmp/dist-test-task5N71Ne/test-tmp/rpc-test-41c57254e02a429bbc1f4a37d30795ef.sock for RPC Sleep timed out after 0.050s (ON_OUTBOUND_QUEUE), seconds elapsed: 0.051177
W20260925 19:37:20.530540 2736 connection.cc:196] Error closing socket: Network error: TlsSocket::Close: Broken pipe
[ OK ] Parameters/TestRpc.TestCallTimeoutDoesntAffectNegotiation/SSL_UnixSocket (563 ms)
[ RUN ] Parameters/TestRpc.TestRpcHandlerLatencyMetric/SSL_UnixSocket
I20260925 19:37:20.562829 2764 acceptor_pool.cc:254] collecting diagnostics on the listening RPC socket unix:/tmp/dist-test-task5N71Ne/test-tmp/rpc-test-a8dcb089b08d497f8aac120774a11af2.sock every 8 connection(s)
I20260925 19:37:20.563531 2765 acceptor_pool.cc:254] collecting diagnostics on the listening RPC socket unix:/tmp/dist-test-task5N71Ne/test-tmp/rpc-test-a8dcb089b08d497f8aac120774a11af2.sock every 8 connection(s)
I20260925 19:37:20.650633 2454 rpc-test.cc:1236] Sleep() min lat: 21564
I20260925 19:37:20.650820 2454 rpc-test.cc:1237] Sleep() mean lat: 21564
I20260925 19:37:20.650965 2454 rpc-test.cc:1238] Sleep() max lat: 21564
I20260925 19:37:20.651088 2454 rpc-test.cc:1239] Sleep() #calls: 1
W20260925 19:37:20.653591 2761 connection.cc:196] Error closing socket: Network error: TlsSocket::Close: Broken pipe
[ OK ] Parameters/TestRpc.TestRpcHandlerLatencyMetric/SSL_UnixSocket (124 ms)
[ RUN ] Parameters/TestRpc.TimedOutOnResponseMetricServiceQueue/SSL_UnixSocket
I20260925 19:37:20.688789 2790 acceptor_pool.cc:254] collecting diagnostics on the listening RPC socket unix:/tmp/dist-test-task5N71Ne/test-tmp/rpc-test-c451edb8ec8f4522a460f7f8b0d223c0.sock every 8 connection(s)
I20260925 19:37:20.689555 2791 acceptor_pool.cc:254] collecting diagnostics on the listening RPC socket unix:/tmp/dist-test-task5N71Ne/test-tmp/rpc-test-c451edb8ec8f4522a460f7f8b0d223c0.sock every 8 connection(s)
W20260925 19:37:20.762243 2792 rpcz_store.cc:267] Call kudu.rpc_test.CalculatorService.Sleep from unix:<unnamed> (request call id 2) took 20 ms (client timeout 20 ms). Trace:
W20260925 19:37:20.762687 2792 rpcz_store.cc:269] 0925 19:37:20.741824 (+ 0us) service_pool.cc:170] Inserting onto call queue
0925 19:37:20.762116 (+ 20292us) service_pool.cc:214] Skipping call since client already timed out
0925 19:37:20.762198 (+ 82us) inbound_call.cc:173] Queueing failure response
Metrics: {}
[ OK ] Parameters/TestRpc.TimedOutOnResponseMetricServiceQueue/SSL_UnixSocket (111 ms)
[ RUN ] Parameters/TestRpc.RpcPendingConnectionsMetric/SSL_UnixSocket
I20260925 19:37:20.779834 2813 acceptor_pool.cc:254] collecting diagnostics on the listening RPC socket 0.0.0.0:37581 every 8 connection(s)
I20260925 19:37:20.780575 2814 acceptor_pool.cc:254] collecting diagnostics on the listening RPC socket 0.0.0.0:37581 every 8 connection(s)
W20260925 19:37:20.785573 2809 negotiation.cc:337] Failed RPC negotiation. Trace:
0925 19:37:20.784337 (+ 0us) reactor.cc:625] Submitting negotiation task for server connection from 127.0.0.1:54100 (local address 127.0.0.1:37581)
0925 19:37:20.784719 (+ 382us) server_negotiation.cc:206] Beginning negotiation
0925 19:37:20.784736 (+ 17us) server_negotiation.cc:399] Waiting for connection header
0925 19:37:20.784975 (+ 239us) negotiation.cc:327] Negotiation complete: Network error: Server connection negotiation failed: server connection from 127.0.0.1:54100: BlockingRecv error: recv got EOF from 127.0.0.1:54100 (error 108)
Metrics: {"server-negotiator.queue_time_us":102}
[ OK ] Parameters/TestRpc.RpcPendingConnectionsMetric/SSL_UnixSocket (29 ms)
[ RUN ] Parameters/TestRpc.TestRpcContextClientDeadline/SSL_UnixSocket
I20260925 19:37:20.813525 2829 acceptor_pool.cc:254] collecting diagnostics on the listening RPC socket unix:/tmp/dist-test-task5N71Ne/test-tmp/rpc-test-72fabebe459b4358ad4faad3dff5aa00.sock every 8 connection(s)
I20260925 19:37:20.814196 2830 acceptor_pool.cc:254] collecting diagnostics on the listening RPC socket unix:/tmp/dist-test-task5N71Ne/test-tmp/rpc-test-72fabebe459b4358ad4faad3dff5aa00.sock every 8 connection(s)
W20260925 19:37:20.875524 2826 connection.cc:196] Error closing socket: Network error: TlsSocket::Close: Broken pipe
[ OK ] Parameters/TestRpc.TestRpcContextClientDeadline/SSL_UnixSocket (80 ms)
[ RUN ] Parameters/TestRpc.TestApplicationFeatureFlagUnsupportedServer/SSL_UnixSocket
I20260925 19:37:20.908008 2854 acceptor_pool.cc:254] collecting diagnostics on the listening RPC socket unix:/tmp/dist-test-task5N71Ne/test-tmp/rpc-test-6e81ee301f1d49ff9ea46d5f0a3b8cdb.sock every 8 connection(s)
I20260925 19:37:20.908725 2855 acceptor_pool.cc:254] collecting diagnostics on the listening RPC socket unix:/tmp/dist-test-task5N71Ne/test-tmp/rpc-test-6e81ee301f1d49ff9ea46d5f0a3b8cdb.sock every 8 connection(s)
[ OK ] Parameters/TestRpc.TestApplicationFeatureFlagUnsupportedServer/SSL_UnixSocket (62 ms)
[ RUN ] Parameters/TestRpc.TestCancellationAsync/SSL_UnixSocket
I20260925 19:37:20.974195 2879 acceptor_pool.cc:254] collecting diagnostics on the listening RPC socket unix:/tmp/dist-test-task5N71Ne/test-tmp/rpc-test-5d2a08c5a5444e3989bf6b8374529bbd.sock every 8 connection(s)
I20260925 19:37:20.974924 2880 acceptor_pool.cc:254] collecting diagnostics on the listening RPC socket unix:/tmp/dist-test-task5N71Ne/test-tmp/rpc-test-5d2a08c5a5444e3989bf6b8374529bbd.sock every 8 connection(s)
I20260925 19:37:20.978066 2454 rpc-test.cc:1716] Connecting to unix:/tmp/dist-test-task5N71Ne/test-tmp/rpc-test-5d2a08c5a5444e3989bf6b8374529bbd.sock
I20260925 19:37:21.005035 2454 test_util.cc:268] Using random seed: -666267180
I20260925 19:37:21.228399 2883 rpc-test-base.h:240] got call: sleep_micros: 500 pattern: 4294967295 num_repetitions: 2097152 sidecar_idx: 0
I20260925 19:37:21.429858 2882 rpc-test-base.h:240] got call: sleep_micros: 500 pattern: 4294967295 num_repetitions: 2097152 sidecar_idx: 0
I20260925 19:37:21.664474 2883 rpc-test-base.h:240] got call: sleep_micros: 500 pattern: 4294967295 num_repetitions: 2097152 sidecar_idx: 0
I20260925 19:37:21.874508 2882 rpc-test-base.h:240] got call: sleep_micros: 500 pattern: 4294967295 num_repetitions: 2097152 sidecar_idx: 0
I20260925 19:37:22.097584 2882 rpc-test-base.h:240] got call: sleep_micros: 500 pattern: 4294967295 num_repetitions: 2097152 sidecar_idx: 0
I20260925 19:37:22.296998 2883 rpc-test-base.h:240] got call: sleep_micros: 500 pattern: 4294967295 num_repetitions: 2097152 sidecar_idx: 0
I20260925 19:37:22.519862 2883 rpc-test-base.h:240] got call: sleep_micros: 500 pattern: 4294967295 num_repetitions: 2097152 sidecar_idx: 0
I20260925 19:37:22.729173 2882 rpc-test-base.h:240] got call: sleep_micros: 500 pattern: 4294967295 num_repetitions: 2097152 sidecar_idx: 0
I20260925 19:37:22.939791 2882 rpc-test-base.h:240] got call: sleep_micros: 500 pattern: 4294967295 num_repetitions: 2097152 sidecar_idx: 0
W20260925 19:37:22.959995 2876 connection.cc:196] Error closing socket: Network error: TlsSocket::Close: Broken pipe
W20260925 19:37:23.079504 2876 connection.cc:441] server connection from unix:<unnamed> torn down before Call kudu.rpc.GenericCalculatorService.SleepWithSidecar from unix:<unnamed> (request call id 9) could send its response
[ OK ] Parameters/TestRpc.TestCancellationAsync/SSL_UnixSocket (2145 ms)
[ RUN ] Parameters/TestRpc.TestPerformanceBySocketType/SSL_UnixSocket
I20260925 19:37:23.187573 2904 acceptor_pool.cc:254] collecting diagnostics on the listening RPC socket unix:/tmp/dist-test-task5N71Ne/test-tmp/rpc-test-326b6dbabde14c0d90ce98de1db4a9bd.sock every 8 connection(s)
I20260925 19:37:23.188320 2905 acceptor_pool.cc:254] collecting diagnostics on the listening RPC socket unix:/tmp/dist-test-task5N71Ne/test-tmp/rpc-test-326b6dbabde14c0d90ce98de1db4a9bd.sock every 8 connection(s)
I20260925 19:37:23.191375 2454 rpc-test.cc:1846] Connecting to unix:/tmp/dist-test-task5N71Ne/test-tmp/rpc-test-326b6dbabde14c0d90ce98de1db4a9bd.sock
I20260925 19:37:45.038504 2454 rpc-test.cc:1859] Sending 1024MB via ssl-enabled unix socket: real 21.818s user 19.672s sys 13.131s
I20260925 19:38:06.445106 2454 rpc-test.cc:1859] Sending 1024MB via ssl-enabled unix socket: real 21.406s user 19.214s sys 12.820s
I20260925 19:38:27.781836 2454 rpc-test.cc:1859] Sending 1024MB via ssl-enabled unix socket: real 21.336s user 19.001s sys 12.760s
I20260925 19:38:49.254185 2454 rpc-test.cc:1859] Sending 1024MB via ssl-enabled unix socket: real 21.472s user 19.194s sys 12.928s
I20260925 19:39:10.885828 2454 rpc-test.cc:1859] Sending 1024MB via ssl-enabled unix socket: real 21.631s user 19.270s sys 13.206s
W20260925 19:39:10.891731 2901 connection.cc:196] Error closing socket: Network error: TlsSocket::Close: Broken pipe
[ OK ] Parameters/TestRpc.TestPerformanceBySocketType/SSL_UnixSocket (107814 ms)
[----------] 20 tests from Parameters/TestRpc (274157 ms total)
[----------] 1 test from Parameters/TestRpcSocketTxRxQueue
[ RUN ] Parameters/TestRpcSocketTxRxQueue.AcceptorRxQueueSizeMetric/0
I20260925 19:39:10.915306 2940 acceptor_pool.cc:254] collecting diagnostics on the listening RPC socket 0.0.0.0:33189 every 1 connection(s)
I20260925 19:39:10.916183 2941 acceptor_pool.cc:254] collecting diagnostics on the listening RPC socket 0.0.0.0:33189 every 1 connection(s)
W20260925 19:39:10.921916 2936 negotiation.cc:337] Failed RPC negotiation. Trace:
0925 19:39:10.920189 (+ 0us) reactor.cc:625] Submitting negotiation task for server connection from 127.0.0.1:43868 (local address 127.0.0.1:33189)
0925 19:39:10.920663 (+ 474us) server_negotiation.cc:206] Beginning negotiation
0925 19:39:10.920687 (+ 24us) server_negotiation.cc:399] Waiting for connection header
0925 19:39:10.920938 (+ 251us) negotiation.cc:327] Negotiation complete: Network error: Server connection negotiation failed: server connection from 127.0.0.1:43868: BlockingRecv error: recv got EOF from 127.0.0.1:43868 (error 108)
Metrics: {"server-negotiator.queue_time_us":121}
[ OK ] Parameters/TestRpcSocketTxRxQueue.AcceptorRxQueueSizeMetric/0 (25 ms)
[----------] 1 test from Parameters/TestRpcSocketTxRxQueue (25 ms total)
[----------] Global test environment tear-down
[==========] 21 tests from 2 test suites ran. (274183 ms total)
[ PASSED ] 20 tests.
[ FAILED ] 1 test, listed below:
[ FAILED ] Parameters/TestRpc.TestCallWithChainCertAndChainCA/SSL_UnixSocket, where GetParam() = (true, true)
1 FAILED TEST