Diagnosed failure
Parameters/TestRpc.TestCallWithChainCertAndChainCA/SSL_UnixSocket: /data0/somelongdirectorytoavoidrpathissues/src/kudu/src/kudu/rpc/rpc-test.cc:270: Failure
Failed
Bad status: Runtime error: could not verify certificate chain (error with cert: subject=CN = localhost, ST = sadfjas, C = AS, emailAddress = sdflkdsajf, O = lskdfjlsad, OU = sldfkja, issuer=C = AS, ST = ASDfkjdhf, L = lskdjf, O = saldfja, OU = skdjf, CN = localhost, emailAddress = sadjflkadsj): : certificate has expired
Google Test trace:
/data0/somelongdirectorytoavoidrpathissues/src/kudu/src/kudu/rpc/rpc-test.cc:267: Connecting to unix:/tmp/dist-test-taskigHGGI/test-tmp/rpc-test-89e1e304dd714ed38f4c181286fe6cf1.sock
I20260926 16:12:59.480036 1209 test_util.cc:175] -----------------------------------------------
I20260926 16:12:59.480299 1209 test_util.cc:176] Had fatal failures, leaving test files at /tmp/dist-test-taskigHGGI/test-tmp/rpc-test.6.Parameters_TestRpc.TestCallWithChainCertAndChainCA_SSL_UnixSocket.1790439178040940-1209-0
Full log
Note: This is test shard 7 of 8.
[==========] Running 21 tests from 2 test suites.
[----------] Global test environment set-up.
[----------] 20 tests from Parameters/TestRpc
[ RUN ] Parameters/TestRpc.TestMessengerCreateDestroy/SSL_UnixSocket
WARNING: Logging before InitGoogleLogging() is written to STDERR
I20260926 16:12:58.142108 1209 rpc-test.cc:169] started messenger TestCreateDestroy
[ OK ] Parameters/TestRpc.TestMessengerCreateDestroy/SSL_UnixSocket (1221 ms)
[ RUN ] Parameters/TestRpc.TestNegotiationDeadlock/SSL_UnixSocket
I20260926 16:12:59.363560 1231 acceptor_pool.cc:254] collecting diagnostics on the listening RPC socket unix:/tmp/dist-test-taskigHGGI/test-tmp/rpc-test-25753d12f69f4ccab54e68a006f51485.sock every 8 connection(s)
I20260926 16:12:59.364956 1232 acceptor_pool.cc:254] collecting diagnostics on the listening RPC socket unix:/tmp/dist-test-taskigHGGI/test-tmp/rpc-test-25753d12f69f4ccab54e68a006f51485.sock every 8 connection(s)
[ OK ] Parameters/TestRpc.TestNegotiationDeadlock/SSL_UnixSocket (107 ms)
[ RUN ] Parameters/TestRpc.TestCallWithChainCertAndChainCA/SSL_UnixSocket
I20260926 16:12:59.448832 1247 acceptor_pool.cc:254] collecting diagnostics on the listening RPC socket unix:/tmp/dist-test-taskigHGGI/test-tmp/rpc-test-89e1e304dd714ed38f4c181286fe6cf1.sock every 8 connection(s)
I20260926 16:12:59.451318 1248 acceptor_pool.cc:254] collecting diagnostics on the listening RPC socket unix:/tmp/dist-test-taskigHGGI/test-tmp/rpc-test-89e1e304dd714ed38f4c181286fe6cf1.sock every 8 connection(s)
/data0/somelongdirectorytoavoidrpathissues/src/kudu/src/kudu/rpc/rpc-test.cc:270: Failure
Failed
Bad status: Runtime error: could not verify certificate chain (error with cert: subject=CN = localhost, ST = sadfjas, C = AS, emailAddress = sdflkdsajf, O = lskdfjlsad, OU = sldfkja, issuer=C = AS, ST = ASDfkjdhf, L = lskdjf, O = saldfja, OU = skdjf, CN = localhost, emailAddress = sadjflkadsj): : certificate has expired
Google Test trace:
/data0/somelongdirectorytoavoidrpathissues/src/kudu/src/kudu/rpc/rpc-test.cc:267: Connecting to unix:/tmp/dist-test-taskigHGGI/test-tmp/rpc-test-89e1e304dd714ed38f4c181286fe6cf1.sock
I20260926 16:12:59.480036 1209 test_util.cc:175] -----------------------------------------------
I20260926 16:12:59.480299 1209 test_util.cc:176] Had fatal failures, leaving test files at /tmp/dist-test-taskigHGGI/test-tmp/rpc-test.6.Parameters_TestRpc.TestCallWithChainCertAndChainCA_SSL_UnixSocket.1790439178040940-1209-0
[ FAILED ] Parameters/TestRpc.TestCallWithChainCertAndChainCA/SSL_UnixSocket, where GetParam() = (true, true) (54 ms)
[ RUN ] Parameters/TestRpc.TestCallWithPasswordProtectedKey/SSL_UnixSocket
I20260926 16:12:59.515004 1272 acceptor_pool.cc:254] collecting diagnostics on the listening RPC socket unix:/tmp/dist-test-taskigHGGI/test-tmp/rpc-test-8bad72c339424b9c80d4871cc148cf46.sock every 8 connection(s)
I20260926 16:12:59.515765 1273 acceptor_pool.cc:254] collecting diagnostics on the listening RPC socket unix:/tmp/dist-test-taskigHGGI/test-tmp/rpc-test-8bad72c339424b9c80d4871cc148cf46.sock every 8 connection(s)
[ OK ] Parameters/TestRpc.TestCallWithPasswordProtectedKey/SSL_UnixSocket (83 ms)
[ RUN ] Parameters/TestRpc.TestCallToBadServer/SSL_UnixSocket
I20260926 16:12:59.597790 1209 rpc-test.cc:394] Status: Network error: Client connection negotiation failed: client connection to 0.0.0.0:0: connect: Connection refused (error 111)
I20260926 16:12:59.599239 1209 rpc-test.cc:394] Status: Network error: Client connection negotiation failed: client connection to 0.0.0.0:0: connect: Connection refused (error 111)
I20260926 16:12:59.600762 1209 rpc-test.cc:394] Status: Network error: Client connection negotiation failed: client connection to 0.0.0.0:0: connect: Connection refused (error 111)
I20260926 16:12:59.602219 1209 rpc-test.cc:394] Status: Network error: Client connection negotiation failed: client connection to 0.0.0.0:0: connect: Connection refused (error 111)
I20260926 16:12:59.603613 1209 rpc-test.cc:394] Status: Network error: Client connection negotiation failed: client connection to 0.0.0.0:0: connect: Connection refused (error 111)
[ OK ] Parameters/TestRpc.TestCallToBadServer/SSL_UnixSocket (42 ms)
[ RUN ] Parameters/TestRpc.TestWrongService/SSL_UnixSocket
I20260926 16:12:59.622978 1307 acceptor_pool.cc:254] collecting diagnostics on the listening RPC socket unix:/tmp/dist-test-taskigHGGI/test-tmp/rpc-test-9972b223b9fd46e09e991728683604c3.sock every 8 connection(s)
I20260926 16:12:59.623798 1308 acceptor_pool.cc:254] collecting diagnostics on the listening RPC socket unix:/tmp/dist-test-taskigHGGI/test-tmp/rpc-test-9972b223b9fd46e09e991728683604c3.sock every 8 connection(s)
I20260926 16:12:59.665796 1304 messenger.cc:345] service WrongServiceName not registered on TestServer
[ OK ] Parameters/TestRpc.TestWrongService/SSL_UnixSocket (66 ms)
[ RUN ] Parameters/TestRpc.TestConnectionKeepalive/SSL_UnixSocket
I20260926 16:12:59.697422 1330 acceptor_pool.cc:254] collecting diagnostics on the listening RPC socket unix:/tmp/dist-test-taskigHGGI/test-tmp/rpc-test-f9873552155048489dc7065386b5b514.sock every 8 connection(s)
I20260926 16:12:59.698244 1331 acceptor_pool.cc:254] collecting diagnostics on the listening RPC socket unix:/tmp/dist-test-taskigHGGI/test-tmp/rpc-test-f9873552155048489dc7065386b5b514.sock every 8 connection(s)
I20260926 16:12:59.701292 1209 rpc-test.cc:488] Connecting to unix:/tmp/dist-test-taskigHGGI/test-tmp/rpc-test-f9873552155048489dc7065386b5b514.sock
W20260926 16:13:00.177304 1343 connection.cc:196] Error closing socket: Network error: TlsSocket::Close: Broken pipe
[ OK ] Parameters/TestRpc.TestConnectionKeepalive/SSL_UnixSocket (1094 ms)
[ RUN ] Parameters/TestRpc.TestClientConnectionMetrics/SSL_UnixSocket
I20260926 16:13:00.796445 1355 acceptor_pool.cc:254] collecting diagnostics on the listening RPC socket unix:/tmp/dist-test-taskigHGGI/test-tmp/rpc-test-d186931f1b4143d59c0166cc6d8e8039.sock every 8 connection(s)
I20260926 16:13:00.797297 1356 acceptor_pool.cc:254] collecting diagnostics on the listening RPC socket unix:/tmp/dist-test-taskigHGGI/test-tmp/rpc-test-d186931f1b4143d59c0166cc6d8e8039.sock every 8 connection(s)
I20260926 16:13:00.800631 1209 rpc-test.cc:569] Connecting to unix:/tmp/dist-test-taskigHGGI/test-tmp/rpc-test-d186931f1b4143d59c0166cc6d8e8039.sock
W20260926 16:15:19.633909 1352 connection.cc:196] Error closing socket: Network error: TlsSocket::Close: Broken pipe
[ OK ] Parameters/TestRpc.TestClientConnectionMetrics/SSL_UnixSocket (138873 ms)
[ RUN ] Parameters/TestRpc.TestCredentialsPolicy/SSL_UnixSocket
I20260926 16:15:19.667914 1392 acceptor_pool.cc:254] collecting diagnostics on the listening RPC socket unix:/tmp/dist-test-taskigHGGI/test-tmp/rpc-test-8bbef67fd31f46778f0481e351e5ad00.sock every 8 connection(s)
I20260926 16:15:19.668792 1393 acceptor_pool.cc:254] collecting diagnostics on the listening RPC socket unix:/tmp/dist-test-taskigHGGI/test-tmp/rpc-test-8bbef67fd31f46778f0481e351e5ad00.sock every 8 connection(s)
I20260926 16:15:19.672061 1209 rpc-test.cc:700] Connecting to unix:/tmp/dist-test-taskigHGGI/test-tmp/rpc-test-8bbef67fd31f46778f0481e351e5ad00.sock
W20260926 16:15:19.716894 1391 connection.cc:196] Error closing socket: Network error: TlsSocket::Close: Broken pipe
W20260926 16:15:19.732131 1391 connection.cc:196] Error closing socket: Network error: TlsSocket::Close: Broken pipe
[ OK ] Parameters/TestRpc.TestCredentialsPolicy/SSL_UnixSocket (97 ms)
[ RUN ] Parameters/TestRpc.TestCallLongerThanKeepalive/SSL_UnixSocket
I20260926 16:15:19.773275 1417 acceptor_pool.cc:254] collecting diagnostics on the listening RPC socket unix:/tmp/dist-test-taskigHGGI/test-tmp/rpc-test-51542c0961e34b3d9dbc8ae550912397.sock every 8 connection(s)
I20260926 16:15:19.773988 1418 acceptor_pool.cc:254] collecting diagnostics on the listening RPC socket unix:/tmp/dist-test-taskigHGGI/test-tmp/rpc-test-51542c0961e34b3d9dbc8ae550912397.sock every 8 connection(s)
I20260926 16:15:19.821460 1421 rpc-test-base.h:222] got call: sleep_micros: 3000000 deferred: true
I20260926 16:15:22.825564 1421 rpcz_store.cc:275] Call kudu.rpc.GenericCalculatorService.Sleep from unix:<unnamed> (request call id 0) took 3004 ms. Trace:
I20260926 16:15:22.825903 1421 rpcz_store.cc:276] 0926 16:15:19.821281 (+ 0us) service_pool.cc:170] Inserting onto call queue
0926 16:15:19.821386 (+ 105us) service_pool.cc:227] Handling call
0926 16:15:22.825513 (+3004127us) inbound_call.cc:173] Queueing success response
Metrics: {}
[ OK ] Parameters/TestRpc.TestCallLongerThanKeepalive/SSL_UnixSocket (3095 ms)
[ RUN ] Parameters/TestRpc.TestRpcSidecar/SSL_UnixSocket
I20260926 16:15:22.859838 1442 acceptor_pool.cc:254] collecting diagnostics on the listening RPC socket unix:/tmp/dist-test-taskigHGGI/test-tmp/rpc-test-f61045e349984d0bb60ea757d3ed0d8d.sock every 8 connection(s)
I20260926 16:15:22.860728 1443 acceptor_pool.cc:254] collecting diagnostics on the listening RPC socket unix:/tmp/dist-test-taskigHGGI/test-tmp/rpc-test-f61045e349984d0bb60ea757d3ed0d8d.sock every 8 connection(s)
[ OK ] Parameters/TestRpc.TestRpcSidecar/SSL_UnixSocket (569 ms)
[ RUN ] Parameters/TestRpc.TestRpcSidecarLimits/SSL_UnixSocket
I20260926 16:15:40.939823 1469 acceptor_pool.cc:254] collecting diagnostics on the listening RPC socket unix:/tmp/dist-test-taskigHGGI/test-tmp/rpc-test-62b3d67b334944ce9d497a322cfa93d1.sock every 8 connection(s)
I20260926 16:15:40.940796 1470 acceptor_pool.cc:254] collecting diagnostics on the listening RPC socket unix:/tmp/dist-test-taskigHGGI/test-tmp/rpc-test-62b3d67b334944ce9d497a322cfa93d1.sock every 8 connection(s)
W20260926 16:15:40.959312 1209 serialization.cc:72] Serialized kudu.rpc_test.PushStringsRequestPB (2147483654 bytes) is larger than the maximum configured RPC message size (52428800 bytes). Sending anyway, but peer may reject the data.
W20260926 16:15:40.969897 1466 connection.cc:535] server connection from unix:<unnamed> recv error: Network error: RPC frame had a length of 2147483714, but we only support messages up to 52428800 bytes long.
W20260926 16:15:40.970243 1466 connection.cc:158] shutting down server connection from unix:<unnamed> with pending inbound data: 4/2147483714 bytes received; last active 0 ns ago: status Network error: RPC frame had a length of 2147483714, but we only support messages up to 52428800 bytes long.
W20260926 16:15:40.971060 1482 connection.cc:698] client connection to unix:/tmp/dist-test-taskigHGGI/test-tmp/rpc-test-62b3d67b334944ce9d497a322cfa93d1.sock send error: Network error: failed to write to TLS socket: Broken pipe
W20260926 16:15:40.971803 1482 connection.cc:196] Error closing socket: Network error: TlsSocket::Close: Success
[ OK ] Parameters/TestRpc.TestRpcSidecarLimits/SSL_UnixSocket (18243 ms)
[ RUN ] Parameters/TestRpc.TestCallTimeoutDoesntAffectNegotiation/SSL_UnixSocket
I20260926 16:15:41.677548 1494 acceptor_pool.cc:254] collecting diagnostics on the listening RPC socket unix:/tmp/dist-test-taskigHGGI/test-tmp/rpc-test-3fada2e2decb4d43aa501f991b9a0ee1.sock every 8 connection(s)
I20260926 16:15:41.678237 1495 acceptor_pool.cc:254] collecting diagnostics on the listening RPC socket unix:/tmp/dist-test-taskigHGGI/test-tmp/rpc-test-3fada2e2decb4d43aa501f991b9a0ee1.sock every 8 connection(s)
W20260926 16:15:41.715178 1490 negotiation.cc:266] Injecting 500ms delay in negotiation
I20260926 16:15:41.765465 1209 rpc-test-base.h:595] status: Timed out: connection negotiation to unix:/tmp/dist-test-taskigHGGI/test-tmp/rpc-test-3fada2e2decb4d43aa501f991b9a0ee1.sock for RPC Sleep timed out after 0.050s (ON_OUTBOUND_QUEUE), seconds elapsed: 0.0512705
[ OK ] Parameters/TestRpc.TestCallTimeoutDoesntAffectNegotiation/SSL_UnixSocket (583 ms)
[ RUN ] Parameters/TestRpc.TestRpcHandlerLatencyMetric/SSL_UnixSocket
I20260926 16:15:42.260934 1519 acceptor_pool.cc:254] collecting diagnostics on the listening RPC socket unix:/tmp/dist-test-taskigHGGI/test-tmp/rpc-test-3a911a201f994303ab44824f01e95f87.sock every 8 connection(s)
I20260926 16:15:42.261638 1520 acceptor_pool.cc:254] collecting diagnostics on the listening RPC socket unix:/tmp/dist-test-taskigHGGI/test-tmp/rpc-test-3a911a201f994303ab44824f01e95f87.sock every 8 connection(s)
I20260926 16:15:42.310206 1209 rpc-test.cc:1236] Sleep() min lat: 21621
I20260926 16:15:42.310501 1209 rpc-test.cc:1237] Sleep() mean lat: 21621
I20260926 16:15:42.310678 1209 rpc-test.cc:1238] Sleep() max lat: 21621
I20260926 16:15:42.310839 1209 rpc-test.cc:1239] Sleep() #calls: 1
W20260926 16:15:42.313805 1516 connection.cc:196] Error closing socket: Network error: TlsSocket::Close: Broken pipe
[ OK ] Parameters/TestRpc.TestRpcHandlerLatencyMetric/SSL_UnixSocket (86 ms)
[ RUN ] Parameters/TestRpc.TimedOutOnResponseMetricServiceQueue/SSL_UnixSocket
I20260926 16:15:42.348414 1545 acceptor_pool.cc:254] collecting diagnostics on the listening RPC socket unix:/tmp/dist-test-taskigHGGI/test-tmp/rpc-test-ee317d3780b14457a7cd83f0a627335a.sock every 8 connection(s)
I20260926 16:15:42.349157 1546 acceptor_pool.cc:254] collecting diagnostics on the listening RPC socket unix:/tmp/dist-test-taskigHGGI/test-tmp/rpc-test-ee317d3780b14457a7cd83f0a627335a.sock every 8 connection(s)
W20260926 16:15:42.428814 1547 rpcz_store.cc:267] Call kudu.rpc_test.CalculatorService.Sleep from unix:<unnamed> (request call id 2) took 20 ms (client timeout 20 ms). Trace:
W20260926 16:15:42.429230 1547 rpcz_store.cc:269] 0926 16:15:42.408229 (+ 0us) service_pool.cc:170] Inserting onto call queue
0926 16:15:42.428612 (+ 20383us) service_pool.cc:214] Skipping call since client already timed out
0926 16:15:42.428719 (+ 107us) inbound_call.cc:173] Queueing failure response
Metrics: {}
W20260926 16:15:42.431797 1542 connection.cc:196] Error closing socket: Network error: TlsSocket::Close: Broken pipe
[ OK ] Parameters/TestRpc.TimedOutOnResponseMetricServiceQueue/SSL_UnixSocket (116 ms)
[ RUN ] Parameters/TestRpc.RpcPendingConnectionsMetric/SSL_UnixSocket
I20260926 16:15:42.445990 1568 acceptor_pool.cc:254] collecting diagnostics on the listening RPC socket 0.0.0.0:41691 every 8 connection(s)
I20260926 16:15:42.446727 1569 acceptor_pool.cc:254] collecting diagnostics on the listening RPC socket 0.0.0.0:41691 every 8 connection(s)
W20260926 16:15:42.463277 1564 negotiation.cc:337] Failed RPC negotiation. Trace:
0926 16:15:42.461701 (+ 0us) reactor.cc:625] Submitting negotiation task for server connection from 127.0.0.1:49886 (local address 127.0.0.1:41691)
0926 16:15:42.462391 (+ 690us) server_negotiation.cc:206] Beginning negotiation
0926 16:15:42.462410 (+ 19us) server_negotiation.cc:399] Waiting for connection header
0926 16:15:42.462638 (+ 228us) negotiation.cc:327] Negotiation complete: Network error: Server connection negotiation failed: server connection from 127.0.0.1:49886: BlockingRecv error: recv got EOF from 127.0.0.1:49886 (error 108)
Metrics: {"server-negotiator.queue_time_us":166}
[ OK ] Parameters/TestRpc.RpcPendingConnectionsMetric/SSL_UnixSocket (40 ms)
[ RUN ] Parameters/TestRpc.TestRpcContextClientDeadline/SSL_UnixSocket
I20260926 16:15:42.510426 1584 acceptor_pool.cc:254] collecting diagnostics on the listening RPC socket unix:/tmp/dist-test-taskigHGGI/test-tmp/rpc-test-ff03d2c861ed4eabbea285042caaa215.sock every 8 connection(s)
I20260926 16:15:42.511055 1585 acceptor_pool.cc:254] collecting diagnostics on the listening RPC socket unix:/tmp/dist-test-taskigHGGI/test-tmp/rpc-test-ff03d2c861ed4eabbea285042caaa215.sock every 8 connection(s)
[ OK ] Parameters/TestRpc.TestRpcContextClientDeadline/SSL_UnixSocket (109 ms)
[ RUN ] Parameters/TestRpc.TestApplicationFeatureFlagUnsupportedServer/SSL_UnixSocket
I20260926 16:15:42.618228 1609 acceptor_pool.cc:254] collecting diagnostics on the listening RPC socket unix:/tmp/dist-test-taskigHGGI/test-tmp/rpc-test-e8d74fe694ec40bd8fcffe29f62b6b72.sock every 8 connection(s)
I20260926 16:15:42.618922 1610 acceptor_pool.cc:254] collecting diagnostics on the listening RPC socket unix:/tmp/dist-test-taskigHGGI/test-tmp/rpc-test-e8d74fe694ec40bd8fcffe29f62b6b72.sock every 8 connection(s)
[ OK ] Parameters/TestRpc.TestApplicationFeatureFlagUnsupportedServer/SSL_UnixSocket (89 ms)
[ RUN ] Parameters/TestRpc.TestCancellationAsync/SSL_UnixSocket
I20260926 16:15:42.697491 1634 acceptor_pool.cc:254] collecting diagnostics on the listening RPC socket unix:/tmp/dist-test-taskigHGGI/test-tmp/rpc-test-8ed4fe772d3044fd875a7b7c7a483058.sock every 8 connection(s)
I20260926 16:15:42.698184 1635 acceptor_pool.cc:254] collecting diagnostics on the listening RPC socket unix:/tmp/dist-test-taskigHGGI/test-tmp/rpc-test-8ed4fe772d3044fd875a7b7c7a483058.sock every 8 connection(s)
I20260926 16:15:42.701367 1209 rpc-test.cc:1716] Connecting to unix:/tmp/dist-test-taskigHGGI/test-tmp/rpc-test-8ed4fe772d3044fd875a7b7c7a483058.sock
I20260926 16:15:42.729460 1209 test_util.cc:268] Using random seed: 621013216
I20260926 16:15:42.952628 1638 rpc-test-base.h:240] got call: sleep_micros: 500 pattern: 4294967295 num_repetitions: 2097152 sidecar_idx: 0
I20260926 16:15:43.138898 1637 rpc-test-base.h:240] got call: sleep_micros: 500 pattern: 4294967295 num_repetitions: 2097152 sidecar_idx: 0
I20260926 16:15:43.370478 1638 rpc-test-base.h:240] got call: sleep_micros: 500 pattern: 4294967295 num_repetitions: 2097152 sidecar_idx: 0
I20260926 16:15:43.568038 1637 rpc-test-base.h:240] got call: sleep_micros: 500 pattern: 4294967295 num_repetitions: 2097152 sidecar_idx: 0
I20260926 16:15:43.807597 1637 rpc-test-base.h:240] got call: sleep_micros: 500 pattern: 4294967295 num_repetitions: 2097152 sidecar_idx: 0
I20260926 16:15:44.020090 1637 rpc-test-base.h:240] got call: sleep_micros: 500 pattern: 4294967295 num_repetitions: 2097152 sidecar_idx: 0
I20260926 16:15:44.195950 1638 rpc-test-base.h:240] got call: sleep_micros: 500 pattern: 4294967295 num_repetitions: 2097152 sidecar_idx: 0
I20260926 16:15:44.424360 1638 rpc-test-base.h:240] got call: sleep_micros: 500 pattern: 4294967295 num_repetitions: 2097152 sidecar_idx: 0
I20260926 16:15:44.629674 1637 rpc-test-base.h:240] got call: sleep_micros: 500 pattern: 4294967295 num_repetitions: 2097152 sidecar_idx: 0
W20260926 16:15:44.689812 1631 connection.cc:441] server connection from unix:<unnamed> torn down before Call kudu.rpc.GenericCalculatorService.SleepWithSidecar from unix:<unnamed> (request call id 8) could send its response
W20260926 16:15:44.791664 1631 connection.cc:441] server connection from unix:<unnamed> torn down before Call kudu.rpc.GenericCalculatorService.SleepWithSidecar from unix:<unnamed> (request call id 9) could send its response
[ OK ] Parameters/TestRpc.TestCancellationAsync/SSL_UnixSocket (2125 ms)
[ RUN ] Parameters/TestRpc.TestPerformanceBySocketType/SSL_UnixSocket
I20260926 16:15:44.894578 1659 acceptor_pool.cc:254] collecting diagnostics on the listening RPC socket unix:/tmp/dist-test-taskigHGGI/test-tmp/rpc-test-68567dcdf01d4409b42df2a95576d982.sock every 8 connection(s)
I20260926 16:15:44.895341 1660 acceptor_pool.cc:254] collecting diagnostics on the listening RPC socket unix:/tmp/dist-test-taskigHGGI/test-tmp/rpc-test-68567dcdf01d4409b42df2a95576d982.sock every 8 connection(s)
I20260926 16:15:44.898450 1209 rpc-test.cc:1846] Connecting to unix:/tmp/dist-test-taskigHGGI/test-tmp/rpc-test-68567dcdf01d4409b42df2a95576d982.sock
I20260926 16:16:06.602344 1209 rpc-test.cc:1859] Sending 1024MB via ssl-enabled unix socket: real 21.677s user 19.601s sys 13.031s
I20260926 16:16:28.631425 1209 rpc-test.cc:1859] Sending 1024MB via ssl-enabled unix socket: real 22.029s user 19.828s sys 13.464s
I20260926 16:16:50.378988 1209 rpc-test.cc:1859] Sending 1024MB via ssl-enabled unix socket: real 21.747s user 19.313s sys 13.418s
I20260926 16:17:12.150306 1209 rpc-test.cc:1859] Sending 1024MB via ssl-enabled unix socket: real 21.771s user 19.741s sys 13.087s
I20260926 16:17:33.593604 1209 rpc-test.cc:1859] Sending 1024MB via ssl-enabled unix socket: real 21.443s user 19.452s sys 12.839s
W20260926 16:17:33.599117 1656 connection.cc:196] Error closing socket: Network error: TlsSocket::Close: Broken pipe
[ OK ] Parameters/TestRpc.TestPerformanceBySocketType/SSL_UnixSocket (108809 ms)
[----------] 20 tests from Parameters/TestRpc (275516 ms total)
[----------] 1 test from Parameters/TestRpcSocketTxRxQueue
[ RUN ] Parameters/TestRpcSocketTxRxQueue.AcceptorRxQueueSizeMetric/0
I20260926 16:17:33.629360 1695 acceptor_pool.cc:254] collecting diagnostics on the listening RPC socket 0.0.0.0:45175 every 1 connection(s)
I20260926 16:17:33.630344 1696 acceptor_pool.cc:254] collecting diagnostics on the listening RPC socket 0.0.0.0:45175 every 1 connection(s)
W20260926 16:17:33.636636 1691 negotiation.cc:337] Failed RPC negotiation. Trace:
0926 16:17:33.634827 (+ 0us) reactor.cc:625] Submitting negotiation task for server connection from 127.0.0.1:42092 (local address 127.0.0.1:45175)
0926 16:17:33.635345 (+ 518us) server_negotiation.cc:206] Beginning negotiation
0926 16:17:33.635370 (+ 25us) server_negotiation.cc:399] Waiting for connection header
0926 16:17:33.635619 (+ 249us) negotiation.cc:327] Negotiation complete: Network error: Server connection negotiation failed: server connection from 127.0.0.1:42092: BlockingRecv error: recv got EOF from 127.0.0.1:42092 (error 108)
Metrics: {"server-negotiator.queue_time_us":140}
[ OK ] Parameters/TestRpcSocketTxRxQueue.AcceptorRxQueueSizeMetric/0 (32 ms)
[----------] 1 test from Parameters/TestRpcSocketTxRxQueue (32 ms total)
[----------] Global test environment tear-down
[==========] 21 tests from 2 test suites ran. (275550 ms total)
[ PASSED ] 20 tests.
[ FAILED ] 1 test, listed below:
[ FAILED ] Parameters/TestRpc.TestCallWithChainCertAndChainCA/SSL_UnixSocket, where GetParam() = (true, true)
1 FAILED TEST