Diagnosed failure

Parameters/TestRpc.TestCallWithChainCertAndChainCA/SSL_UnixSocket: /data0/somelongdirectorytoavoidrpathissues/src/kudu/src/kudu/rpc/rpc-test.cc:270: Failure
Failed
Bad status: Runtime error: could not verify certificate chain (error with cert: subject=CN = localhost, ST = sadfjas, C = AS, emailAddress = sdflkdsajf, O = lskdfjlsad, OU = sldfkja, issuer=C = AS, ST = ASDfkjdhf, L = lskdjf, O = saldfja, OU = skdjf, CN = localhost, emailAddress = sadjflkadsj): : certificate has expired
Google Test trace:
/data0/somelongdirectorytoavoidrpathissues/src/kudu/src/kudu/rpc/rpc-test.cc:267: Connecting to unix:/tmp/dist-test-task6WS1E8/test-tmp/rpc-test-1bbedc1852924a7bbf33cbbb1481be8c.sock
I20260925 14:52:25.725726 19068 test_util.cc:175] -----------------------------------------------
I20260925 14:52:25.725771 19068 test_util.cc:176] Had fatal failures, leaving test files at /tmp/dist-test-task6WS1E8/test-tmp/rpc-test.6.Parameters_TestRpc.TestCallWithChainCertAndChainCA_SSL_UnixSocket.1790347945670473-19068-0

Full log

Note: This is test shard 7 of 8.
[==========] Running 21 tests from 2 test suites.
[----------] Global test environment set-up.
[----------] 20 tests from Parameters/TestRpc
[ RUN      ] Parameters/TestRpc.TestMessengerCreateDestroy/SSL_UnixSocket
WARNING: Logging before InitGoogleLogging() is written to STDERR
I20260925 14:52:25.690172 19068 rpc-test.cc:169] started messenger TestCreateDestroy
[       OK ] Parameters/TestRpc.TestMessengerCreateDestroy/SSL_UnixSocket (18 ms)
[ RUN      ] Parameters/TestRpc.TestNegotiationDeadlock/SSL_UnixSocket
I20260925 14:52:25.708626 19088 acceptor_pool.cc:254] collecting diagnostics on the listening RPC socket unix:/tmp/dist-test-task6WS1E8/test-tmp/rpc-test-97f8a8f9935448c9a27d5e0638b18d36.sock every 8 connection(s)
I20260925 14:52:25.708636 19089 acceptor_pool.cc:254] collecting diagnostics on the listening RPC socket unix:/tmp/dist-test-task6WS1E8/test-tmp/rpc-test-97f8a8f9935448c9a27d5e0638b18d36.sock every 8 connection(s)
[       OK ] Parameters/TestRpc.TestNegotiationDeadlock/SSL_UnixSocket (23 ms)
[ RUN      ] Parameters/TestRpc.TestCallWithChainCertAndChainCA/SSL_UnixSocket
I20260925 14:52:25.722339 19104 acceptor_pool.cc:254] collecting diagnostics on the listening RPC socket unix:/tmp/dist-test-task6WS1E8/test-tmp/rpc-test-1bbedc1852924a7bbf33cbbb1481be8c.sock every 8 connection(s)
I20260925 14:52:25.722386 19105 acceptor_pool.cc:254] collecting diagnostics on the listening RPC socket unix:/tmp/dist-test-task6WS1E8/test-tmp/rpc-test-1bbedc1852924a7bbf33cbbb1481be8c.sock every 8 connection(s)
/data0/somelongdirectorytoavoidrpathissues/src/kudu/src/kudu/rpc/rpc-test.cc:270: Failure
Failed
Bad status: Runtime error: could not verify certificate chain (error with cert: subject=CN = localhost, ST = sadfjas, C = AS, emailAddress = sdflkdsajf, O = lskdfjlsad, OU = sldfkja, issuer=C = AS, ST = ASDfkjdhf, L = lskdjf, O = saldfja, OU = skdjf, CN = localhost, emailAddress = sadjflkadsj): : certificate has expired
Google Test trace:
/data0/somelongdirectorytoavoidrpathissues/src/kudu/src/kudu/rpc/rpc-test.cc:267: Connecting to unix:/tmp/dist-test-task6WS1E8/test-tmp/rpc-test-1bbedc1852924a7bbf33cbbb1481be8c.sock
I20260925 14:52:25.725726 19068 test_util.cc:175] -----------------------------------------------
I20260925 14:52:25.725771 19068 test_util.cc:176] Had fatal failures, leaving test files at /tmp/dist-test-task6WS1E8/test-tmp/rpc-test.6.Parameters_TestRpc.TestCallWithChainCertAndChainCA_SSL_UnixSocket.1790347945670473-19068-0
[  FAILED  ] Parameters/TestRpc.TestCallWithChainCertAndChainCA/SSL_UnixSocket, where GetParam() = (true, true) (11 ms)
[ RUN      ] Parameters/TestRpc.TestCallWithPasswordProtectedKey/SSL_UnixSocket
I20260925 14:52:25.739598 19129 acceptor_pool.cc:254] collecting diagnostics on the listening RPC socket unix:/tmp/dist-test-task6WS1E8/test-tmp/rpc-test-d6f2f630e0ce466eb07de0c1c8a3409b.sock every 8 connection(s)
I20260925 14:52:25.739684 19130 acceptor_pool.cc:254] collecting diagnostics on the listening RPC socket unix:/tmp/dist-test-task6WS1E8/test-tmp/rpc-test-d6f2f630e0ce466eb07de0c1c8a3409b.sock every 8 connection(s)
W20260925 14:52:25.750006 19126 connection.cc:196] Error closing socket: Network error: TlsSocket::Close: Broken pipe
[       OK ] Parameters/TestRpc.TestCallWithPasswordProtectedKey/SSL_UnixSocket (25 ms)
[ RUN      ] Parameters/TestRpc.TestCallToBadServer/SSL_UnixSocket
I20260925 14:52:25.759912 19068 rpc-test.cc:394] Status: Network error: Client connection negotiation failed: client connection to 0.0.0.0:0: connect: Connection refused (error 111)
I20260925 14:52:25.760169 19068 rpc-test.cc:394] Status: Network error: Client connection negotiation failed: client connection to 0.0.0.0:0: connect: Connection refused (error 111)
I20260925 14:52:25.760370 19068 rpc-test.cc:394] Status: Network error: Client connection negotiation failed: client connection to 0.0.0.0:0: connect: Connection refused (error 111)
I20260925 14:52:25.760550 19068 rpc-test.cc:394] Status: Network error: Client connection negotiation failed: client connection to 0.0.0.0:0: connect: Connection refused (error 111)
I20260925 14:52:25.760720 19068 rpc-test.cc:394] Status: Network error: Client connection negotiation failed: client connection to 0.0.0.0:0: connect: Connection refused (error 111)
[       OK ] Parameters/TestRpc.TestCallToBadServer/SSL_UnixSocket (10 ms)
[ RUN      ] Parameters/TestRpc.TestWrongService/SSL_UnixSocket
I20260925 14:52:25.799180 19164 acceptor_pool.cc:254] collecting diagnostics on the listening RPC socket unix:/tmp/dist-test-task6WS1E8/test-tmp/rpc-test-9114998a118f4de2a1a40ea163721ca4.sock every 8 connection(s)
I20260925 14:52:25.799217 19165 acceptor_pool.cc:254] collecting diagnostics on the listening RPC socket unix:/tmp/dist-test-task6WS1E8/test-tmp/rpc-test-9114998a118f4de2a1a40ea163721ca4.sock every 8 connection(s)
I20260925 14:52:25.816373 19161 messenger.cc:345] service WrongServiceName not registered on TestServer
[       OK ] Parameters/TestRpc.TestWrongService/SSL_UnixSocket (56 ms)
[ RUN      ] Parameters/TestRpc.TestConnectionKeepalive/SSL_UnixSocket
I20260925 14:52:25.824458 19187 acceptor_pool.cc:254] collecting diagnostics on the listening RPC socket unix:/tmp/dist-test-task6WS1E8/test-tmp/rpc-test-b88db1484eaf4fd59e39ef9414e22146.sock every 8 connection(s)
I20260925 14:52:25.824522 19188 acceptor_pool.cc:254] collecting diagnostics on the listening RPC socket unix:/tmp/dist-test-task6WS1E8/test-tmp/rpc-test-b88db1484eaf4fd59e39ef9414e22146.sock every 8 connection(s)
I20260925 14:52:25.824641 19068 rpc-test.cc:488] Connecting to unix:/tmp/dist-test-task6WS1E8/test-tmp/rpc-test-b88db1484eaf4fd59e39ef9414e22146.sock
W20260925 14:52:26.319947 19200 connection.cc:196] Error closing socket: Network error: TlsSocket::Close: Broken pipe
[       OK ] Parameters/TestRpc.TestConnectionKeepalive/SSL_UnixSocket (1032 ms)
[ RUN      ] Parameters/TestRpc.TestClientConnectionMetrics/SSL_UnixSocket
I20260925 14:52:26.865669 19212 acceptor_pool.cc:254] collecting diagnostics on the listening RPC socket unix:/tmp/dist-test-task6WS1E8/test-tmp/rpc-test-126ebb6118b541e98f52d02f12ed63d1.sock every 8 connection(s)
I20260925 14:52:26.865705 19213 acceptor_pool.cc:254] collecting diagnostics on the listening RPC socket unix:/tmp/dist-test-task6WS1E8/test-tmp/rpc-test-126ebb6118b541e98f52d02f12ed63d1.sock every 8 connection(s)
I20260925 14:52:26.865837 19068 rpc-test.cc:569] Connecting to unix:/tmp/dist-test-task6WS1E8/test-tmp/rpc-test-126ebb6118b541e98f52d02f12ed63d1.sock
W20260925 14:52:34.799182 19209 connection.cc:196] Error closing socket: Network error: TlsSocket::Close: Broken pipe
[       OK ] Parameters/TestRpc.TestClientConnectionMetrics/SSL_UnixSocket (7949 ms)
[ RUN      ] Parameters/TestRpc.TestCredentialsPolicy/SSL_UnixSocket
I20260925 14:52:34.811898 19235 acceptor_pool.cc:254] collecting diagnostics on the listening RPC socket unix:/tmp/dist-test-task6WS1E8/test-tmp/rpc-test-1bbd5facb3e34c5a829cc17d0d5dd894.sock every 8 connection(s)
I20260925 14:52:34.811964 19236 acceptor_pool.cc:254] collecting diagnostics on the listening RPC socket unix:/tmp/dist-test-task6WS1E8/test-tmp/rpc-test-1bbd5facb3e34c5a829cc17d0d5dd894.sock every 8 connection(s)
I20260925 14:52:34.812088 19068 rpc-test.cc:700] Connecting to unix:/tmp/dist-test-task6WS1E8/test-tmp/rpc-test-1bbd5facb3e34c5a829cc17d0d5dd894.sock
W20260925 14:52:34.827795 19234 connection.cc:196] Error closing socket: Network error: TlsSocket::Close: Broken pipe
[       OK ] Parameters/TestRpc.TestCredentialsPolicy/SSL_UnixSocket (31 ms)
[ RUN      ] Parameters/TestRpc.TestCallLongerThanKeepalive/SSL_UnixSocket
I20260925 14:52:34.839330 19260 acceptor_pool.cc:254] collecting diagnostics on the listening RPC socket unix:/tmp/dist-test-task6WS1E8/test-tmp/rpc-test-12361777f5ff4b6bb49ec121a1aa4fef.sock every 8 connection(s)
I20260925 14:52:34.839378 19261 acceptor_pool.cc:254] collecting diagnostics on the listening RPC socket unix:/tmp/dist-test-task6WS1E8/test-tmp/rpc-test-12361777f5ff4b6bb49ec121a1aa4fef.sock every 8 connection(s)
I20260925 14:52:34.854537 19264 rpc-test-base.h:222] got call: sleep_micros: 3000000 deferred: true
I20260925 14:52:37.855155 19264 rpcz_store.cc:275] Call kudu.rpc.GenericCalculatorService.Sleep from unix:<unnamed> (request call id 0) took 3000 ms. Trace:
I20260925 14:52:37.855250 19264 rpcz_store.cc:276] 0925 14:52:34.854486 (+     0us) service_pool.cc:170] Inserting onto call queue
0925 14:52:34.854524 (+    38us) service_pool.cc:227] Handling call
0925 14:52:37.855139 (+3000615us) inbound_call.cc:173] Queueing success response
Metrics: {}
[       OK ] Parameters/TestRpc.TestCallLongerThanKeepalive/SSL_UnixSocket (3025 ms)
[ RUN      ] Parameters/TestRpc.TestRpcSidecar/SSL_UnixSocket
I20260925 14:52:37.867694 19285 acceptor_pool.cc:254] collecting diagnostics on the listening RPC socket unix:/tmp/dist-test-task6WS1E8/test-tmp/rpc-test-5aa9d8761869462f93fec2817ac979d8.sock every 8 connection(s)
I20260925 14:52:37.867726 19286 acceptor_pool.cc:254] collecting diagnostics on the listening RPC socket unix:/tmp/dist-test-task6WS1E8/test-tmp/rpc-test-5aa9d8761869462f93fec2817ac979d8.sock every 8 connection(s)
W20260925 14:52:37.907544 19282 connection.cc:196] Error closing socket: Network error: TlsSocket::Close: Broken pipe
[       OK ] Parameters/TestRpc.TestRpcSidecar/SSL_UnixSocket (51 ms)
[ RUN      ] Parameters/TestRpc.TestRpcSidecarLimits/SSL_UnixSocket
I20260925 14:52:39.418123 19310 acceptor_pool.cc:254] collecting diagnostics on the listening RPC socket unix:/tmp/dist-test-task6WS1E8/test-tmp/rpc-test-384cc971b7b84539a0828f5247a8ab8d.sock every 8 connection(s)
I20260925 14:52:39.418156 19311 acceptor_pool.cc:254] collecting diagnostics on the listening RPC socket unix:/tmp/dist-test-task6WS1E8/test-tmp/rpc-test-384cc971b7b84539a0828f5247a8ab8d.sock every 8 connection(s)
W20260925 14:52:39.430667 19068 serialization.cc:72] Serialized kudu.rpc_test.PushStringsRequestPB (2147483654 bytes) is larger than the maximum configured RPC message size (52428800 bytes). Sending anyway, but peer may reject the data.
W20260925 14:52:39.433310 19307 connection.cc:535] server connection from unix:<unnamed> recv error: Network error: RPC frame had a length of 2147483714, but we only support messages up to 52428800 bytes long.
W20260925 14:52:39.433352 19307 connection.cc:158] shutting down server connection from unix:<unnamed> with pending inbound data: 4/2147483714 bytes received; last active 0 ns ago: status Network error: RPC frame had a length of 2147483714, but we only support messages up to 52428800 bytes long.
W20260925 14:52:39.433451 19323 connection.cc:698] client connection to unix:/tmp/dist-test-task6WS1E8/test-tmp/rpc-test-384cc971b7b84539a0828f5247a8ab8d.sock send error: Network error: failed to write to TLS socket: Broken pipe
W20260925 14:52:39.433549 19323 connection.cc:196] Error closing socket: Network error: TlsSocket::Close: Success
I20260925 14:52:39.448068 19335 acceptor_pool.cc:254] collecting diagnostics on the listening RPC socket unix:/tmp/dist-test-task6WS1E8/test-tmp/rpc-test-384cc971b7b84539a0828f5247a8ab8d.sock every 8 connection(s)
I20260925 14:52:39.448102 19336 acceptor_pool.cc:254] collecting diagnostics on the listening RPC socket unix:/tmp/dist-test-task6WS1E8/test-tmp/rpc-test-384cc971b7b84539a0828f5247a8ab8d.sock every 8 connection(s)
W20260925 14:52:43.355741 19332 connection.cc:577] server connection from unix:<unnamed>: received bad data: 'Corruption: Invalid packet: message had a length of 2147483710, but we only support messages up to 2147483647 bytes
'
W20260925 14:52:43.355998 19348 connection.cc:196] Error closing socket: Network error: TlsSocket::Close: Broken pipe
[       OK ] Parameters/TestRpc.TestRpcSidecarLimits/SSL_UnixSocket (5449 ms)
[ RUN      ] Parameters/TestRpc.TestCallTimeoutDoesntAffectNegotiation/SSL_UnixSocket
I20260925 14:52:43.366124 19360 acceptor_pool.cc:254] collecting diagnostics on the listening RPC socket unix:/tmp/dist-test-task6WS1E8/test-tmp/rpc-test-75fa977490b44541a43eac8f200920c2.sock every 8 connection(s)
I20260925 14:52:43.366194 19361 acceptor_pool.cc:254] collecting diagnostics on the listening RPC socket unix:/tmp/dist-test-task6WS1E8/test-tmp/rpc-test-75fa977490b44541a43eac8f200920c2.sock every 8 connection(s)
W20260925 14:52:43.383460 19356 negotiation.cc:266] Injecting 500ms delay in negotiation
I20260925 14:52:43.433665 19068 rpc-test-base.h:595] status: Timed out: connection negotiation to unix:/tmp/dist-test-task6WS1E8/test-tmp/rpc-test-75fa977490b44541a43eac8f200920c2.sock for RPC Sleep timed out after 0.050s (ON_OUTBOUND_QUEUE), seconds elapsed: 0.0504809
[       OK ] Parameters/TestRpc.TestCallTimeoutDoesntAffectNegotiation/SSL_UnixSocket (530 ms)
[ RUN      ] Parameters/TestRpc.TestRpcHandlerLatencyMetric/SSL_UnixSocket
I20260925 14:52:43.894065 19385 acceptor_pool.cc:254] collecting diagnostics on the listening RPC socket unix:/tmp/dist-test-task6WS1E8/test-tmp/rpc-test-8440c0f7637149b890374d59ae0dd006.sock every 8 connection(s)
I20260925 14:52:43.894104 19386 acceptor_pool.cc:254] collecting diagnostics on the listening RPC socket unix:/tmp/dist-test-task6WS1E8/test-tmp/rpc-test-8440c0f7637149b890374d59ae0dd006.sock every 8 connection(s)
I20260925 14:52:43.920809 19068 rpc-test.cc:1236] Sleep() min lat: 20221
I20260925 14:52:43.920864 19068 rpc-test.cc:1237] Sleep() mean lat: 20221
I20260925 14:52:43.920886 19068 rpc-test.cc:1238] Sleep() max lat: 20221
I20260925 14:52:43.920899 19068 rpc-test.cc:1239] Sleep() #calls: 1
W20260925 14:52:43.921402 19382 connection.cc:196] Error closing socket: Network error: TlsSocket::Close: Broken pipe
[       OK ] Parameters/TestRpc.TestRpcHandlerLatencyMetric/SSL_UnixSocket (34 ms)
[ RUN      ] Parameters/TestRpc.TimedOutOnResponseMetricServiceQueue/SSL_UnixSocket
I20260925 14:52:43.939558 19412 acceptor_pool.cc:254] collecting diagnostics on the listening RPC socket unix:/tmp/dist-test-task6WS1E8/test-tmp/rpc-test-f046d97272f64990918a7f7f21d32a00.sock every 8 connection(s)
I20260925 14:52:43.939662 19411 acceptor_pool.cc:254] collecting diagnostics on the listening RPC socket unix:/tmp/dist-test-task6WS1E8/test-tmp/rpc-test-f046d97272f64990918a7f7f21d32a00.sock every 8 connection(s)
W20260925 14:52:43.990996 19413 rpcz_store.cc:267] Call kudu.rpc_test.CalculatorService.Sleep from unix:<unnamed> (request call id 2) took 20 ms (client timeout 20 ms). Trace:
W20260925 14:52:43.991091 19413 rpcz_store.cc:269] 0925 14:52:43.970780 (+     0us) service_pool.cc:170] Inserting onto call queue
0925 14:52:43.990971 (+ 20191us) service_pool.cc:214] Skipping call since client already timed out
0925 14:52:43.990980 (+     9us) inbound_call.cc:173] Queueing failure response
Metrics: {}
W20260925 14:52:43.991597 19408 connection.cc:196] Error closing socket: Network error: TlsSocket::Close: Broken pipe
[       OK ] Parameters/TestRpc.TimedOutOnResponseMetricServiceQueue/SSL_UnixSocket (70 ms)
[ RUN      ] Parameters/TestRpc.RpcPendingConnectionsMetric/SSL_UnixSocket
I20260925 14:52:43.993927 19434 acceptor_pool.cc:254] collecting diagnostics on the listening RPC socket 0.0.0.0:34033 every 8 connection(s)
I20260925 14:52:43.993992 19435 acceptor_pool.cc:254] collecting diagnostics on the listening RPC socket 0.0.0.0:34033 every 8 connection(s)
W20260925 14:52:43.994513 19430 negotiation.cc:337] Failed RPC negotiation. Trace:
0925 14:52:43.994353 (+     0us) reactor.cc:625] Submitting negotiation task for server connection from 127.0.0.1:50670 (local address 127.0.0.1:34033)
0925 14:52:43.994391 (+    38us) server_negotiation.cc:206] Beginning negotiation
0925 14:52:43.994393 (+     2us) server_negotiation.cc:399] Waiting for connection header
0925 14:52:43.994467 (+    74us) negotiation.cc:327] Negotiation complete: Network error: Server connection negotiation failed: server connection from 127.0.0.1:50670: BlockingRecv error: recv got EOF from 127.0.0.1:50670 (error 108)
Metrics: {"server-negotiator.queue_time_us":15}
[       OK ] Parameters/TestRpc.RpcPendingConnectionsMetric/SSL_UnixSocket (12 ms)
[ RUN      ] Parameters/TestRpc.TestRpcContextClientDeadline/SSL_UnixSocket
I20260925 14:52:44.030705 19450 acceptor_pool.cc:254] collecting diagnostics on the listening RPC socket unix:/tmp/dist-test-task6WS1E8/test-tmp/rpc-test-1e65327d56114d68b2770cdbfda17700.sock every 8 connection(s)
I20260925 14:52:44.030748 19451 acceptor_pool.cc:254] collecting diagnostics on the listening RPC socket unix:/tmp/dist-test-task6WS1E8/test-tmp/rpc-test-1e65327d56114d68b2770cdbfda17700.sock every 8 connection(s)
W20260925 14:52:44.065557 19447 connection.cc:196] Error closing socket: Network error: TlsSocket::Close: Broken pipe
[       OK ] Parameters/TestRpc.TestRpcContextClientDeadline/SSL_UnixSocket (61 ms)
[ RUN      ] Parameters/TestRpc.TestApplicationFeatureFlagUnsupportedServer/SSL_UnixSocket
I20260925 14:52:44.076949 19475 acceptor_pool.cc:254] collecting diagnostics on the listening RPC socket unix:/tmp/dist-test-task6WS1E8/test-tmp/rpc-test-139202e11b2b42b6a4fc9865b44bc78d.sock every 8 connection(s)
I20260925 14:52:44.077003 19476 acceptor_pool.cc:254] collecting diagnostics on the listening RPC socket unix:/tmp/dist-test-task6WS1E8/test-tmp/rpc-test-139202e11b2b42b6a4fc9865b44bc78d.sock every 8 connection(s)
[       OK ] Parameters/TestRpc.TestApplicationFeatureFlagUnsupportedServer/SSL_UnixSocket (29 ms)
[ RUN      ] Parameters/TestRpc.TestCancellationAsync/SSL_UnixSocket
I20260925 14:52:44.107568 19500 acceptor_pool.cc:254] collecting diagnostics on the listening RPC socket unix:/tmp/dist-test-task6WS1E8/test-tmp/rpc-test-86ccf1c0542840b2984f1c9e571db5be.sock every 8 connection(s)
I20260925 14:52:44.107610 19501 acceptor_pool.cc:254] collecting diagnostics on the listening RPC socket unix:/tmp/dist-test-task6WS1E8/test-tmp/rpc-test-86ccf1c0542840b2984f1c9e571db5be.sock every 8 connection(s)
I20260925 14:52:44.107733 19068 rpc-test.cc:1716] Connecting to unix:/tmp/dist-test-task6WS1E8/test-tmp/rpc-test-86ccf1c0542840b2984f1c9e571db5be.sock
I20260925 14:52:44.123692 19068 test_util.cc:268] Using random seed: -563279318
I20260925 14:52:44.137136 19502 rpc-test-base.h:240] got call: sleep_micros: 500 pattern: 4294967295 num_repetitions: 2097152 sidecar_idx: 0
I20260925 14:52:44.147212 19502 rpc-test-base.h:240] got call: sleep_micros: 500 pattern: 4294967295 num_repetitions: 2097152 sidecar_idx: 0
I20260925 14:52:44.157042 19502 rpc-test-base.h:240] got call: sleep_micros: 500 pattern: 4294967295 num_repetitions: 2097152 sidecar_idx: 0
I20260925 14:52:44.166895 19502 rpc-test-base.h:240] got call: sleep_micros: 500 pattern: 4294967295 num_repetitions: 2097152 sidecar_idx: 0
I20260925 14:52:44.176890 19502 rpc-test-base.h:240] got call: sleep_micros: 500 pattern: 4294967295 num_repetitions: 2097152 sidecar_idx: 0
I20260925 14:52:44.186672 19502 rpc-test-base.h:240] got call: sleep_micros: 500 pattern: 4294967295 num_repetitions: 2097152 sidecar_idx: 0
I20260925 14:52:44.196537 19502 rpc-test-base.h:240] got call: sleep_micros: 500 pattern: 4294967295 num_repetitions: 2097152 sidecar_idx: 0
I20260925 14:52:44.206420 19502 rpc-test-base.h:240] got call: sleep_micros: 500 pattern: 4294967295 num_repetitions: 2097152 sidecar_idx: 0
W20260925 14:52:44.207748 19497 connection.cc:196] Error closing socket: Network error: TlsSocket::Close: Broken pipe
W20260925 14:52:44.209381 19497 connection.cc:441] server connection from unix:<unnamed> torn down before Call kudu.rpc.GenericCalculatorService.SleepWithSidecar from unix:<unnamed> (request call id 9) could send its response
[       OK ] Parameters/TestRpc.TestCancellationAsync/SSL_UnixSocket (114 ms)
[ RUN      ] Parameters/TestRpc.TestPerformanceBySocketType/SSL_UnixSocket
I20260925 14:52:44.221186 19525 acceptor_pool.cc:254] collecting diagnostics on the listening RPC socket unix:/tmp/dist-test-task6WS1E8/test-tmp/rpc-test-7fcfceb94b8d44849e989df739c75c0f.sock every 8 connection(s)
I20260925 14:52:44.221235 19526 acceptor_pool.cc:254] collecting diagnostics on the listening RPC socket unix:/tmp/dist-test-task6WS1E8/test-tmp/rpc-test-7fcfceb94b8d44849e989df739c75c0f.sock every 8 connection(s)
I20260925 14:52:44.221362 19068 rpc-test.cc:1846] Connecting to unix:/tmp/dist-test-task6WS1E8/test-tmp/rpc-test-7fcfceb94b8d44849e989df739c75c0f.sock
I20260925 14:52:45.340030 19068 rpc-test.cc:1859] Sending 1024MB via ssl-enabled unix socket: real 1.112s	user 1.095s	sys 0.911s
I20260925 14:52:46.484094 19068 rpc-test.cc:1859] Sending 1024MB via ssl-enabled unix socket: real 1.144s	user 1.222s	sys 0.857s
I20260925 14:52:47.575973 19068 rpc-test.cc:1859] Sending 1024MB via ssl-enabled unix socket: real 1.092s	user 1.237s	sys 0.750s
I20260925 14:52:48.682571 19068 rpc-test.cc:1859] Sending 1024MB via ssl-enabled unix socket: real 1.107s	user 1.179s	sys 0.835s
I20260925 14:52:49.754645 19068 rpc-test.cc:1859] Sending 1024MB via ssl-enabled unix socket: real 1.072s	user 1.200s	sys 0.748s
W20260925 14:52:49.755327 19522 connection.cc:196] Error closing socket: Network error: TlsSocket::Close: Broken pipe
[       OK ] Parameters/TestRpc.TestPerformanceBySocketType/SSL_UnixSocket (5545 ms)
[----------] 20 tests from Parameters/TestRpc (24083 ms total)

[----------] 1 test from Parameters/TestRpcSocketTxRxQueue
[ RUN      ] Parameters/TestRpcSocketTxRxQueue.AcceptorRxQueueSizeMetric/0
I20260925 14:52:49.757616 19550 acceptor_pool.cc:254] collecting diagnostics on the listening RPC socket 0.0.0.0:42849 every 1 connection(s)
I20260925 14:52:49.757678 19551 acceptor_pool.cc:254] collecting diagnostics on the listening RPC socket 0.0.0.0:42849 every 1 connection(s)
W20260925 14:52:49.758123 19546 negotiation.cc:337] Failed RPC negotiation. Trace:
0925 14:52:49.757995 (+     0us) reactor.cc:625] Submitting negotiation task for server connection from 127.0.0.1:37172 (local address 127.0.0.1:42849)
0925 14:52:49.758040 (+    45us) server_negotiation.cc:206] Beginning negotiation
0925 14:52:49.758042 (+     2us) server_negotiation.cc:399] Waiting for connection header
0925 14:52:49.758098 (+    56us) negotiation.cc:327] Negotiation complete: Network error: Server connection negotiation failed: server connection from 127.0.0.1:37172: BlockingRecv error: recv got EOF from 127.0.0.1:37172 (error 108)
Metrics: {"server-negotiator.queue_time_us":14}
[       OK ] Parameters/TestRpcSocketTxRxQueue.AcceptorRxQueueSizeMetric/0 (3 ms)
[----------] 1 test from Parameters/TestRpcSocketTxRxQueue (3 ms total)

[----------] Global test environment tear-down
[==========] 21 tests from 2 test suites ran. (24087 ms total)
[  PASSED  ] 20 tests.
[  FAILED  ] 1 test, listed below:
[  FAILED  ] Parameters/TestRpc.TestCallWithChainCertAndChainCA/SSL_UnixSocket, where GetParam() = (true, true)

 1 FAILED TEST