Diagnosed failure

Parameters/TestRpc.TestCallWithChainCertAndChainCA/SSL_UnixSocket: /data0/somelongdirectorytoavoidrpathissues/src/kudu/src/kudu/rpc/rpc-test.cc:270: Failure
Failed
Bad status: Runtime error: could not verify certificate chain (error with cert: subject=CN = localhost, ST = sadfjas, C = AS, emailAddress = sdflkdsajf, O = lskdfjlsad, OU = sldfkja, issuer=C = AS, ST = ASDfkjdhf, L = lskdjf, O = saldfja, OU = skdjf, CN = localhost, emailAddress = sadjflkadsj): : certificate has expired
Google Test trace:
/data0/somelongdirectorytoavoidrpathissues/src/kudu/src/kudu/rpc/rpc-test.cc:267: Connecting to unix:/tmp/dist-test-task2qDUug/test-tmp/rpc-test-e302762c3f334decb142f34ee0e45db3.sock
I20260926 14:51:12.501343  4085 test_util.cc:175] -----------------------------------------------
I20260926 14:51:12.501389  4085 test_util.cc:176] Had fatal failures, leaving test files at /tmp/dist-test-task2qDUug/test-tmp/rpc-test.6.Parameters_TestRpc.TestCallWithChainCertAndChainCA_SSL_UnixSocket.1790434272454033-4085-0

Full log

Note: This is test shard 7 of 8.
[==========] Running 21 tests from 2 test suites.
[----------] Global test environment set-up.
[----------] 20 tests from Parameters/TestRpc
[ RUN      ] Parameters/TestRpc.TestMessengerCreateDestroy/SSL_UnixSocket
WARNING: Logging before InitGoogleLogging() is written to STDERR
I20260926 14:51:12.473881  4085 rpc-test.cc:169] started messenger TestCreateDestroy
[       OK ] Parameters/TestRpc.TestMessengerCreateDestroy/SSL_UnixSocket (18 ms)
[ RUN      ] Parameters/TestRpc.TestNegotiationDeadlock/SSL_UnixSocket
I20260926 14:51:12.482473  4105 acceptor_pool.cc:254] collecting diagnostics on the listening RPC socket unix:/tmp/dist-test-task2qDUug/test-tmp/rpc-test-275dff70348244169d31894e20b39075.sock every 8 connection(s)
I20260926 14:51:12.482514  4106 acceptor_pool.cc:254] collecting diagnostics on the listening RPC socket unix:/tmp/dist-test-task2qDUug/test-tmp/rpc-test-275dff70348244169d31894e20b39075.sock every 8 connection(s)
[       OK ] Parameters/TestRpc.TestNegotiationDeadlock/SSL_UnixSocket (13 ms)
[ RUN      ] Parameters/TestRpc.TestCallWithChainCertAndChainCA/SSL_UnixSocket
I20260926 14:51:12.497563  4121 acceptor_pool.cc:254] collecting diagnostics on the listening RPC socket unix:/tmp/dist-test-task2qDUug/test-tmp/rpc-test-e302762c3f334decb142f34ee0e45db3.sock every 8 connection(s)
I20260926 14:51:12.497653  4122 acceptor_pool.cc:254] collecting diagnostics on the listening RPC socket unix:/tmp/dist-test-task2qDUug/test-tmp/rpc-test-e302762c3f334decb142f34ee0e45db3.sock every 8 connection(s)
/data0/somelongdirectorytoavoidrpathissues/src/kudu/src/kudu/rpc/rpc-test.cc:270: Failure
Failed
Bad status: Runtime error: could not verify certificate chain (error with cert: subject=CN = localhost, ST = sadfjas, C = AS, emailAddress = sdflkdsajf, O = lskdfjlsad, OU = sldfkja, issuer=C = AS, ST = ASDfkjdhf, L = lskdjf, O = saldfja, OU = skdjf, CN = localhost, emailAddress = sadjflkadsj): : certificate has expired
Google Test trace:
/data0/somelongdirectorytoavoidrpathissues/src/kudu/src/kudu/rpc/rpc-test.cc:267: Connecting to unix:/tmp/dist-test-task2qDUug/test-tmp/rpc-test-e302762c3f334decb142f34ee0e45db3.sock
I20260926 14:51:12.501343  4085 test_util.cc:175] -----------------------------------------------
I20260926 14:51:12.501389  4085 test_util.cc:176] Had fatal failures, leaving test files at /tmp/dist-test-task2qDUug/test-tmp/rpc-test.6.Parameters_TestRpc.TestCallWithChainCertAndChainCA_SSL_UnixSocket.1790434272454033-4085-0
[  FAILED  ] Parameters/TestRpc.TestCallWithChainCertAndChainCA/SSL_UnixSocket, where GetParam() = (true, true) (12 ms)
[ RUN      ] Parameters/TestRpc.TestCallWithPasswordProtectedKey/SSL_UnixSocket
I20260926 14:51:12.556922  4146 acceptor_pool.cc:254] collecting diagnostics on the listening RPC socket unix:/tmp/dist-test-task2qDUug/test-tmp/rpc-test-3ea74105bb774a51b6cf083afceb5a1b.sock every 8 connection(s)
I20260926 14:51:12.556953  4147 acceptor_pool.cc:254] collecting diagnostics on the listening RPC socket unix:/tmp/dist-test-task2qDUug/test-tmp/rpc-test-3ea74105bb774a51b6cf083afceb5a1b.sock every 8 connection(s)
W20260926 14:51:12.568771  4143 connection.cc:196] Error closing socket: Network error: TlsSocket::Close: Broken pipe
[       OK ] Parameters/TestRpc.TestCallWithPasswordProtectedKey/SSL_UnixSocket (68 ms)
[ RUN      ] Parameters/TestRpc.TestCallToBadServer/SSL_UnixSocket
I20260926 14:51:12.576515  4085 rpc-test.cc:394] Status: Network error: Client connection negotiation failed: client connection to 0.0.0.0:0: connect: Connection refused (error 111)
I20260926 14:51:12.576833  4085 rpc-test.cc:394] Status: Network error: Client connection negotiation failed: client connection to 0.0.0.0:0: connect: Connection refused (error 111)
I20260926 14:51:12.577061  4085 rpc-test.cc:394] Status: Network error: Client connection negotiation failed: client connection to 0.0.0.0:0: connect: Connection refused (error 111)
I20260926 14:51:12.577272  4085 rpc-test.cc:394] Status: Network error: Client connection negotiation failed: client connection to 0.0.0.0:0: connect: Connection refused (error 111)
I20260926 14:51:12.577476  4085 rpc-test.cc:394] Status: Network error: Client connection negotiation failed: client connection to 0.0.0.0:0: connect: Connection refused (error 111)
[       OK ] Parameters/TestRpc.TestCallToBadServer/SSL_UnixSocket (8 ms)
[ RUN      ] Parameters/TestRpc.TestWrongService/SSL_UnixSocket
I20260926 14:51:12.595341  4181 acceptor_pool.cc:254] collecting diagnostics on the listening RPC socket unix:/tmp/dist-test-task2qDUug/test-tmp/rpc-test-59c8d1dfcd1b4113bcc37eb238e3f374.sock every 8 connection(s)
I20260926 14:51:12.595371  4182 acceptor_pool.cc:254] collecting diagnostics on the listening RPC socket unix:/tmp/dist-test-task2qDUug/test-tmp/rpc-test-59c8d1dfcd1b4113bcc37eb238e3f374.sock every 8 connection(s)
I20260926 14:51:12.619453  4178 messenger.cc:345] service WrongServiceName not registered on TestServer
[       OK ] Parameters/TestRpc.TestWrongService/SSL_UnixSocket (43 ms)
[ RUN      ] Parameters/TestRpc.TestConnectionKeepalive/SSL_UnixSocket
I20260926 14:51:12.638770  4204 acceptor_pool.cc:254] collecting diagnostics on the listening RPC socket unix:/tmp/dist-test-task2qDUug/test-tmp/rpc-test-fb337c0646aa4a269741bbc2556d6e43.sock every 8 connection(s)
I20260926 14:51:12.638825  4205 acceptor_pool.cc:254] collecting diagnostics on the listening RPC socket unix:/tmp/dist-test-task2qDUug/test-tmp/rpc-test-fb337c0646aa4a269741bbc2556d6e43.sock every 8 connection(s)
I20260926 14:51:12.638988  4085 rpc-test.cc:488] Connecting to unix:/tmp/dist-test-task2qDUug/test-tmp/rpc-test-fb337c0646aa4a269741bbc2556d6e43.sock
W20260926 14:51:13.123466  4217 connection.cc:196] Error closing socket: Network error: TlsSocket::Close: Broken pipe
[       OK ] Parameters/TestRpc.TestConnectionKeepalive/SSL_UnixSocket (1034 ms)
[ RUN      ] Parameters/TestRpc.TestClientConnectionMetrics/SSL_UnixSocket
I20260926 14:51:13.677000  4229 acceptor_pool.cc:254] collecting diagnostics on the listening RPC socket unix:/tmp/dist-test-task2qDUug/test-tmp/rpc-test-dcaa12a0f6cb4d7ca6fd1e644cabc9d1.sock every 8 connection(s)
I20260926 14:51:13.677042  4230 acceptor_pool.cc:254] collecting diagnostics on the listening RPC socket unix:/tmp/dist-test-task2qDUug/test-tmp/rpc-test-dcaa12a0f6cb4d7ca6fd1e644cabc9d1.sock every 8 connection(s)
I20260926 14:51:13.677237  4085 rpc-test.cc:569] Connecting to unix:/tmp/dist-test-task2qDUug/test-tmp/rpc-test-dcaa12a0f6cb4d7ca6fd1e644cabc9d1.sock
W20260926 14:51:22.114719  4226 connection.cc:196] Error closing socket: Network error: TlsSocket::Close: Broken pipe
[       OK ] Parameters/TestRpc.TestClientConnectionMetrics/SSL_UnixSocket (8459 ms)
[ RUN      ] Parameters/TestRpc.TestCredentialsPolicy/SSL_UnixSocket
I20260926 14:51:22.145717  4252 acceptor_pool.cc:254] collecting diagnostics on the listening RPC socket unix:/tmp/dist-test-task2qDUug/test-tmp/rpc-test-8489856cab2b437aa9d7c4887dd4960e.sock every 8 connection(s)
I20260926 14:51:22.145787  4253 acceptor_pool.cc:254] collecting diagnostics on the listening RPC socket unix:/tmp/dist-test-task2qDUug/test-tmp/rpc-test-8489856cab2b437aa9d7c4887dd4960e.sock every 8 connection(s)
I20260926 14:51:22.145946  4085 rpc-test.cc:700] Connecting to unix:/tmp/dist-test-task2qDUug/test-tmp/rpc-test-8489856cab2b437aa9d7c4887dd4960e.sock
W20260926 14:51:22.164050  4251 connection.cc:196] Error closing socket: Network error: TlsSocket::Close: Broken pipe
[       OK ] Parameters/TestRpc.TestCredentialsPolicy/SSL_UnixSocket (52 ms)
[ RUN      ] Parameters/TestRpc.TestCallLongerThanKeepalive/SSL_UnixSocket
I20260926 14:51:22.183431  4277 acceptor_pool.cc:254] collecting diagnostics on the listening RPC socket unix:/tmp/dist-test-task2qDUug/test-tmp/rpc-test-6d0ca203e6c64efda4b2766fd2df84e1.sock every 8 connection(s)
I20260926 14:51:22.183480  4278 acceptor_pool.cc:254] collecting diagnostics on the listening RPC socket unix:/tmp/dist-test-task2qDUug/test-tmp/rpc-test-6d0ca203e6c64efda4b2766fd2df84e1.sock every 8 connection(s)
I20260926 14:51:22.201495  4281 rpc-test-base.h:222] got call: sleep_micros: 3000000 deferred: true
I20260926 14:51:25.202168  4281 rpcz_store.cc:275] Call kudu.rpc.GenericCalculatorService.Sleep from unix:<unnamed> (request call id 0) took 3000 ms. Trace:
I20260926 14:51:25.202266  4281 rpcz_store.cc:276] 0926 14:51:22.201409 (+     0us) service_pool.cc:170] Inserting onto call queue
0926 14:51:22.201470 (+    61us) service_pool.cc:227] Handling call
0926 14:51:25.202152 (+3000682us) inbound_call.cc:173] Queueing success response
Metrics: {}
[       OK ] Parameters/TestRpc.TestCallLongerThanKeepalive/SSL_UnixSocket (3036 ms)
[ RUN      ] Parameters/TestRpc.TestRpcSidecar/SSL_UnixSocket
I20260926 14:51:25.213318  4302 acceptor_pool.cc:254] collecting diagnostics on the listening RPC socket unix:/tmp/dist-test-task2qDUug/test-tmp/rpc-test-cabaeeb7264446508b294b47fee60dcc.sock every 8 connection(s)
I20260926 14:51:25.213450  4303 acceptor_pool.cc:254] collecting diagnostics on the listening RPC socket unix:/tmp/dist-test-task2qDUug/test-tmp/rpc-test-cabaeeb7264446508b294b47fee60dcc.sock every 8 connection(s)
W20260926 14:51:25.264007  4299 connection.cc:196] Error closing socket: Network error: TlsSocket::Close: Broken pipe
[       OK ] Parameters/TestRpc.TestRpcSidecar/SSL_UnixSocket (60 ms)
[ RUN      ] Parameters/TestRpc.TestRpcSidecarLimits/SSL_UnixSocket
I20260926 14:51:26.940613  4327 acceptor_pool.cc:254] collecting diagnostics on the listening RPC socket unix:/tmp/dist-test-task2qDUug/test-tmp/rpc-test-26b15ad8d54949fe9d1e12b05e0d09a3.sock every 8 connection(s)
I20260926 14:51:26.940672  4328 acceptor_pool.cc:254] collecting diagnostics on the listening RPC socket unix:/tmp/dist-test-task2qDUug/test-tmp/rpc-test-26b15ad8d54949fe9d1e12b05e0d09a3.sock every 8 connection(s)
W20260926 14:51:26.952430  4085 serialization.cc:72] Serialized kudu.rpc_test.PushStringsRequestPB (2147483654 bytes) is larger than the maximum configured RPC message size (52428800 bytes). Sending anyway, but peer may reject the data.
W20260926 14:51:26.955493  4324 connection.cc:535] server connection from unix:<unnamed> recv error: Network error: RPC frame had a length of 2147483714, but we only support messages up to 52428800 bytes long.
W20260926 14:51:26.955572  4324 connection.cc:158] shutting down server connection from unix:<unnamed> with pending inbound data: 4/2147483714 bytes received; last active 0 ns ago: status Network error: RPC frame had a length of 2147483714, but we only support messages up to 52428800 bytes long.
W20260926 14:51:26.955727  4340 connection.cc:698] client connection to unix:/tmp/dist-test-task2qDUug/test-tmp/rpc-test-26b15ad8d54949fe9d1e12b05e0d09a3.sock send error: Network error: failed to write to TLS socket: Broken pipe
W20260926 14:51:26.955854  4340 connection.cc:196] Error closing socket: Network error: TlsSocket::Close: Success
I20260926 14:51:26.979923  4353 acceptor_pool.cc:254] collecting diagnostics on the listening RPC socket unix:/tmp/dist-test-task2qDUug/test-tmp/rpc-test-26b15ad8d54949fe9d1e12b05e0d09a3.sock every 8 connection(s)
I20260926 14:51:26.979990  4352 acceptor_pool.cc:254] collecting diagnostics on the listening RPC socket unix:/tmp/dist-test-task2qDUug/test-tmp/rpc-test-26b15ad8d54949fe9d1e12b05e0d09a3.sock every 8 connection(s)
W20260926 14:51:31.225461  4349 connection.cc:577] server connection from unix:<unnamed>: received bad data: 'Corruption: Invalid packet: message had a length of 2147483710, but we only support messages up to 2147483647 bytes
'
W20260926 14:51:31.225756  4365 connection.cc:196] Error closing socket: Network error: TlsSocket::Close: Broken pipe
[       OK ] Parameters/TestRpc.TestRpcSidecarLimits/SSL_UnixSocket (5962 ms)
[ RUN      ] Parameters/TestRpc.TestCallTimeoutDoesntAffectNegotiation/SSL_UnixSocket
I20260926 14:51:31.252835  4377 acceptor_pool.cc:254] collecting diagnostics on the listening RPC socket unix:/tmp/dist-test-task2qDUug/test-tmp/rpc-test-1ef54b5c598e4a049d298e13ca25b81d.sock every 8 connection(s)
I20260926 14:51:31.252890  4378 acceptor_pool.cc:254] collecting diagnostics on the listening RPC socket unix:/tmp/dist-test-task2qDUug/test-tmp/rpc-test-1ef54b5c598e4a049d298e13ca25b81d.sock every 8 connection(s)
W20260926 14:51:31.282383  4373 negotiation.cc:266] Injecting 500ms delay in negotiation
I20260926 14:51:31.332616  4085 rpc-test-base.h:595] status: Timed out: connection negotiation to unix:/tmp/dist-test-task2qDUug/test-tmp/rpc-test-1ef54b5c598e4a049d298e13ca25b81d.sock for RPC Sleep timed out after 0.050s (ON_OUTBOUND_QUEUE), seconds elapsed: 0.0506244
[       OK ] Parameters/TestRpc.TestCallTimeoutDoesntAffectNegotiation/SSL_UnixSocket (559 ms)
[ RUN      ] Parameters/TestRpc.TestRpcHandlerLatencyMetric/SSL_UnixSocket
I20260926 14:51:31.811401  4402 acceptor_pool.cc:254] collecting diagnostics on the listening RPC socket unix:/tmp/dist-test-task2qDUug/test-tmp/rpc-test-a363b66cc5964c6088c32f3cd41f0df5.sock every 8 connection(s)
I20260926 14:51:31.811455  4403 acceptor_pool.cc:254] collecting diagnostics on the listening RPC socket unix:/tmp/dist-test-task2qDUug/test-tmp/rpc-test-a363b66cc5964c6088c32f3cd41f0df5.sock every 8 connection(s)
I20260926 14:51:31.855768  4085 rpc-test.cc:1236] Sleep() min lat: 20312
I20260926 14:51:31.855844  4085 rpc-test.cc:1237] Sleep() mean lat: 20312
I20260926 14:51:31.855938  4085 rpc-test.cc:1238] Sleep() max lat: 20312
I20260926 14:51:31.855966  4085 rpc-test.cc:1239] Sleep() #calls: 1
[       OK ] Parameters/TestRpc.TestRpcHandlerLatencyMetric/SSL_UnixSocket (69 ms)
[ RUN      ] Parameters/TestRpc.TimedOutOnResponseMetricServiceQueue/SSL_UnixSocket
I20260926 14:51:31.873507  4428 acceptor_pool.cc:254] collecting diagnostics on the listening RPC socket unix:/tmp/dist-test-task2qDUug/test-tmp/rpc-test-d2320f66a1ba44f7a047ac6f962d5143.sock every 8 connection(s)
I20260926 14:51:31.873531  4429 acceptor_pool.cc:254] collecting diagnostics on the listening RPC socket unix:/tmp/dist-test-task2qDUug/test-tmp/rpc-test-d2320f66a1ba44f7a047ac6f962d5143.sock every 8 connection(s)
W20260926 14:51:31.921231  4430 rpcz_store.cc:267] Call kudu.rpc_test.CalculatorService.Sleep from unix:<unnamed> (request call id 2) took 20 ms (client timeout 20 ms). Trace:
W20260926 14:51:31.921329  4430 rpcz_store.cc:269] 0926 14:51:31.900970 (+     0us) service_pool.cc:170] Inserting onto call queue
0926 14:51:31.921205 (+ 20235us) service_pool.cc:214] Skipping call since client already timed out
0926 14:51:31.921214 (+     9us) inbound_call.cc:173] Queueing failure response
Metrics: {}
[       OK ] Parameters/TestRpc.TimedOutOnResponseMetricServiceQueue/SSL_UnixSocket (65 ms)
[ RUN      ] Parameters/TestRpc.RpcPendingConnectionsMetric/SSL_UnixSocket
I20260926 14:51:31.924710  4451 acceptor_pool.cc:254] collecting diagnostics on the listening RPC socket 0.0.0.0:35557 every 8 connection(s)
I20260926 14:51:31.924763  4452 acceptor_pool.cc:254] collecting diagnostics on the listening RPC socket 0.0.0.0:35557 every 8 connection(s)
W20260926 14:51:31.925360  4447 negotiation.cc:337] Failed RPC negotiation. Trace:
0926 14:51:31.925191 (+     0us) reactor.cc:625] Submitting negotiation task for server connection from 127.0.0.1:53150 (local address 127.0.0.1:35557)
0926 14:51:31.925234 (+    43us) server_negotiation.cc:206] Beginning negotiation
0926 14:51:31.925235 (+     1us) server_negotiation.cc:399] Waiting for connection header
0926 14:51:31.925314 (+    79us) negotiation.cc:327] Negotiation complete: Network error: Server connection negotiation failed: server connection from 127.0.0.1:53150: BlockingRecv error: recv got EOF from 127.0.0.1:53150 (error 108)
Metrics: {"server-negotiator.queue_time_us":14}
[       OK ] Parameters/TestRpc.RpcPendingConnectionsMetric/SSL_UnixSocket (13 ms)
[ RUN      ] Parameters/TestRpc.TestRpcContextClientDeadline/SSL_UnixSocket
I20260926 14:51:31.949966  4467 acceptor_pool.cc:254] collecting diagnostics on the listening RPC socket unix:/tmp/dist-test-task2qDUug/test-tmp/rpc-test-c515d3b4da434214aa4eb47b15d58ed2.sock every 8 connection(s)
I20260926 14:51:31.949993  4468 acceptor_pool.cc:254] collecting diagnostics on the listening RPC socket unix:/tmp/dist-test-task2qDUug/test-tmp/rpc-test-c515d3b4da434214aa4eb47b15d58ed2.sock every 8 connection(s)
W20260926 14:51:31.978922  4464 connection.cc:196] Error closing socket: Network error: TlsSocket::Close: Broken pipe
[       OK ] Parameters/TestRpc.TestRpcContextClientDeadline/SSL_UnixSocket (43 ms)
[ RUN      ] Parameters/TestRpc.TestApplicationFeatureFlagUnsupportedServer/SSL_UnixSocket
I20260926 14:51:31.989244  4492 acceptor_pool.cc:254] collecting diagnostics on the listening RPC socket unix:/tmp/dist-test-task2qDUug/test-tmp/rpc-test-f22f3897e44b44318ec79a1106431caa.sock every 8 connection(s)
I20260926 14:51:31.989292  4493 acceptor_pool.cc:254] collecting diagnostics on the listening RPC socket unix:/tmp/dist-test-task2qDUug/test-tmp/rpc-test-f22f3897e44b44318ec79a1106431caa.sock every 8 connection(s)
W20260926 14:51:32.009500  4489 connection.cc:196] Error closing socket: Network error: TlsSocket::Close: Broken pipe
[       OK ] Parameters/TestRpc.TestApplicationFeatureFlagUnsupportedServer/SSL_UnixSocket (30 ms)
[ RUN      ] Parameters/TestRpc.TestCancellationAsync/SSL_UnixSocket
I20260926 14:51:32.031553  4517 acceptor_pool.cc:254] collecting diagnostics on the listening RPC socket unix:/tmp/dist-test-task2qDUug/test-tmp/rpc-test-1cf11e8f08e0444684c0c923a062845e.sock every 8 connection(s)
I20260926 14:51:32.031574  4518 acceptor_pool.cc:254] collecting diagnostics on the listening RPC socket unix:/tmp/dist-test-task2qDUug/test-tmp/rpc-test-1cf11e8f08e0444684c0c923a062845e.sock every 8 connection(s)
I20260926 14:51:32.031750  4085 rpc-test.cc:1716] Connecting to unix:/tmp/dist-test-task2qDUug/test-tmp/rpc-test-1cf11e8f08e0444684c0c923a062845e.sock
I20260926 14:51:32.040844  4085 test_util.cc:268] Using random seed: -134708086
I20260926 14:51:32.054865  4521 rpc-test-base.h:240] got call: sleep_micros: 500 pattern: 4294967295 num_repetitions: 2097152 sidecar_idx: 0
I20260926 14:51:32.066166  4521 rpc-test-base.h:240] got call: sleep_micros: 500 pattern: 4294967295 num_repetitions: 2097152 sidecar_idx: 0
I20260926 14:51:32.077281  4521 rpc-test-base.h:240] got call: sleep_micros: 500 pattern: 4294967295 num_repetitions: 2097152 sidecar_idx: 0
I20260926 14:51:32.087638  4521 rpc-test-base.h:240] got call: sleep_micros: 500 pattern: 4294967295 num_repetitions: 2097152 sidecar_idx: 0
I20260926 14:51:32.098114  4521 rpc-test-base.h:240] got call: sleep_micros: 500 pattern: 4294967295 num_repetitions: 2097152 sidecar_idx: 0
I20260926 14:51:32.108835  4521 rpc-test-base.h:240] got call: sleep_micros: 500 pattern: 4294967295 num_repetitions: 2097152 sidecar_idx: 0
I20260926 14:51:32.119091  4521 rpc-test-base.h:240] got call: sleep_micros: 500 pattern: 4294967295 num_repetitions: 2097152 sidecar_idx: 0
I20260926 14:51:32.129419  4521 rpc-test-base.h:240] got call: sleep_micros: 500 pattern: 4294967295 num_repetitions: 2097152 sidecar_idx: 0
W20260926 14:51:32.132598  4514 connection.cc:441] server connection from unix:<unnamed> torn down before Call kudu.rpc.GenericCalculatorService.SleepWithSidecar from unix:<unnamed> (request call id 9) could send its response
[       OK ] Parameters/TestRpc.TestCancellationAsync/SSL_UnixSocket (123 ms)
[ RUN      ] Parameters/TestRpc.TestPerformanceBySocketType/SSL_UnixSocket
I20260926 14:51:32.148967  4542 acceptor_pool.cc:254] collecting diagnostics on the listening RPC socket unix:/tmp/dist-test-task2qDUug/test-tmp/rpc-test-1f8abccaa9094e47b34fd4db0f9148fa.sock every 8 connection(s)
I20260926 14:51:32.149019  4543 acceptor_pool.cc:254] collecting diagnostics on the listening RPC socket unix:/tmp/dist-test-task2qDUug/test-tmp/rpc-test-1f8abccaa9094e47b34fd4db0f9148fa.sock every 8 connection(s)
I20260926 14:51:32.149170  4085 rpc-test.cc:1846] Connecting to unix:/tmp/dist-test-task2qDUug/test-tmp/rpc-test-1f8abccaa9094e47b34fd4db0f9148fa.sock
I20260926 14:51:33.432984  4085 rpc-test.cc:1859] Sending 1024MB via ssl-enabled unix socket: real 1.264s	user 1.421s	sys 0.845s
I20260926 14:51:34.673167  4085 rpc-test.cc:1859] Sending 1024MB via ssl-enabled unix socket: real 1.240s	user 1.278s	sys 0.946s
I20260926 14:51:35.895200  4085 rpc-test.cc:1859] Sending 1024MB via ssl-enabled unix socket: real 1.222s	user 1.304s	sys 0.899s
I20260926 14:51:37.133836  4085 rpc-test.cc:1859] Sending 1024MB via ssl-enabled unix socket: real 1.239s	user 1.375s	sys 0.862s
I20260926 14:51:38.339414  4085 rpc-test.cc:1859] Sending 1024MB via ssl-enabled unix socket: real 1.205s	user 1.293s	sys 0.889s
W20260926 14:51:38.340190  4539 connection.cc:196] Error closing socket: Network error: TlsSocket::Close: Broken pipe
[       OK ] Parameters/TestRpc.TestPerformanceBySocketType/SSL_UnixSocket (6207 ms)
[----------] 20 tests from Parameters/TestRpc (25884 ms total)

[----------] 1 test from Parameters/TestRpcSocketTxRxQueue
[ RUN      ] Parameters/TestRpcSocketTxRxQueue.AcceptorRxQueueSizeMetric/0
I20260926 14:51:38.346910  4567 acceptor_pool.cc:254] collecting diagnostics on the listening RPC socket 0.0.0.0:42947 every 1 connection(s)
I20260926 14:51:38.346982  4568 acceptor_pool.cc:254] collecting diagnostics on the listening RPC socket 0.0.0.0:42947 every 1 connection(s)
W20260926 14:51:38.347502  4563 negotiation.cc:337] Failed RPC negotiation. Trace:
0926 14:51:38.347377 (+     0us) reactor.cc:625] Submitting negotiation task for server connection from 127.0.0.1:46286 (local address 127.0.0.1:42947)
0926 14:51:38.347418 (+    41us) server_negotiation.cc:206] Beginning negotiation
0926 14:51:38.347420 (+     2us) server_negotiation.cc:399] Waiting for connection header
0926 14:51:38.347477 (+    57us) negotiation.cc:327] Negotiation complete: Network error: Server connection negotiation failed: server connection from 127.0.0.1:46286: BlockingRecv error: recv got EOF from 127.0.0.1:46286 (error 108)
Metrics: {"server-negotiator.queue_time_us":17}
[       OK ] Parameters/TestRpcSocketTxRxQueue.AcceptorRxQueueSizeMetric/0 (8 ms)
[----------] 1 test from Parameters/TestRpcSocketTxRxQueue (8 ms total)

[----------] Global test environment tear-down
[==========] 21 tests from 2 test suites ran. (25893 ms total)
[  PASSED  ] 20 tests.
[  FAILED  ] 1 test, listed below:
[  FAILED  ] Parameters/TestRpc.TestCallWithChainCertAndChainCA/SSL_UnixSocket, where GetParam() = (true, true)

 1 FAILED TEST