Diagnosed failure

Parameters/TestRpc.TestCallWithChainCertAndChainCA/SSL_TCP: /data0/somelongdirectorytoavoidrpathissues/src/kudu/src/kudu/rpc/rpc-test.cc:270: Failure
Failed
Bad status: Runtime error: could not verify certificate chain (error with cert: subject=CN = localhost, ST = sadfjas, C = AS, emailAddress = sdflkdsajf, O = lskdfjlsad, OU = sldfkja, issuer=C = AS, ST = ASDfkjdhf, L = lskdjf, O = saldfja, OU = skdjf, CN = localhost, emailAddress = sadjflkadsj): : certificate has expired
Google Test trace:
/data0/somelongdirectorytoavoidrpathissues/src/kudu/src/kudu/rpc/rpc-test.cc:267: Connecting to 0.0.0.0:41237
I20260925 06:27:50.018537   823 test_util.cc:175] -----------------------------------------------
I20260925 06:27:50.018707   823 test_util.cc:176] Had fatal failures, leaving test files at /tmp/dist-test-taskOuuPg6/test-tmp/rpc-test.5.Parameters_TestRpc.TestCallWithChainCertAndChainCA_SSL_TCP.1790317668657132-823-0

Full log

Note: This is test shard 6 of 8.
[==========] Running 21 tests from 2 test suites.
[----------] Global test environment set-up.
[----------] 20 tests from Parameters/TestRpc
[ RUN      ] Parameters/TestRpc.TestMessengerCreateDestroy/SSL_TCP
WARNING: Logging before InitGoogleLogging() is written to STDERR
I20260925 06:27:48.759398   823 rpc-test.cc:169] started messenger TestCreateDestroy
[       OK ] Parameters/TestRpc.TestMessengerCreateDestroy/SSL_TCP (1179 ms)
[ RUN      ] Parameters/TestRpc.TestNegotiationDeadlock/SSL_TCP
I20260925 06:27:49.914402   845 acceptor_pool.cc:254] collecting diagnostics on the listening RPC socket 0.0.0.0:41903 every 8 connection(s)
I20260925 06:27:49.915782   846 acceptor_pool.cc:254] collecting diagnostics on the listening RPC socket 0.0.0.0:41903 every 8 connection(s)
[       OK ] Parameters/TestRpc.TestNegotiationDeadlock/SSL_TCP (78 ms)
[ RUN      ] Parameters/TestRpc.TestCallWithChainCertAndChainCA/SSL_TCP
I20260925 06:27:49.989010   861 acceptor_pool.cc:254] collecting diagnostics on the listening RPC socket 0.0.0.0:41237 every 8 connection(s)
I20260925 06:27:49.990882   862 acceptor_pool.cc:254] collecting diagnostics on the listening RPC socket 0.0.0.0:41237 every 8 connection(s)
/data0/somelongdirectorytoavoidrpathissues/src/kudu/src/kudu/rpc/rpc-test.cc:270: Failure
Failed
Bad status: Runtime error: could not verify certificate chain (error with cert: subject=CN = localhost, ST = sadfjas, C = AS, emailAddress = sdflkdsajf, O = lskdfjlsad, OU = sldfkja, issuer=C = AS, ST = ASDfkjdhf, L = lskdjf, O = saldfja, OU = skdjf, CN = localhost, emailAddress = sadjflkadsj): : certificate has expired
Google Test trace:
/data0/somelongdirectorytoavoidrpathissues/src/kudu/src/kudu/rpc/rpc-test.cc:267: Connecting to 0.0.0.0:41237
I20260925 06:27:50.018537   823 test_util.cc:175] -----------------------------------------------
I20260925 06:27:50.018707   823 test_util.cc:176] Had fatal failures, leaving test files at /tmp/dist-test-taskOuuPg6/test-tmp/rpc-test.5.Parameters_TestRpc.TestCallWithChainCertAndChainCA_SSL_TCP.1790317668657132-823-0
[  FAILED  ] Parameters/TestRpc.TestCallWithChainCertAndChainCA/SSL_TCP, where GetParam() = (true, false) (48 ms)
[ RUN      ] Parameters/TestRpc.TestCallWithPasswordProtectedKey/SSL_TCP
I20260925 06:27:50.039484   886 acceptor_pool.cc:254] collecting diagnostics on the listening RPC socket 0.0.0.0:36291 every 8 connection(s)
I20260925 06:27:50.040198   887 acceptor_pool.cc:254] collecting diagnostics on the listening RPC socket 0.0.0.0:36291 every 8 connection(s)
[       OK ] Parameters/TestRpc.TestCallWithPasswordProtectedKey/SSL_TCP (67 ms)
[ RUN      ] Parameters/TestRpc.TestCallToBadServer/SSL_TCP
I20260925 06:27:50.110531   823 rpc-test.cc:394] Status: Network error: Client connection negotiation failed: client connection to 0.0.0.0:0: connect: Connection refused (error 111)
I20260925 06:27:50.111817   823 rpc-test.cc:394] Status: Network error: Client connection negotiation failed: client connection to 0.0.0.0:0: connect: Connection refused (error 111)
I20260925 06:27:50.113094   823 rpc-test.cc:394] Status: Network error: Client connection negotiation failed: client connection to 0.0.0.0:0: connect: Connection refused (error 111)
I20260925 06:27:50.114377   823 rpc-test.cc:394] Status: Network error: Client connection negotiation failed: client connection to 0.0.0.0:0: connect: Connection refused (error 111)
I20260925 06:27:50.115595   823 rpc-test.cc:394] Status: Network error: Client connection negotiation failed: client connection to 0.0.0.0:0: connect: Connection refused (error 111)
[       OK ] Parameters/TestRpc.TestCallToBadServer/SSL_TCP (31 ms)
[ RUN      ] Parameters/TestRpc.TestWrongService/SSL_TCP
I20260925 06:27:50.148414   921 acceptor_pool.cc:254] collecting diagnostics on the listening RPC socket 0.0.0.0:34463 every 8 connection(s)
I20260925 06:27:50.149205   922 acceptor_pool.cc:254] collecting diagnostics on the listening RPC socket 0.0.0.0:34463 every 8 connection(s)
I20260925 06:27:50.184383   920 messenger.cc:345] service WrongServiceName not registered on TestServer
[       OK ] Parameters/TestRpc.TestWrongService/SSL_TCP (74 ms)
[ RUN      ] Parameters/TestRpc.TestConnectionKeepalive/SSL_TCP
I20260925 06:27:50.237721   944 acceptor_pool.cc:254] collecting diagnostics on the listening RPC socket 0.0.0.0:39165 every 8 connection(s)
I20260925 06:27:50.238452   945 acceptor_pool.cc:254] collecting diagnostics on the listening RPC socket 0.0.0.0:39165 every 8 connection(s)
I20260925 06:27:50.241523   823 rpc-test.cc:488] Connecting to 0.0.0.0:39165
[       OK ] Parameters/TestRpc.TestConnectionKeepalive/SSL_TCP (1093 ms)
[ RUN      ] Parameters/TestRpc.TestClientConnectionMetrics/SSL_TCP
I20260925 06:27:51.329305   969 acceptor_pool.cc:254] collecting diagnostics on the listening RPC socket 0.0.0.0:46461 every 8 connection(s)
I20260925 06:27:51.329998   970 acceptor_pool.cc:254] collecting diagnostics on the listening RPC socket 0.0.0.0:46461 every 8 connection(s)
I20260925 06:27:51.333007   823 rpc-test.cc:569] Connecting to 0.0.0.0:46461
[       OK ] Parameters/TestRpc.TestClientConnectionMetrics/SSL_TCP (113513 ms)
[ RUN      ] Parameters/TestRpc.TestCredentialsPolicy/SSL_TCP
I20260925 06:29:44.821255  1003 acceptor_pool.cc:254] collecting diagnostics on the listening RPC socket 0.0.0.0:43895 every 8 connection(s)
I20260925 06:29:44.821987  1004 acceptor_pool.cc:254] collecting diagnostics on the listening RPC socket 0.0.0.0:43895 every 8 connection(s)
I20260925 06:29:44.825181   823 rpc-test.cc:700] Connecting to 0.0.0.0:43895
[       OK ] Parameters/TestRpc.TestCredentialsPolicy/SSL_TCP (86 ms)
[ RUN      ] Parameters/TestRpc.TestCallLongerThanKeepalive/SSL_TCP
I20260925 06:29:44.909955  1028 acceptor_pool.cc:254] collecting diagnostics on the listening RPC socket 0.0.0.0:35405 every 8 connection(s)
I20260925 06:29:44.910668  1029 acceptor_pool.cc:254] collecting diagnostics on the listening RPC socket 0.0.0.0:35405 every 8 connection(s)
I20260925 06:29:44.942543  1032 rpc-test-base.h:222] got call: sleep_micros: 3000000 deferred: true
I20260925 06:29:47.946575  1032 rpcz_store.cc:275] Call kudu.rpc.GenericCalculatorService.Sleep from 127.0.0.1:33942 (request call id 0) took 3004 ms. Trace:
I20260925 06:29:47.946892  1032 rpcz_store.cc:276] 0925 06:29:44.942303 (+     0us) service_pool.cc:170] Inserting onto call queue
0925 06:29:44.942405 (+   102us) service_pool.cc:227] Handling call
0925 06:29:47.946522 (+3004117us) inbound_call.cc:173] Queueing success response
Metrics: {}
[       OK ] Parameters/TestRpc.TestCallLongerThanKeepalive/SSL_TCP (3068 ms)
[ RUN      ] Parameters/TestRpc.TestRpcSidecar/SSL_TCP
I20260925 06:29:47.990947  1053 acceptor_pool.cc:254] collecting diagnostics on the listening RPC socket 0.0.0.0:40159 every 8 connection(s)
I20260925 06:29:47.991657  1054 acceptor_pool.cc:254] collecting diagnostics on the listening RPC socket 0.0.0.0:40159 every 8 connection(s)
[       OK ] Parameters/TestRpc.TestRpcSidecar/SSL_TCP (541 ms)
[ RUN      ] Parameters/TestRpc.TestRpcSidecarLimits/SSL_TCP
I20260925 06:30:04.868525  1080 acceptor_pool.cc:254] collecting diagnostics on the listening RPC socket 0.0.0.0:39611 every 8 connection(s)
I20260925 06:30:04.869318  1081 acceptor_pool.cc:254] collecting diagnostics on the listening RPC socket 0.0.0.0:39611 every 8 connection(s)
W20260925 06:30:04.886451   823 serialization.cc:72] Serialized kudu.rpc_test.PushStringsRequestPB (2147483654 bytes) is larger than the maximum configured RPC message size (52428800 bytes). Sending anyway, but peer may reject the data.
W20260925 06:30:04.897790  1078 connection.cc:535] server connection from 127.0.0.1:59196 recv error: Network error: RPC frame had a length of 2147483714, but we only support messages up to 52428800 bytes long.
W20260925 06:30:04.898205  1078 connection.cc:158] shutting down server connection from 127.0.0.1:59196 with pending inbound data: 4/2147483714 bytes received; last active 0 ns ago: status Network error: RPC frame had a length of 2147483714, but we only support messages up to 52428800 bytes long.
W20260925 06:30:04.899159  1093 connection.cc:698] client connection to 0.0.0.0:39611 send error: Network error: failed to write to TLS socket: Connection reset by peer
W20260925 06:30:04.899793  1093 connection.cc:196] Error closing socket: Network error: TlsSocket::Close: Success
[       OK ] Parameters/TestRpc.TestRpcSidecarLimits/SSL_TCP (17138 ms)
[ RUN      ] Parameters/TestRpc.TestCallTimeoutDoesntAffectNegotiation/SSL_TCP
I20260925 06:30:05.655315  1105 acceptor_pool.cc:254] collecting diagnostics on the listening RPC socket 0.0.0.0:42503 every 8 connection(s)
I20260925 06:30:05.656072  1106 acceptor_pool.cc:254] collecting diagnostics on the listening RPC socket 0.0.0.0:42503 every 8 connection(s)
W20260925 06:30:05.677786  1101 negotiation.cc:266] Injecting 500ms delay in negotiation
I20260925 06:30:05.727385   823 rpc-test-base.h:595] status: Timed out: connection negotiation to 0.0.0.0:42503 for RPC Sleep timed out after 0.050s (ON_OUTBOUND_QUEUE), seconds elapsed: 0.050551
[       OK ] Parameters/TestRpc.TestCallTimeoutDoesntAffectNegotiation/SSL_TCP (558 ms)
[ RUN      ] Parameters/TestRpc.TestRpcHandlerLatencyMetric/SSL_TCP
I20260925 06:30:06.228973  1130 acceptor_pool.cc:254] collecting diagnostics on the listening RPC socket 0.0.0.0:46823 every 8 connection(s)
I20260925 06:30:06.229755  1131 acceptor_pool.cc:254] collecting diagnostics on the listening RPC socket 0.0.0.0:46823 every 8 connection(s)
I20260925 06:30:06.286677   823 rpc-test.cc:1236] Sleep() min lat: 21586
I20260925 06:30:06.286865   823 rpc-test.cc:1237] Sleep() mean lat: 21586
I20260925 06:30:06.286993   823 rpc-test.cc:1238] Sleep() max lat: 21586
I20260925 06:30:06.287108   823 rpc-test.cc:1239] Sleep() #calls: 1
[       OK ] Parameters/TestRpc.TestRpcHandlerLatencyMetric/SSL_TCP (98 ms)
[ RUN      ] Parameters/TestRpc.TimedOutOnResponseMetricServiceQueue/SSL_TCP
I20260925 06:30:06.324640  1156 acceptor_pool.cc:254] collecting diagnostics on the listening RPC socket 0.0.0.0:42869 every 8 connection(s)
I20260925 06:30:06.325363  1157 acceptor_pool.cc:254] collecting diagnostics on the listening RPC socket 0.0.0.0:42869 every 8 connection(s)
W20260925 06:30:06.398098  1158 rpcz_store.cc:267] Call kudu.rpc_test.CalculatorService.Sleep from 127.0.0.1:52516 (request call id 2) took 20 ms (client timeout 20 ms). Trace:
W20260925 06:30:06.398463  1158 rpcz_store.cc:269] 0925 06:30:06.377644 (+     0us) service_pool.cc:170] Inserting onto call queue
0925 06:30:06.397959 (+ 20315us) service_pool.cc:214] Skipping call since client already timed out
0925 06:30:06.398043 (+    84us) inbound_call.cc:173] Queueing failure response
Metrics: {}
[       OK ] Parameters/TestRpc.TimedOutOnResponseMetricServiceQueue/SSL_TCP (110 ms)
[ RUN      ] Parameters/TestRpc.RpcPendingConnectionsMetric/SSL_TCP
I20260925 06:30:06.414577  1179 acceptor_pool.cc:254] collecting diagnostics on the listening RPC socket 0.0.0.0:38013 every 8 connection(s)
I20260925 06:30:06.415275  1180 acceptor_pool.cc:254] collecting diagnostics on the listening RPC socket 0.0.0.0:38013 every 8 connection(s)
W20260925 06:30:06.432761  1175 negotiation.cc:337] Failed RPC negotiation. Trace:
0925 06:30:06.429124 (+     0us) reactor.cc:625] Submitting negotiation task for server connection from 127.0.0.1:35174 (local address 127.0.0.1:38013)
0925 06:30:06.431452 (+  2328us) server_negotiation.cc:206] Beginning negotiation
0925 06:30:06.431488 (+    36us) server_negotiation.cc:399] Waiting for connection header
0925 06:30:06.431857 (+   369us) negotiation.cc:327] Negotiation complete: Network error: Server connection negotiation failed: server connection from 127.0.0.1:35174: BlockingRecv error: recv got EOF from 127.0.0.1:35174 (error 108)
Metrics: {"server-negotiator.queue_time_us":1876}
[       OK ] Parameters/TestRpc.RpcPendingConnectionsMetric/SSL_TCP (39 ms)
[ RUN      ] Parameters/TestRpc.TestRpcContextClientDeadline/SSL_TCP
I20260925 06:30:06.484349  1195 acceptor_pool.cc:254] collecting diagnostics on the listening RPC socket 0.0.0.0:35461 every 8 connection(s)
I20260925 06:30:06.485093  1196 acceptor_pool.cc:254] collecting diagnostics on the listening RPC socket 0.0.0.0:35461 every 8 connection(s)
[       OK ] Parameters/TestRpc.TestRpcContextClientDeadline/SSL_TCP (109 ms)
[ RUN      ] Parameters/TestRpc.TestApplicationFeatureFlagUnsupportedServer/SSL_TCP
I20260925 06:30:06.592732  1220 acceptor_pool.cc:254] collecting diagnostics on the listening RPC socket 0.0.0.0:39955 every 8 connection(s)
I20260925 06:30:06.593454  1221 acceptor_pool.cc:254] collecting diagnostics on the listening RPC socket 0.0.0.0:39955 every 8 connection(s)
[       OK ] Parameters/TestRpc.TestApplicationFeatureFlagUnsupportedServer/SSL_TCP (77 ms)
[ RUN      ] Parameters/TestRpc.TestCancellationAsync/SSL_TCP
I20260925 06:30:06.654124  1245 acceptor_pool.cc:254] collecting diagnostics on the listening RPC socket 0.0.0.0:46025 every 8 connection(s)
I20260925 06:30:06.654863  1246 acceptor_pool.cc:254] collecting diagnostics on the listening RPC socket 0.0.0.0:46025 every 8 connection(s)
I20260925 06:30:06.658063   823 rpc-test.cc:1716] Connecting to 0.0.0.0:46025
I20260925 06:30:06.670634   823 test_util.cc:268] Using random seed: -655961321
I20260925 06:30:06.898773  1249 rpc-test-base.h:240] got call: sleep_micros: 500 pattern: 4294967295 num_repetitions: 2097152 sidecar_idx: 0
I20260925 06:30:07.062733  1248 rpc-test-base.h:240] got call: sleep_micros: 500 pattern: 4294967295 num_repetitions: 2097152 sidecar_idx: 0
I20260925 06:30:07.261646  1249 rpc-test-base.h:240] got call: sleep_micros: 500 pattern: 4294967295 num_repetitions: 2097152 sidecar_idx: 0
I20260925 06:30:07.443022  1248 rpc-test-base.h:240] got call: sleep_micros: 500 pattern: 4294967295 num_repetitions: 2097152 sidecar_idx: 0
I20260925 06:30:07.630265  1248 rpc-test-base.h:240] got call: sleep_micros: 500 pattern: 4294967295 num_repetitions: 2097152 sidecar_idx: 0
I20260925 06:30:07.808635  1248 rpc-test-base.h:240] got call: sleep_micros: 500 pattern: 4294967295 num_repetitions: 2097152 sidecar_idx: 0
I20260925 06:30:07.985968  1248 rpc-test-base.h:240] got call: sleep_micros: 500 pattern: 4294967295 num_repetitions: 2097152 sidecar_idx: 0
I20260925 06:30:08.165297  1248 rpc-test-base.h:240] got call: sleep_micros: 500 pattern: 4294967295 num_repetitions: 2097152 sidecar_idx: 0
W20260925 06:30:08.327989  1244 connection.cc:196] Error closing socket: Network error: TlsSocket::Close: Broken pipe
W20260925 06:30:08.367615  1244 connection.cc:441] server connection from 127.0.0.1:35386 torn down before Call kudu.rpc.GenericCalculatorService.SleepWithSidecar from 127.0.0.1:35386 (request call id 8) could send its response
[       OK ] Parameters/TestRpc.TestCancellationAsync/SSL_TCP (1744 ms)
[ RUN      ] Parameters/TestRpc.TestPerformanceBySocketType/SSL_TCP
I20260925 06:30:08.473086  1270 acceptor_pool.cc:254] collecting diagnostics on the listening RPC socket 0.0.0.0:34507 every 8 connection(s)
I20260925 06:30:08.473775  1271 acceptor_pool.cc:254] collecting diagnostics on the listening RPC socket 0.0.0.0:34507 every 8 connection(s)
I20260925 06:30:08.476831   823 rpc-test.cc:1846] Connecting to 0.0.0.0:34507
I20260925 06:30:27.323633   823 rpc-test.cc:1859] Sending 1024MB via ssl-enabled tcp socket: real 18.829s	user 16.241s	sys 10.584s
I20260925 06:30:45.963735   823 rpc-test.cc:1859] Sending 1024MB via ssl-enabled tcp socket: real 18.640s	user 15.849s	sys 10.655s
I20260925 06:31:04.717523   823 rpc-test.cc:1859] Sending 1024MB via ssl-enabled tcp socket: real 18.753s	user 16.424s	sys 10.228s
I20260925 06:31:23.605777   823 rpc-test.cc:1859] Sending 1024MB via ssl-enabled tcp socket: real 18.888s	user 16.055s	sys 10.734s
I20260925 06:31:42.598186   823 rpc-test.cc:1859] Sending 1024MB via ssl-enabled tcp socket: real 18.992s	user 16.355s	sys 10.600s
[       OK ] Parameters/TestRpc.TestPerformanceBySocketType/SSL_TCP (94238 ms)
[----------] 20 tests from Parameters/TestRpc (233904 ms total)

[----------] 1 test from Parameters/TestRpcSocketTxRxQueue
[ RUN      ] Parameters/TestRpcSocketTxRxQueue.OverCapacity/0
W20260925 06:31:43.050772  1342 negotiation.cc:337] Failed RPC negotiation. Trace:
0925 06:31:42.678348 (+     0us) reactor.cc:625] Submitting negotiation task for client connection to 0.0.0.0:37679 (local address 127.0.0.1:32850)
0925 06:31:42.678946 (+   598us) negotiation.cc:107] Waiting for socket to connect
0925 06:31:42.678976 (+    30us) client_negotiation.cc:174] Beginning negotiation
0925 06:31:42.679276 (+   300us) client_negotiation.cc:252] Sending NEGOTIATE NegotiatePB request
0925 06:31:43.047560 (+368284us) negotiation.cc:327] Negotiation complete: Network error: Client connection negotiation failed: client connection to 0.0.0.0:37679: BlockingRecv error: recv error from unknown peer: Transport endpoint is not connected (error 107)
Metrics: {"client-negotiator.queue_time_us":136}
W20260925 06:31:43.051162  1324 negotiation.cc:337] Failed RPC negotiation. Trace:
0925 06:31:42.655376 (+     0us) reactor.cc:625] Submitting negotiation task for client connection to 0.0.0.0:37679 (local address 127.0.0.1:32840)
0925 06:31:42.655948 (+   572us) negotiation.cc:107] Waiting for socket to connect
0925 06:31:42.655978 (+    30us) client_negotiation.cc:174] Beginning negotiation
0925 06:31:42.656279 (+   301us) client_negotiation.cc:252] Sending NEGOTIATE NegotiatePB request
0925 06:31:43.047993 (+391714us) negotiation.cc:327] Negotiation complete: Network error: Client connection negotiation failed: client connection to 0.0.0.0:37679: BlockingRecv error: recv error from unknown peer: Transport endpoint is not connected (error 107)
Metrics: {"client-negotiator.queue_time_us":150}
W20260925 06:31:43.050824  1306 negotiation.cc:337] Failed RPC negotiation. Trace:
0925 06:31:42.636822 (+     0us) reactor.cc:625] Submitting negotiation task for client connection to 0.0.0.0:37679 (local address 127.0.0.1:32836)
0925 06:31:42.637390 (+   568us) negotiation.cc:107] Waiting for socket to connect
0925 06:31:42.637419 (+    29us) client_negotiation.cc:174] Beginning negotiation
0925 06:31:42.637597 (+   178us) client_negotiation.cc:252] Sending NEGOTIATE NegotiatePB request
0925 06:31:43.047646 (+410049us) negotiation.cc:327] Negotiation complete: Network error: Client connection negotiation failed: client connection to 0.0.0.0:37679: BlockingRecv error: recv error from unknown peer: Transport endpoint is not connected (error 107)
Metrics: {"client-negotiator.queue_time_us":134}
W20260925 06:31:43.051270  1297 negotiation.cc:337] Failed RPC negotiation. Trace:
0925 06:31:42.630370 (+     0us) reactor.cc:625] Submitting negotiation task for client connection to 0.0.0.0:37679 (local address 127.0.0.1:32832)
0925 06:31:42.631055 (+   685us) negotiation.cc:107] Waiting for socket to connect
0925 06:31:42.631103 (+    48us) client_negotiation.cc:174] Beginning negotiation
0925 06:31:42.631594 (+   491us) client_negotiation.cc:252] Sending NEGOTIATE NegotiatePB request
0925 06:31:43.047560 (+415966us) negotiation.cc:327] Negotiation complete: Network error: Client connection negotiation failed: client connection to 0.0.0.0:37679: BlockingRecv error: recv error from unknown peer: Transport endpoint is not connected (error 107)
Metrics: {"client-negotiator.queue_time_us":133}
W20260925 06:31:43.052413  1315 negotiation.cc:337] Failed RPC negotiation. Trace:
0925 06:31:42.643877 (+     0us) reactor.cc:625] Submitting negotiation task for client connection to 0.0.0.0:37679 (local address 127.0.0.1:32838)
0925 06:31:42.644308 (+   431us) negotiation.cc:107] Waiting for socket to connect
0925 06:31:42.644344 (+    36us) client_negotiation.cc:174] Beginning negotiation
0925 06:31:42.644518 (+   174us) client_negotiation.cc:252] Sending NEGOTIATE NegotiatePB request
0925 06:31:43.047652 (+403134us) negotiation.cc:327] Negotiation complete: Network error: Client connection negotiation failed: client connection to 0.0.0.0:37679: BlockingRecv error: recv error from unknown peer: Transport endpoint is not connected (error 107)
Metrics: {"client-negotiator.queue_time_us":92}
W20260925 06:31:43.053049  1333 negotiation.cc:337] Failed RPC negotiation. Trace:
0925 06:31:42.667036 (+     0us) reactor.cc:625] Submitting negotiation task for client connection to 0.0.0.0:37679 (local address 127.0.0.1:32848)
0925 06:31:42.667619 (+   583us) negotiation.cc:107] Waiting for socket to connect
0925 06:31:42.667649 (+    30us) client_negotiation.cc:174] Beginning negotiation
0925 06:31:42.667826 (+   177us) client_negotiation.cc:252] Sending NEGOTIATE NegotiatePB request
0925 06:31:43.050615 (+382789us) negotiation.cc:327] Negotiation complete: Network error: Client connection negotiation failed: client connection to 0.0.0.0:37679: BlockingRecv error: recv error from unknown peer: Transport endpoint is not connected (error 107)
Metrics: {"client-negotiator.queue_time_us":147}
[       OK ] Parameters/TestRpcSocketTxRxQueue.OverCapacity/0 (1234 ms)
[----------] 1 test from Parameters/TestRpcSocketTxRxQueue (1234 ms total)

[----------] Global test environment tear-down
[==========] 21 tests from 2 test suites ran. (235139 ms total)
[  PASSED  ] 20 tests.
[  FAILED  ] 1 test, listed below:
[  FAILED  ] Parameters/TestRpc.TestCallWithChainCertAndChainCA/SSL_TCP, where GetParam() = (true, false)

 1 FAILED TEST