Diagnosed failure

Parameters/TestRpc.TestCallWithChainCertAndChainCA/SSL_TCP: /data0/somelongdirectorytoavoidrpathissues/src/kudu/src/kudu/rpc/rpc-test.cc:270: Failure
Failed
Bad status: Runtime error: could not verify certificate chain (error with cert: subject=CN = localhost, ST = sadfjas, C = AS, emailAddress = sdflkdsajf, O = lskdfjlsad, OU = sldfkja, issuer=C = AS, ST = ASDfkjdhf, L = lskdjf, O = saldfja, OU = skdjf, CN = localhost, emailAddress = sadjflkadsj): : certificate has expired
Google Test trace:
/data0/somelongdirectorytoavoidrpathissues/src/kudu/src/kudu/rpc/rpc-test.cc:267: Connecting to 0.0.0.0:33187
I20260926 14:51:12.116323  7379 test_util.cc:175] -----------------------------------------------
I20260926 14:51:12.116364  7379 test_util.cc:176] Had fatal failures, leaving test files at /tmp/dist-test-taskYStdAh/test-tmp/rpc-test.5.Parameters_TestRpc.TestCallWithChainCertAndChainCA_SSL_TCP.1790434272082394-7379-0

Full log

Note: This is test shard 6 of 8.
[==========] Running 21 tests from 2 test suites.
[----------] Global test environment set-up.
[----------] 20 tests from Parameters/TestRpc
[ RUN      ] Parameters/TestRpc.TestMessengerCreateDestroy/SSL_TCP
WARNING: Logging before InitGoogleLogging() is written to STDERR
I20260926 14:51:12.095397  7379 rpc-test.cc:169] started messenger TestCreateDestroy
[       OK ] Parameters/TestRpc.TestMessengerCreateDestroy/SSL_TCP (11 ms)
[ RUN      ] Parameters/TestRpc.TestNegotiationDeadlock/SSL_TCP
I20260926 14:51:12.100329  7399 acceptor_pool.cc:254] collecting diagnostics on the listening RPC socket 0.0.0.0:45627 every 8 connection(s)
I20260926 14:51:12.100360  7400 acceptor_pool.cc:254] collecting diagnostics on the listening RPC socket 0.0.0.0:45627 every 8 connection(s)
[       OK ] Parameters/TestRpc.TestNegotiationDeadlock/SSL_TCP (9 ms)
[ RUN      ] Parameters/TestRpc.TestCallWithChainCertAndChainCA/SSL_TCP
I20260926 14:51:12.113166  7415 acceptor_pool.cc:254] collecting diagnostics on the listening RPC socket 0.0.0.0:33187 every 8 connection(s)
I20260926 14:51:12.113214  7416 acceptor_pool.cc:254] collecting diagnostics on the listening RPC socket 0.0.0.0:33187 every 8 connection(s)
/data0/somelongdirectorytoavoidrpathissues/src/kudu/src/kudu/rpc/rpc-test.cc:270: Failure
Failed
Bad status: Runtime error: could not verify certificate chain (error with cert: subject=CN = localhost, ST = sadfjas, C = AS, emailAddress = sdflkdsajf, O = lskdfjlsad, OU = sldfkja, issuer=C = AS, ST = ASDfkjdhf, L = lskdjf, O = saldfja, OU = skdjf, CN = localhost, emailAddress = sadjflkadsj): : certificate has expired
Google Test trace:
/data0/somelongdirectorytoavoidrpathissues/src/kudu/src/kudu/rpc/rpc-test.cc:267: Connecting to 0.0.0.0:33187
I20260926 14:51:12.116323  7379 test_util.cc:175] -----------------------------------------------
I20260926 14:51:12.116364  7379 test_util.cc:176] Had fatal failures, leaving test files at /tmp/dist-test-taskYStdAh/test-tmp/rpc-test.5.Parameters_TestRpc.TestCallWithChainCertAndChainCA_SSL_TCP.1790434272082394-7379-0
[  FAILED  ] Parameters/TestRpc.TestCallWithChainCertAndChainCA/SSL_TCP, where GetParam() = (true, false) (10 ms)
[ RUN      ] Parameters/TestRpc.TestCallWithPasswordProtectedKey/SSL_TCP
I20260926 14:51:12.129447  7440 acceptor_pool.cc:254] collecting diagnostics on the listening RPC socket 0.0.0.0:38381 every 8 connection(s)
I20260926 14:51:12.129493  7441 acceptor_pool.cc:254] collecting diagnostics on the listening RPC socket 0.0.0.0:38381 every 8 connection(s)
[       OK ] Parameters/TestRpc.TestCallWithPasswordProtectedKey/SSL_TCP (24 ms)
[ RUN      ] Parameters/TestRpc.TestCallToBadServer/SSL_TCP
I20260926 14:51:12.152664  7379 rpc-test.cc:394] Status: Network error: Client connection negotiation failed: client connection to 0.0.0.0:0: connect: Connection refused (error 111)
I20260926 14:51:12.152890  7379 rpc-test.cc:394] Status: Network error: Client connection negotiation failed: client connection to 0.0.0.0:0: connect: Connection refused (error 111)
I20260926 14:51:12.153072  7379 rpc-test.cc:394] Status: Network error: Client connection negotiation failed: client connection to 0.0.0.0:0: connect: Connection refused (error 111)
I20260926 14:51:12.153239  7379 rpc-test.cc:394] Status: Network error: Client connection negotiation failed: client connection to 0.0.0.0:0: connect: Connection refused (error 111)
I20260926 14:51:12.153405  7379 rpc-test.cc:394] Status: Network error: Client connection negotiation failed: client connection to 0.0.0.0:0: connect: Connection refused (error 111)
[       OK ] Parameters/TestRpc.TestCallToBadServer/SSL_TCP (13 ms)
[ RUN      ] Parameters/TestRpc.TestWrongService/SSL_TCP
I20260926 14:51:12.163590  7475 acceptor_pool.cc:254] collecting diagnostics on the listening RPC socket 0.0.0.0:44281 every 8 connection(s)
I20260926 14:51:12.163635  7476 acceptor_pool.cc:254] collecting diagnostics on the listening RPC socket 0.0.0.0:44281 every 8 connection(s)
I20260926 14:51:12.177879  7473 messenger.cc:345] service WrongServiceName not registered on TestServer
[       OK ] Parameters/TestRpc.TestWrongService/SSL_TCP (25 ms)
[ RUN      ] Parameters/TestRpc.TestConnectionKeepalive/SSL_TCP
I20260926 14:51:12.196046  7498 acceptor_pool.cc:254] collecting diagnostics on the listening RPC socket 0.0.0.0:45057 every 8 connection(s)
I20260926 14:51:12.196103  7499 acceptor_pool.cc:254] collecting diagnostics on the listening RPC socket 0.0.0.0:45057 every 8 connection(s)
I20260926 14:51:12.196244  7379 rpc-test.cc:488] Connecting to 0.0.0.0:45057
[       OK ] Parameters/TestRpc.TestConnectionKeepalive/SSL_TCP (1047 ms)
[ RUN      ] Parameters/TestRpc.TestClientConnectionMetrics/SSL_TCP
I20260926 14:51:13.244007  7523 acceptor_pool.cc:254] collecting diagnostics on the listening RPC socket 0.0.0.0:45175 every 8 connection(s)
I20260926 14:51:13.244056  7524 acceptor_pool.cc:254] collecting diagnostics on the listening RPC socket 0.0.0.0:45175 every 8 connection(s)
I20260926 14:51:13.244161  7379 rpc-test.cc:569] Connecting to 0.0.0.0:45175
[       OK ] Parameters/TestRpc.TestClientConnectionMetrics/SSL_TCP (7570 ms)
[ RUN      ] Parameters/TestRpc.TestCredentialsPolicy/SSL_TCP
I20260926 14:51:20.806651  7546 acceptor_pool.cc:254] collecting diagnostics on the listening RPC socket 0.0.0.0:44727 every 8 connection(s)
I20260926 14:51:20.806715  7547 acceptor_pool.cc:254] collecting diagnostics on the listening RPC socket 0.0.0.0:44727 every 8 connection(s)
I20260926 14:51:20.806881  7379 rpc-test.cc:700] Connecting to 0.0.0.0:44727
[       OK ] Parameters/TestRpc.TestCredentialsPolicy/SSL_TCP (27 ms)
[ RUN      ] Parameters/TestRpc.TestCallLongerThanKeepalive/SSL_TCP
I20260926 14:51:20.841924  7571 acceptor_pool.cc:254] collecting diagnostics on the listening RPC socket 0.0.0.0:42463 every 8 connection(s)
I20260926 14:51:20.841977  7572 acceptor_pool.cc:254] collecting diagnostics on the listening RPC socket 0.0.0.0:42463 every 8 connection(s)
I20260926 14:51:20.849324  7573 rpc-test-base.h:222] got call: sleep_micros: 3000000 deferred: true
I20260926 14:51:23.849939  7573 rpcz_store.cc:275] Call kudu.rpc.GenericCalculatorService.Sleep from 127.0.0.1:44506 (request call id 0) took 3000 ms. Trace:
I20260926 14:51:23.850031  7573 rpcz_store.cc:276] 0926 14:51:20.849282 (+     0us) service_pool.cc:170] Inserting onto call queue
0926 14:51:20.849308 (+    26us) service_pool.cc:227] Handling call
0926 14:51:23.849924 (+3000616us) inbound_call.cc:173] Queueing success response
Metrics: {}
[       OK ] Parameters/TestRpc.TestCallLongerThanKeepalive/SSL_TCP (3027 ms)
[ RUN      ] Parameters/TestRpc.TestRpcSidecar/SSL_TCP
I20260926 14:51:23.874476  7596 acceptor_pool.cc:254] collecting diagnostics on the listening RPC socket 0.0.0.0:43787 every 8 connection(s)
I20260926 14:51:23.874523  7597 acceptor_pool.cc:254] collecting diagnostics on the listening RPC socket 0.0.0.0:43787 every 8 connection(s)
[       OK ] Parameters/TestRpc.TestRpcSidecar/SSL_TCP (95 ms)
[ RUN      ] Parameters/TestRpc.TestRpcSidecarLimits/SSL_TCP
I20260926 14:51:25.561681  7621 acceptor_pool.cc:254] collecting diagnostics on the listening RPC socket 0.0.0.0:44507 every 8 connection(s)
I20260926 14:51:25.561703  7622 acceptor_pool.cc:254] collecting diagnostics on the listening RPC socket 0.0.0.0:44507 every 8 connection(s)
W20260926 14:51:25.579850  7379 serialization.cc:72] Serialized kudu.rpc_test.PushStringsRequestPB (2147483654 bytes) is larger than the maximum configured RPC message size (52428800 bytes). Sending anyway, but peer may reject the data.
W20260926 14:51:25.582660  7620 connection.cc:535] server connection from 127.0.0.1:58392 recv error: Network error: RPC frame had a length of 2147483714, but we only support messages up to 52428800 bytes long.
W20260926 14:51:25.582718  7620 connection.cc:158] shutting down server connection from 127.0.0.1:58392 with pending inbound data: 4/2147483714 bytes received; last active 0 ns ago: status Network error: RPC frame had a length of 2147483714, but we only support messages up to 52428800 bytes long.
W20260926 14:51:25.582911  7634 connection.cc:196] Error closing socket: Network error: TlsSocket::Close: Connection reset by peer
I20260926 14:51:25.602052  7646 acceptor_pool.cc:254] collecting diagnostics on the listening RPC socket 0.0.0.0:37731 every 8 connection(s)
I20260926 14:51:25.602069  7647 acceptor_pool.cc:254] collecting diagnostics on the listening RPC socket 0.0.0.0:37731 every 8 connection(s)
W20260926 14:51:29.075865  7645 connection.cc:577] server connection from 127.0.0.1:37426: received bad data: 'Corruption: Invalid packet: message had a length of 2147483710, but we only support messages up to 2147483647 bytes
'
[       OK ] Parameters/TestRpc.TestRpcSidecarLimits/SSL_TCP (5130 ms)
[ RUN      ] Parameters/TestRpc.TestCallTimeoutDoesntAffectNegotiation/SSL_TCP
I20260926 14:51:29.087596  7671 acceptor_pool.cc:254] collecting diagnostics on the listening RPC socket 0.0.0.0:36277 every 8 connection(s)
I20260926 14:51:29.087641  7672 acceptor_pool.cc:254] collecting diagnostics on the listening RPC socket 0.0.0.0:36277 every 8 connection(s)
W20260926 14:51:29.094411  7664 negotiation.cc:266] Injecting 500ms delay in negotiation
I20260926 14:51:29.144564  7379 rpc-test-base.h:595] status: Timed out: connection negotiation to 0.0.0.0:36277 for RPC Sleep timed out after 0.050s (ON_OUTBOUND_QUEUE), seconds elapsed: 0.0504578
[       OK ] Parameters/TestRpc.TestCallTimeoutDoesntAffectNegotiation/SSL_TCP (520 ms)
[ RUN      ] Parameters/TestRpc.TestRpcHandlerLatencyMetric/SSL_TCP
I20260926 14:51:29.607641  7696 acceptor_pool.cc:254] collecting diagnostics on the listening RPC socket 0.0.0.0:38675 every 8 connection(s)
I20260926 14:51:29.607681  7697 acceptor_pool.cc:254] collecting diagnostics on the listening RPC socket 0.0.0.0:38675 every 8 connection(s)
I20260926 14:51:29.640918  7379 rpc-test.cc:1236] Sleep() min lat: 20197
I20260926 14:51:29.640974  7379 rpc-test.cc:1237] Sleep() mean lat: 20197
I20260926 14:51:29.640996  7379 rpc-test.cc:1238] Sleep() max lat: 20197
I20260926 14:51:29.641008  7379 rpc-test.cc:1239] Sleep() #calls: 1
[       OK ] Parameters/TestRpc.TestRpcHandlerLatencyMetric/SSL_TCP (43 ms)
[ RUN      ] Parameters/TestRpc.TimedOutOnResponseMetricServiceQueue/SSL_TCP
I20260926 14:51:29.648648  7722 acceptor_pool.cc:254] collecting diagnostics on the listening RPC socket 0.0.0.0:44467 every 8 connection(s)
I20260926 14:51:29.648700  7723 acceptor_pool.cc:254] collecting diagnostics on the listening RPC socket 0.0.0.0:44467 every 8 connection(s)
W20260926 14:51:29.700343  7724 rpcz_store.cc:267] Call kudu.rpc_test.CalculatorService.Sleep from 127.0.0.1:46520 (request call id 2) took 20 ms (client timeout 20 ms). Trace:
W20260926 14:51:29.700415  7724 rpcz_store.cc:269] 0926 14:51:29.680156 (+     0us) service_pool.cc:170] Inserting onto call queue
0926 14:51:29.700311 (+ 20155us) service_pool.cc:214] Skipping call since client already timed out
0926 14:51:29.700319 (+     8us) inbound_call.cc:173] Queueing failure response
Metrics: {}
[       OK ] Parameters/TestRpc.TimedOutOnResponseMetricServiceQueue/SSL_TCP (59 ms)
[ RUN      ] Parameters/TestRpc.RpcPendingConnectionsMetric/SSL_TCP
I20260926 14:51:29.702934  7745 acceptor_pool.cc:254] collecting diagnostics on the listening RPC socket 0.0.0.0:35905 every 8 connection(s)
I20260926 14:51:29.702991  7746 acceptor_pool.cc:254] collecting diagnostics on the listening RPC socket 0.0.0.0:35905 every 8 connection(s)
W20260926 14:51:29.703513  7741 negotiation.cc:337] Failed RPC negotiation. Trace:
0926 14:51:29.703370 (+     0us) reactor.cc:625] Submitting negotiation task for server connection from 127.0.0.1:41282 (local address 127.0.0.1:35905)
0926 14:51:29.703404 (+    34us) server_negotiation.cc:206] Beginning negotiation
0926 14:51:29.703405 (+     1us) server_negotiation.cc:399] Waiting for connection header
0926 14:51:29.703469 (+    64us) negotiation.cc:327] Negotiation complete: Network error: Server connection negotiation failed: server connection from 127.0.0.1:41282: BlockingRecv error: recv got EOF from 127.0.0.1:41282 (error 108)
Metrics: {"server-negotiator.queue_time_us":12}
[       OK ] Parameters/TestRpc.RpcPendingConnectionsMetric/SSL_TCP (12 ms)
[ RUN      ] Parameters/TestRpc.TestRpcContextClientDeadline/SSL_TCP
I20260926 14:51:29.722669  7761 acceptor_pool.cc:254] collecting diagnostics on the listening RPC socket 0.0.0.0:44475 every 8 connection(s)
I20260926 14:51:29.722723  7762 acceptor_pool.cc:254] collecting diagnostics on the listening RPC socket 0.0.0.0:44475 every 8 connection(s)
[       OK ] Parameters/TestRpc.TestRpcContextClientDeadline/SSL_TCP (46 ms)
[ RUN      ] Parameters/TestRpc.TestApplicationFeatureFlagUnsupportedServer/SSL_TCP
I20260926 14:51:29.773130  7786 acceptor_pool.cc:254] collecting diagnostics on the listening RPC socket 0.0.0.0:35767 every 8 connection(s)
I20260926 14:51:29.773200  7787 acceptor_pool.cc:254] collecting diagnostics on the listening RPC socket 0.0.0.0:35767 every 8 connection(s)
[       OK ] Parameters/TestRpc.TestApplicationFeatureFlagUnsupportedServer/SSL_TCP (38 ms)
[ RUN      ] Parameters/TestRpc.TestCancellationAsync/SSL_TCP
I20260926 14:51:29.811235  7811 acceptor_pool.cc:254] collecting diagnostics on the listening RPC socket 0.0.0.0:37539 every 8 connection(s)
I20260926 14:51:29.811432  7379 rpc-test.cc:1716] Connecting to 0.0.0.0:37539
I20260926 14:51:29.813071  7812 acceptor_pool.cc:254] collecting diagnostics on the listening RPC socket 0.0.0.0:37539 every 8 connection(s)
I20260926 14:51:29.819429  7379 test_util.cc:268] Using random seed: -136929499
I20260926 14:51:29.832808  7815 rpc-test-base.h:240] got call: sleep_micros: 500 pattern: 4294967295 num_repetitions: 2097152 sidecar_idx: 0
I20260926 14:51:29.842443  7815 rpc-test-base.h:240] got call: sleep_micros: 500 pattern: 4294967295 num_repetitions: 2097152 sidecar_idx: 0
I20260926 14:51:29.851768  7815 rpc-test-base.h:240] got call: sleep_micros: 500 pattern: 4294967295 num_repetitions: 2097152 sidecar_idx: 0
I20260926 14:51:29.861006  7815 rpc-test-base.h:240] got call: sleep_micros: 500 pattern: 4294967295 num_repetitions: 2097152 sidecar_idx: 0
I20260926 14:51:29.870355  7815 rpc-test-base.h:240] got call: sleep_micros: 500 pattern: 4294967295 num_repetitions: 2097152 sidecar_idx: 0
I20260926 14:51:29.879684  7815 rpc-test-base.h:240] got call: sleep_micros: 500 pattern: 4294967295 num_repetitions: 2097152 sidecar_idx: 0
I20260926 14:51:29.889194  7815 rpc-test-base.h:240] got call: sleep_micros: 500 pattern: 4294967295 num_repetitions: 2097152 sidecar_idx: 0
I20260926 14:51:29.898622  7815 rpc-test-base.h:240] got call: sleep_micros: 500 pattern: 4294967295 num_repetitions: 2097152 sidecar_idx: 0
W20260926 14:51:29.901364  7808 connection.cc:441] server connection from 127.0.0.1:40458 torn down before Call kudu.rpc.GenericCalculatorService.SleepWithSidecar from 127.0.0.1:40458 (request call id 9) could send its response
[       OK ] Parameters/TestRpc.TestCancellationAsync/SSL_TCP (102 ms)
[ RUN      ] Parameters/TestRpc.TestPerformanceBySocketType/SSL_TCP
I20260926 14:51:29.911827  7836 acceptor_pool.cc:254] collecting diagnostics on the listening RPC socket 0.0.0.0:41619 every 8 connection(s)
I20260926 14:51:29.911880  7837 acceptor_pool.cc:254] collecting diagnostics on the listening RPC socket 0.0.0.0:41619 every 8 connection(s)
I20260926 14:51:29.912004  7379 rpc-test.cc:1846] Connecting to 0.0.0.0:41619
I20260926 14:51:31.415508  7379 rpc-test.cc:1859] Sending 1024MB via ssl-enabled tcp socket: real 1.482s	user 1.315s	sys 1.315s
I20260926 14:51:32.812978  7379 rpc-test.cc:1859] Sending 1024MB via ssl-enabled tcp socket: real 1.397s	user 1.290s	sys 1.220s
I20260926 14:51:34.235459  7379 rpc-test.cc:1859] Sending 1024MB via ssl-enabled tcp socket: real 1.422s	user 1.273s	sys 1.272s
I20260926 14:51:35.621829  7379 rpc-test.cc:1859] Sending 1024MB via ssl-enabled tcp socket: real 1.386s	user 1.234s	sys 1.259s
I20260926 14:51:37.026554  7379 rpc-test.cc:1859] Sending 1024MB via ssl-enabled tcp socket: real 1.405s	user 1.253s	sys 1.270s
[       OK ] Parameters/TestRpc.TestPerformanceBySocketType/SSL_TCP (7125 ms)
[----------] 20 tests from Parameters/TestRpc (24943 ms total)

[----------] 1 test from Parameters/TestRpcSocketTxRxQueue
[ RUN      ] Parameters/TestRpcSocketTxRxQueue.OverCapacity/0
W20260926 14:51:37.293975  7871 negotiation.cc:337] Failed RPC negotiation. Trace:
0926 14:51:37.033934 (+     0us) reactor.cc:625] Submitting negotiation task for client connection to 0.0.0.0:34941 (local address 127.0.0.1:45010)
0926 14:51:37.033970 (+    36us) negotiation.cc:107] Waiting for socket to connect
0926 14:51:37.033977 (+     7us) client_negotiation.cc:174] Beginning negotiation
0926 14:51:37.034012 (+    35us) client_negotiation.cc:252] Sending NEGOTIATE NegotiatePB request
0926 14:51:37.293852 (+259840us) negotiation.cc:327] Negotiation complete: Network error: Client connection negotiation failed: client connection to 0.0.0.0:34941: BlockingRecv error: recv error from unknown peer: Transport endpoint is not connected (error 107)
Metrics: {"client-negotiator.queue_time_us":18}
W20260926 14:51:37.294049  7898 negotiation.cc:337] Failed RPC negotiation. Trace:
0926 14:51:37.036271 (+     0us) reactor.cc:625] Submitting negotiation task for client connection to 0.0.0.0:34941 (local address 127.0.0.1:45040)
0926 14:51:37.036309 (+    38us) negotiation.cc:107] Waiting for socket to connect
0926 14:51:37.036317 (+     8us) client_negotiation.cc:174] Beginning negotiation
0926 14:51:37.036358 (+    41us) client_negotiation.cc:252] Sending NEGOTIATE NegotiatePB request
0926 14:51:37.294012 (+257654us) negotiation.cc:327] Negotiation complete: Network error: Client connection negotiation failed: client connection to 0.0.0.0:34941: BlockingRecv error: recv error from unknown peer: Transport endpoint is not connected (error 107)
Metrics: {"client-negotiator.queue_time_us":17}
W20260926 14:51:37.294170  7862 negotiation.cc:337] Failed RPC negotiation. Trace:
0926 14:51:37.033197 (+     0us) reactor.cc:625] Submitting negotiation task for client connection to 0.0.0.0:34941 (local address 127.0.0.1:44996)
0926 14:51:37.033254 (+    57us) negotiation.cc:107] Waiting for socket to connect
0926 14:51:37.033263 (+     9us) client_negotiation.cc:174] Beginning negotiation
0926 14:51:37.033306 (+    43us) client_negotiation.cc:252] Sending NEGOTIATE NegotiatePB request
0926 14:51:37.293854 (+260548us) negotiation.cc:327] Negotiation complete: Network error: Client connection negotiation failed: client connection to 0.0.0.0:34941: BlockingRecv error: recv error from unknown peer: Transport endpoint is not connected (error 107)
Metrics: {"client-negotiator.queue_time_us":31}
W20260926 14:51:37.293983  7880 negotiation.cc:337] Failed RPC negotiation. Trace:
0926 14:51:37.034643 (+     0us) reactor.cc:625] Submitting negotiation task for client connection to 0.0.0.0:34941 (local address 127.0.0.1:45018)
0926 14:51:37.034680 (+    37us) negotiation.cc:107] Waiting for socket to connect
0926 14:51:37.034686 (+     6us) client_negotiation.cc:174] Beginning negotiation
0926 14:51:37.034717 (+    31us) client_negotiation.cc:252] Sending NEGOTIATE NegotiatePB request
0926 14:51:37.293851 (+259134us) negotiation.cc:327] Negotiation complete: Network error: Client connection negotiation failed: client connection to 0.0.0.0:34941: BlockingRecv error: recv error from unknown peer: Transport endpoint is not connected (error 107)
Metrics: {"client-negotiator.queue_time_us":15}
W20260926 14:51:37.294224  7853 negotiation.cc:337] Failed RPC negotiation. Trace:
0926 14:51:37.032288 (+     0us) reactor.cc:625] Submitting negotiation task for client connection to 0.0.0.0:34941 (local address 127.0.0.1:44982)
0926 14:51:37.032323 (+    35us) negotiation.cc:107] Waiting for socket to connect
0926 14:51:37.032332 (+     9us) client_negotiation.cc:174] Beginning negotiation
0926 14:51:37.032375 (+    43us) client_negotiation.cc:252] Sending NEGOTIATE NegotiatePB request
0926 14:51:37.293854 (+261479us) negotiation.cc:327] Negotiation complete: Network error: Client connection negotiation failed: client connection to 0.0.0.0:34941: BlockingRecv error: recv error from unknown peer: Transport endpoint is not connected (error 107)
Metrics: {"client-negotiator.queue_time_us":16}
W20260926 14:51:37.293983  7889 negotiation.cc:337] Failed RPC negotiation. Trace:
0926 14:51:37.035461 (+     0us) reactor.cc:625] Submitting negotiation task for client connection to 0.0.0.0:34941 (local address 127.0.0.1:45034)
0926 14:51:37.035511 (+    50us) negotiation.cc:107] Waiting for socket to connect
0926 14:51:37.035521 (+    10us) client_negotiation.cc:174] Beginning negotiation
0926 14:51:37.035558 (+    37us) client_negotiation.cc:252] Sending NEGOTIATE NegotiatePB request
0926 14:51:37.293924 (+258366us) negotiation.cc:327] Negotiation complete: Network error: Client connection negotiation failed: client connection to 0.0.0.0:34941: BlockingRecv error: recv error from unknown peer: Transport endpoint is not connected (error 107)
Metrics: {"client-negotiator.queue_time_us":29}
[       OK ] Parameters/TestRpcSocketTxRxQueue.OverCapacity/0 (1045 ms)
[----------] 1 test from Parameters/TestRpcSocketTxRxQueue (1045 ms total)

[----------] Global test environment tear-down
[==========] 21 tests from 2 test suites ran. (25989 ms total)
[  PASSED  ] 20 tests.
[  FAILED  ] 1 test, listed below:
[  FAILED  ] Parameters/TestRpc.TestCallWithChainCertAndChainCA/SSL_TCP, where GetParam() = (true, false)

 1 FAILED TEST