Diagnosed failure
Parameters/TestRpc.TestCallWithChainCertAndChainCA/SSL_UnixSocket: /data0/somelongdirectorytoavoidrpathissues/src/kudu/src/kudu/rpc/rpc-test.cc:270: Failure
Failed
Bad status: Runtime error: could not verify certificate chain (error with cert: subject=CN = localhost, ST = sadfjas, C = AS, emailAddress = sdflkdsajf, O = lskdfjlsad, OU = sldfkja, issuer=C = AS, ST = ASDfkjdhf, L = lskdjf, O = saldfja, OU = skdjf, CN = localhost, emailAddress = sadjflkadsj): : certificate has expired
Google Test trace:
/data0/somelongdirectorytoavoidrpathissues/src/kudu/src/kudu/rpc/rpc-test.cc:267: Connecting to unix:/tmp/dist-test-tasklpbIC1/test-tmp/rpc-test-0514a53186584060a63a97729bba4d3b.sock
I20260926 03:37:54.020619 2983 test_util.cc:175] -----------------------------------------------
I20260926 03:37:54.020700 2983 test_util.cc:176] Had fatal failures, leaving test files at /tmp/dist-test-tasklpbIC1/test-tmp/rpc-test.6.Parameters_TestRpc.TestCallWithChainCertAndChainCA_SSL_UnixSocket.1790393873901942-2983-0
Full log
Note: This is test shard 7 of 8.
[==========] Running 21 tests from 2 test suites.
[----------] Global test environment set-up.
[----------] 20 tests from Parameters/TestRpc
[ RUN ] Parameters/TestRpc.TestMessengerCreateDestroy/SSL_UnixSocket
WARNING: Logging before InitGoogleLogging() is written to STDERR
I20260926 03:37:53.942087 2983 rpc-test.cc:169] started messenger TestCreateDestroy
[ OK ] Parameters/TestRpc.TestMessengerCreateDestroy/SSL_UnixSocket (24 ms)
[ RUN ] Parameters/TestRpc.TestNegotiationDeadlock/SSL_UnixSocket
I20260926 03:37:53.969412 3003 acceptor_pool.cc:254] collecting diagnostics on the listening RPC socket unix:/tmp/dist-test-tasklpbIC1/test-tmp/rpc-test-a7417d610f1c48e59892fd649c0b371f.sock every 8 connection(s)
I20260926 03:37:53.969590 3004 acceptor_pool.cc:254] collecting diagnostics on the listening RPC socket unix:/tmp/dist-test-tasklpbIC1/test-tmp/rpc-test-a7417d610f1c48e59892fd649c0b371f.sock every 8 connection(s)
[ OK ] Parameters/TestRpc.TestNegotiationDeadlock/SSL_UnixSocket (42 ms)
[ RUN ] Parameters/TestRpc.TestCallWithChainCertAndChainCA/SSL_UnixSocket
I20260926 03:37:54.009172 3019 acceptor_pool.cc:254] collecting diagnostics on the listening RPC socket unix:/tmp/dist-test-tasklpbIC1/test-tmp/rpc-test-0514a53186584060a63a97729bba4d3b.sock every 8 connection(s)
I20260926 03:37:54.009526 3020 acceptor_pool.cc:254] collecting diagnostics on the listening RPC socket unix:/tmp/dist-test-tasklpbIC1/test-tmp/rpc-test-0514a53186584060a63a97729bba4d3b.sock every 8 connection(s)
/data0/somelongdirectorytoavoidrpathissues/src/kudu/src/kudu/rpc/rpc-test.cc:270: Failure
Failed
Bad status: Runtime error: could not verify certificate chain (error with cert: subject=CN = localhost, ST = sadfjas, C = AS, emailAddress = sdflkdsajf, O = lskdfjlsad, OU = sldfkja, issuer=C = AS, ST = ASDfkjdhf, L = lskdjf, O = saldfja, OU = skdjf, CN = localhost, emailAddress = sadjflkadsj): : certificate has expired
Google Test trace:
/data0/somelongdirectorytoavoidrpathissues/src/kudu/src/kudu/rpc/rpc-test.cc:267: Connecting to unix:/tmp/dist-test-tasklpbIC1/test-tmp/rpc-test-0514a53186584060a63a97729bba4d3b.sock
I20260926 03:37:54.020619 2983 test_util.cc:175] -----------------------------------------------
I20260926 03:37:54.020700 2983 test_util.cc:176] Had fatal failures, leaving test files at /tmp/dist-test-tasklpbIC1/test-tmp/rpc-test.6.Parameters_TestRpc.TestCallWithChainCertAndChainCA_SSL_UnixSocket.1790393873901942-2983-0
[ FAILED ] Parameters/TestRpc.TestCallWithChainCertAndChainCA/SSL_UnixSocket, where GetParam() = (true, true) (33 ms)
[ RUN ] Parameters/TestRpc.TestCallWithPasswordProtectedKey/SSL_UnixSocket
I20260926 03:37:54.030213 3044 acceptor_pool.cc:254] collecting diagnostics on the listening RPC socket unix:/tmp/dist-test-tasklpbIC1/test-tmp/rpc-test-3940967dbd0d48c99ed92c2390e81d72.sock every 8 connection(s)
I20260926 03:37:54.030471 3045 acceptor_pool.cc:254] collecting diagnostics on the listening RPC socket unix:/tmp/dist-test-tasklpbIC1/test-tmp/rpc-test-3940967dbd0d48c99ed92c2390e81d72.sock every 8 connection(s)
W20260926 03:37:54.061643 3041 connection.cc:196] Error closing socket: Network error: TlsSocket::Close: Broken pipe
[ OK ] Parameters/TestRpc.TestCallWithPasswordProtectedKey/SSL_UnixSocket (43 ms)
[ RUN ] Parameters/TestRpc.TestCallToBadServer/SSL_UnixSocket
I20260926 03:37:54.083967 2983 rpc-test.cc:394] Status: Network error: Client connection negotiation failed: client connection to 0.0.0.0:0: connect: Connection refused (error 111)
I20260926 03:37:54.084770 2983 rpc-test.cc:394] Status: Network error: Client connection negotiation failed: client connection to 0.0.0.0:0: connect: Connection refused (error 111)
I20260926 03:37:54.085489 2983 rpc-test.cc:394] Status: Network error: Client connection negotiation failed: client connection to 0.0.0.0:0: connect: Connection refused (error 111)
I20260926 03:37:54.086094 2983 rpc-test.cc:394] Status: Network error: Client connection negotiation failed: client connection to 0.0.0.0:0: connect: Connection refused (error 111)
I20260926 03:37:54.086666 2983 rpc-test.cc:394] Status: Network error: Client connection negotiation failed: client connection to 0.0.0.0:0: connect: Connection refused (error 111)
[ OK ] Parameters/TestRpc.TestCallToBadServer/SSL_UnixSocket (23 ms)
[ RUN ] Parameters/TestRpc.TestWrongService/SSL_UnixSocket
I20260926 03:37:54.108946 3079 acceptor_pool.cc:254] collecting diagnostics on the listening RPC socket unix:/tmp/dist-test-tasklpbIC1/test-tmp/rpc-test-3509ae760da04e13a9c4be014337ce75.sock every 8 connection(s)
I20260926 03:37:54.109246 3080 acceptor_pool.cc:254] collecting diagnostics on the listening RPC socket unix:/tmp/dist-test-tasklpbIC1/test-tmp/rpc-test-3509ae760da04e13a9c4be014337ce75.sock every 8 connection(s)
I20260926 03:37:54.129179 3076 messenger.cc:345] service WrongServiceName not registered on TestServer
[ OK ] Parameters/TestRpc.TestWrongService/SSL_UnixSocket (45 ms)
[ RUN ] Parameters/TestRpc.TestConnectionKeepalive/SSL_UnixSocket
I20260926 03:37:54.147039 3102 acceptor_pool.cc:254] collecting diagnostics on the listening RPC socket unix:/tmp/dist-test-tasklpbIC1/test-tmp/rpc-test-069cfe71434f492bac8b3aff4abf2c41.sock every 8 connection(s)
I20260926 03:37:54.147351 3103 acceptor_pool.cc:254] collecting diagnostics on the listening RPC socket unix:/tmp/dist-test-tasklpbIC1/test-tmp/rpc-test-069cfe71434f492bac8b3aff4abf2c41.sock every 8 connection(s)
I20260926 03:37:54.148128 2983 rpc-test.cc:488] Connecting to unix:/tmp/dist-test-tasklpbIC1/test-tmp/rpc-test-069cfe71434f492bac8b3aff4abf2c41.sock
W20260926 03:37:54.636315 3115 connection.cc:196] Error closing socket: Network error: TlsSocket::Close: Broken pipe
[ OK ] Parameters/TestRpc.TestConnectionKeepalive/SSL_UnixSocket (1047 ms)
[ RUN ] Parameters/TestRpc.TestClientConnectionMetrics/SSL_UnixSocket
I20260926 03:37:55.212046 3127 acceptor_pool.cc:254] collecting diagnostics on the listening RPC socket unix:/tmp/dist-test-tasklpbIC1/test-tmp/rpc-test-3355d018257b471e9f5f381735e53e72.sock every 8 connection(s)
I20260926 03:37:55.212396 3128 acceptor_pool.cc:254] collecting diagnostics on the listening RPC socket unix:/tmp/dist-test-tasklpbIC1/test-tmp/rpc-test-3355d018257b471e9f5f381735e53e72.sock every 8 connection(s)
I20260926 03:37:55.213304 2983 rpc-test.cc:569] Connecting to unix:/tmp/dist-test-tasklpbIC1/test-tmp/rpc-test-3355d018257b471e9f5f381735e53e72.sock
W20260926 03:38:16.290171 3124 connection.cc:196] Error closing socket: Network error: TlsSocket::Close: Broken pipe
[ OK ] Parameters/TestRpc.TestClientConnectionMetrics/SSL_UnixSocket (21113 ms)
[ RUN ] Parameters/TestRpc.TestCredentialsPolicy/SSL_UnixSocket
I20260926 03:38:16.321671 3150 acceptor_pool.cc:254] collecting diagnostics on the listening RPC socket unix:/tmp/dist-test-tasklpbIC1/test-tmp/rpc-test-783209167e734486bd7ba9ec5bcff555.sock every 8 connection(s)
I20260926 03:38:16.321920 3151 acceptor_pool.cc:254] collecting diagnostics on the listening RPC socket unix:/tmp/dist-test-tasklpbIC1/test-tmp/rpc-test-783209167e734486bd7ba9ec5bcff555.sock every 8 connection(s)
I20260926 03:38:16.322814 2983 rpc-test.cc:700] Connecting to unix:/tmp/dist-test-tasklpbIC1/test-tmp/rpc-test-783209167e734486bd7ba9ec5bcff555.sock
W20260926 03:38:16.344002 3149 connection.cc:196] Error closing socket: Network error: TlsSocket::Close: Broken pipe
W20260926 03:38:16.351158 3149 connection.cc:196] Error closing socket: Network error: TlsSocket::Close: Broken pipe
[ OK ] Parameters/TestRpc.TestCredentialsPolicy/SSL_UnixSocket (58 ms)
[ RUN ] Parameters/TestRpc.TestCallLongerThanKeepalive/SSL_UnixSocket
I20260926 03:38:16.384743 3175 acceptor_pool.cc:254] collecting diagnostics on the listening RPC socket unix:/tmp/dist-test-tasklpbIC1/test-tmp/rpc-test-c759160741464666aea23b4e179c70e5.sock every 8 connection(s)
I20260926 03:38:16.384941 3176 acceptor_pool.cc:254] collecting diagnostics on the listening RPC socket unix:/tmp/dist-test-tasklpbIC1/test-tmp/rpc-test-c759160741464666aea23b4e179c70e5.sock every 8 connection(s)
I20260926 03:38:16.425783 3179 rpc-test-base.h:222] got call: sleep_micros: 3000000 deferred: true
I20260926 03:38:19.427498 3179 rpcz_store.cc:275] Call kudu.rpc.GenericCalculatorService.Sleep from unix:<unnamed> (request call id 0) took 3001 ms. Trace:
I20260926 03:38:19.427698 3179 rpcz_store.cc:276] 0926 03:38:16.425658 (+ 0us) service_pool.cc:170] Inserting onto call queue
0926 03:38:16.425727 (+ 69us) service_pool.cc:227] Handling call
0926 03:38:19.427449 (+3001722us) inbound_call.cc:173] Queueing success response
Metrics: {}
[ OK ] Parameters/TestRpc.TestCallLongerThanKeepalive/SSL_UnixSocket (3079 ms)
[ RUN ] Parameters/TestRpc.TestRpcSidecar/SSL_UnixSocket
I20260926 03:38:19.468258 3200 acceptor_pool.cc:254] collecting diagnostics on the listening RPC socket unix:/tmp/dist-test-tasklpbIC1/test-tmp/rpc-test-31bd020bd4c049c195a49af081ece416.sock every 8 connection(s)
I20260926 03:38:19.468544 3201 acceptor_pool.cc:254] collecting diagnostics on the listening RPC socket unix:/tmp/dist-test-tasklpbIC1/test-tmp/rpc-test-31bd020bd4c049c195a49af081ece416.sock every 8 connection(s)
W20260926 03:38:19.572739 3197 connection.cc:196] Error closing socket: Network error: TlsSocket::Close: Broken pipe
[ OK ] Parameters/TestRpc.TestRpcSidecar/SSL_UnixSocket (141 ms)
[ RUN ] Parameters/TestRpc.TestRpcSidecarLimits/SSL_UnixSocket
I20260926 03:38:21.702808 3225 acceptor_pool.cc:254] collecting diagnostics on the listening RPC socket unix:/tmp/dist-test-tasklpbIC1/test-tmp/rpc-test-4f88a935995140a68b521d4bfc989ad1.sock every 8 connection(s)
I20260926 03:38:21.703102 3226 acceptor_pool.cc:254] collecting diagnostics on the listening RPC socket unix:/tmp/dist-test-tasklpbIC1/test-tmp/rpc-test-4f88a935995140a68b521d4bfc989ad1.sock every 8 connection(s)
W20260926 03:38:21.720110 2983 serialization.cc:72] Serialized kudu.rpc_test.PushStringsRequestPB (2147483654 bytes) is larger than the maximum configured RPC message size (52428800 bytes). Sending anyway, but peer may reject the data.
W20260926 03:38:21.726126 3222 connection.cc:535] server connection from unix:<unnamed> recv error: Network error: RPC frame had a length of 2147483714, but we only support messages up to 52428800 bytes long.
W20260926 03:38:21.726272 3222 connection.cc:158] shutting down server connection from unix:<unnamed> with pending inbound data: 4/2147483714 bytes received; last active 0 ns ago: status Network error: RPC frame had a length of 2147483714, but we only support messages up to 52428800 bytes long.
W20260926 03:38:21.726791 3238 connection.cc:196] Error closing socket: Network error: TlsSocket::Close: Broken pipe
I20260926 03:38:21.754354 3250 acceptor_pool.cc:254] collecting diagnostics on the listening RPC socket unix:/tmp/dist-test-tasklpbIC1/test-tmp/rpc-test-4f88a935995140a68b521d4bfc989ad1.sock every 8 connection(s)
I20260926 03:38:21.754571 3251 acceptor_pool.cc:254] collecting diagnostics on the listening RPC socket unix:/tmp/dist-test-tasklpbIC1/test-tmp/rpc-test-4f88a935995140a68b521d4bfc989ad1.sock every 8 connection(s)
W20260926 03:38:27.455564 3247 connection.cc:577] server connection from unix:<unnamed>: received bad data: 'Corruption: Invalid packet: message had a length of 2147483710, but we only support messages up to 2147483647 bytes
'
W20260926 03:38:27.456161 3263 connection.cc:196] Error closing socket: Network error: TlsSocket::Close: Broken pipe
[ OK ] Parameters/TestRpc.TestRpcSidecarLimits/SSL_UnixSocket (8362 ms)
[ RUN ] Parameters/TestRpc.TestCallTimeoutDoesntAffectNegotiation/SSL_UnixSocket
I20260926 03:38:27.959872 3275 acceptor_pool.cc:254] collecting diagnostics on the listening RPC socket unix:/tmp/dist-test-tasklpbIC1/test-tmp/rpc-test-d736734a76974b44af020e40fffe3103.sock every 8 connection(s)
I20260926 03:38:27.960143 3276 acceptor_pool.cc:254] collecting diagnostics on the listening RPC socket unix:/tmp/dist-test-tasklpbIC1/test-tmp/rpc-test-d736734a76974b44af020e40fffe3103.sock every 8 connection(s)
W20260926 03:38:27.977639 3271 negotiation.cc:266] Injecting 500ms delay in negotiation
I20260926 03:38:28.027983 2983 rpc-test-base.h:595] status: Timed out: connection negotiation to unix:/tmp/dist-test-tasklpbIC1/test-tmp/rpc-test-d736734a76974b44af020e40fffe3103.sock for RPC Sleep timed out after 0.050s (ON_OUTBOUND_QUEUE), seconds elapsed: 0.0509181
[ OK ] Parameters/TestRpc.TestCallTimeoutDoesntAffectNegotiation/SSL_UnixSocket (548 ms)
[ RUN ] Parameters/TestRpc.TestRpcHandlerLatencyMetric/SSL_UnixSocket
I20260926 03:38:28.525643 3300 acceptor_pool.cc:254] collecting diagnostics on the listening RPC socket unix:/tmp/dist-test-tasklpbIC1/test-tmp/rpc-test-7e2944e4134f45fba49a0ad21f560aca.sock every 8 connection(s)
I20260926 03:38:28.525945 3301 acceptor_pool.cc:254] collecting diagnostics on the listening RPC socket unix:/tmp/dist-test-tasklpbIC1/test-tmp/rpc-test-7e2944e4134f45fba49a0ad21f560aca.sock every 8 connection(s)
I20260926 03:38:28.565496 2983 rpc-test.cc:1236] Sleep() min lat: 20564
I20260926 03:38:28.565610 2983 rpc-test.cc:1237] Sleep() mean lat: 20564
I20260926 03:38:28.565694 2983 rpc-test.cc:1238] Sleep() max lat: 20564
I20260926 03:38:28.565737 2983 rpc-test.cc:1239] Sleep() #calls: 1
W20260926 03:38:28.566787 3297 connection.cc:196] Error closing socket: Network error: TlsSocket::Close: Broken pipe
[ OK ] Parameters/TestRpc.TestRpcHandlerLatencyMetric/SSL_UnixSocket (82 ms)
[ RUN ] Parameters/TestRpc.TimedOutOnResponseMetricServiceQueue/SSL_UnixSocket
I20260926 03:38:28.600885 3326 acceptor_pool.cc:254] collecting diagnostics on the listening RPC socket unix:/tmp/dist-test-tasklpbIC1/test-tmp/rpc-test-3436155b0c23493b8b31604561645d52.sock every 8 connection(s)
I20260926 03:38:28.601109 3327 acceptor_pool.cc:254] collecting diagnostics on the listening RPC socket unix:/tmp/dist-test-tasklpbIC1/test-tmp/rpc-test-3436155b0c23493b8b31604561645d52.sock every 8 connection(s)
W20260926 03:38:28.657670 3328 rpcz_store.cc:267] Call kudu.rpc_test.CalculatorService.Sleep from unix:<unnamed> (request call id 2) took 20 ms (client timeout 20 ms). Trace:
W20260926 03:38:28.657847 3328 rpcz_store.cc:269] 0926 03:38:28.637304 (+ 0us) service_pool.cc:170] Inserting onto call queue
0926 03:38:28.657617 (+ 20313us) service_pool.cc:214] Skipping call since client already timed out
0926 03:38:28.657653 (+ 36us) inbound_call.cc:173] Queueing failure response
Metrics: {}
[ OK ] Parameters/TestRpc.TimedOutOnResponseMetricServiceQueue/SSL_UnixSocket (91 ms)
[ RUN ] Parameters/TestRpc.RpcPendingConnectionsMetric/SSL_UnixSocket
I20260926 03:38:28.666455 3349 acceptor_pool.cc:254] collecting diagnostics on the listening RPC socket 0.0.0.0:33997 every 8 connection(s)
I20260926 03:38:28.666679 3350 acceptor_pool.cc:254] collecting diagnostics on the listening RPC socket 0.0.0.0:33997 every 8 connection(s)
W20260926 03:38:28.668668 3345 negotiation.cc:337] Failed RPC negotiation. Trace:
0926 03:38:28.668008 (+ 0us) reactor.cc:625] Submitting negotiation task for server connection from 127.0.0.1:59652 (local address 127.0.0.1:33997)
0926 03:38:28.668173 (+ 165us) server_negotiation.cc:206] Beginning negotiation
0926 03:38:28.668178 (+ 5us) server_negotiation.cc:399] Waiting for connection header
0926 03:38:28.668300 (+ 122us) negotiation.cc:327] Negotiation complete: Network error: Server connection negotiation failed: server connection from 127.0.0.1:59652: BlockingRecv error: recv got EOF from 127.0.0.1:59652 (error 108)
Metrics: {"server-negotiator.queue_time_us":51}
[ OK ] Parameters/TestRpc.RpcPendingConnectionsMetric/SSL_UnixSocket (18 ms)
[ RUN ] Parameters/TestRpc.TestRpcContextClientDeadline/SSL_UnixSocket
I20260926 03:38:28.693495 3365 acceptor_pool.cc:254] collecting diagnostics on the listening RPC socket unix:/tmp/dist-test-tasklpbIC1/test-tmp/rpc-test-0791cdf134244c599c0361417d6d5e59.sock every 8 connection(s)
I20260926 03:38:28.693706 3366 acceptor_pool.cc:254] collecting diagnostics on the listening RPC socket unix:/tmp/dist-test-tasklpbIC1/test-tmp/rpc-test-0791cdf134244c599c0361417d6d5e59.sock every 8 connection(s)
[ OK ] Parameters/TestRpc.TestRpcContextClientDeadline/SSL_UnixSocket (52 ms)
[ RUN ] Parameters/TestRpc.TestApplicationFeatureFlagUnsupportedServer/SSL_UnixSocket
I20260926 03:38:28.758538 3390 acceptor_pool.cc:254] collecting diagnostics on the listening RPC socket unix:/tmp/dist-test-tasklpbIC1/test-tmp/rpc-test-8179e51772ba4fce85dd6906a00d5ee6.sock every 8 connection(s)
I20260926 03:38:28.758769 3391 acceptor_pool.cc:254] collecting diagnostics on the listening RPC socket unix:/tmp/dist-test-tasklpbIC1/test-tmp/rpc-test-8179e51772ba4fce85dd6906a00d5ee6.sock every 8 connection(s)
[ OK ] Parameters/TestRpc.TestApplicationFeatureFlagUnsupportedServer/SSL_UnixSocket (55 ms)
[ RUN ] Parameters/TestRpc.TestCancellationAsync/SSL_UnixSocket
I20260926 03:38:28.796782 3415 acceptor_pool.cc:254] collecting diagnostics on the listening RPC socket unix:/tmp/dist-test-tasklpbIC1/test-tmp/rpc-test-690746a8f61b4458b9ef516fb377969a.sock every 8 connection(s)
I20260926 03:38:28.797036 3416 acceptor_pool.cc:254] collecting diagnostics on the listening RPC socket unix:/tmp/dist-test-tasklpbIC1/test-tmp/rpc-test-690746a8f61b4458b9ef516fb377969a.sock every 8 connection(s)
I20260926 03:38:28.797899 2983 rpc-test.cc:1716] Connecting to unix:/tmp/dist-test-tasklpbIC1/test-tmp/rpc-test-690746a8f61b4458b9ef516fb377969a.sock
I20260926 03:38:28.811741 2983 test_util.cc:268] Using random seed: -1863231542
I20260926 03:38:28.857616 3419 rpc-test-base.h:240] got call: sleep_micros: 500 pattern: 4294967295 num_repetitions: 2097152 sidecar_idx: 0
I20260926 03:38:28.889935 3419 rpc-test-base.h:240] got call: sleep_micros: 500 pattern: 4294967295 num_repetitions: 2097152 sidecar_idx: 0
I20260926 03:38:28.910491 3418 rpc-test-base.h:240] got call: sleep_micros: 500 pattern: 4294967295 num_repetitions: 2097152 sidecar_idx: 0
I20260926 03:38:28.944556 3419 rpc-test-base.h:240] got call: sleep_micros: 500 pattern: 4294967295 num_repetitions: 2097152 sidecar_idx: 0
I20260926 03:38:28.981889 3418 rpc-test-base.h:240] got call: sleep_micros: 500 pattern: 4294967295 num_repetitions: 2097152 sidecar_idx: 0
I20260926 03:38:29.010231 3419 rpc-test-base.h:240] got call: sleep_micros: 500 pattern: 4294967295 num_repetitions: 2097152 sidecar_idx: 0
W20260926 03:38:29.012921 3412 connection.cc:196] Error closing socket: Network error: TlsSocket::Close: Broken pipe
W20260926 03:38:29.044298 3412 connection.cc:441] server connection from unix:<unnamed> torn down before Call kudu.rpc.GenericCalculatorService.SleepWithSidecar from unix:<unnamed> (request call id 8) could send its response
W20260926 03:38:29.059612 3412 connection.cc:441] server connection from unix:<unnamed> torn down before Call kudu.rpc.GenericCalculatorService.SleepWithSidecar from unix:<unnamed> (request call id 9) could send its response
[ OK ] Parameters/TestRpc.TestCancellationAsync/SSL_UnixSocket (273 ms)
[ RUN ] Parameters/TestRpc.TestPerformanceBySocketType/SSL_UnixSocket
I20260926 03:38:29.075129 3440 acceptor_pool.cc:254] collecting diagnostics on the listening RPC socket unix:/tmp/dist-test-tasklpbIC1/test-tmp/rpc-test-5cd6a008afb940ca8aef0fee9e09bba8.sock every 8 connection(s)
I20260926 03:38:29.075376 3441 acceptor_pool.cc:254] collecting diagnostics on the listening RPC socket unix:/tmp/dist-test-tasklpbIC1/test-tmp/rpc-test-5cd6a008afb940ca8aef0fee9e09bba8.sock every 8 connection(s)
I20260926 03:38:29.076272 2983 rpc-test.cc:1846] Connecting to unix:/tmp/dist-test-tasklpbIC1/test-tmp/rpc-test-5cd6a008afb940ca8aef0fee9e09bba8.sock
I20260926 03:38:32.106433 2983 rpc-test.cc:1859] Sending 1024MB via ssl-enabled unix socket: real 3.013s user 2.800s sys 2.287s
I20260926 03:38:35.212015 2983 rpc-test.cc:1859] Sending 1024MB via ssl-enabled unix socket: real 3.105s user 2.916s sys 2.334s
I20260926 03:38:38.336512 2983 rpc-test.cc:1859] Sending 1024MB via ssl-enabled unix socket: real 3.124s user 3.162s sys 2.136s
I20260926 03:38:41.383505 2983 rpc-test.cc:1859] Sending 1024MB via ssl-enabled unix socket: real 3.047s user 2.954s sys 2.196s
I20260926 03:38:44.553428 2983 rpc-test.cc:1859] Sending 1024MB via ssl-enabled unix socket: real 3.170s user 3.159s sys 2.216s
W20260926 03:38:44.554391 3437 connection.cc:196] Error closing socket: Network error: TlsSocket::Close: Broken pipe
[ OK ] Parameters/TestRpc.TestPerformanceBySocketType/SSL_UnixSocket (15498 ms)
[----------] 20 tests from Parameters/TestRpc (50640 ms total)
[----------] 1 test from Parameters/TestRpcSocketTxRxQueue
[ RUN ] Parameters/TestRpcSocketTxRxQueue.AcceptorRxQueueSizeMetric/0
I20260926 03:38:44.566229 3465 acceptor_pool.cc:254] collecting diagnostics on the listening RPC socket 0.0.0.0:37289 every 1 connection(s)
I20260926 03:38:44.566497 3466 acceptor_pool.cc:254] collecting diagnostics on the listening RPC socket 0.0.0.0:37289 every 1 connection(s)
W20260926 03:38:44.568125 3461 negotiation.cc:337] Failed RPC negotiation. Trace:
0926 03:38:44.567766 (+ 0us) reactor.cc:625] Submitting negotiation task for server connection from 127.0.0.1:36608 (local address 127.0.0.1:37289)
0926 03:38:44.567907 (+ 141us) server_negotiation.cc:206] Beginning negotiation
0926 03:38:44.567911 (+ 4us) server_negotiation.cc:399] Waiting for connection header
0926 03:38:44.568026 (+ 115us) negotiation.cc:327] Negotiation complete: Network error: Server connection negotiation failed: server connection from 127.0.0.1:36608: BlockingRecv error: recv got EOF from 127.0.0.1:36608 (error 108)
Metrics: {"server-negotiator.queue_time_us":51}
[ OK ] Parameters/TestRpcSocketTxRxQueue.AcceptorRxQueueSizeMetric/0 (10 ms)
[----------] 1 test from Parameters/TestRpcSocketTxRxQueue (10 ms total)
[----------] Global test environment tear-down
[==========] 21 tests from 2 test suites ran. (50651 ms total)
[ PASSED ] 20 tests.
[ FAILED ] 1 test, listed below:
[ FAILED ] Parameters/TestRpc.TestCallWithChainCertAndChainCA/SSL_UnixSocket, where GetParam() = (true, true)
1 FAILED TEST