Diagnosed failure
Parameters/TestRpc.TestCallWithChainCertAndChainCA/SSL_UnixSocket: /data0/somelongdirectorytoavoidrpathissues/src/kudu/src/kudu/rpc/rpc-test.cc:270: Failure
Failed
Bad status: Runtime error: could not verify certificate chain (error with cert: subject=CN = localhost, ST = sadfjas, C = AS, emailAddress = sdflkdsajf, O = lskdfjlsad, OU = sldfkja, issuer=C = AS, ST = ASDfkjdhf, L = lskdjf, O = saldfja, OU = skdjf, CN = localhost, emailAddress = sadjflkadsj): : certificate has expired
Google Test trace:
/data0/somelongdirectorytoavoidrpathissues/src/kudu/src/kudu/rpc/rpc-test.cc:267: Connecting to unix:/tmp/dist-test-taskiTj7m9/test-tmp/rpc-test-2799968a51d248cfa7bf1765ef719583.sock
I20260928 16:36:02.577404 27626 test_util.cc:175] -----------------------------------------------
I20260928 16:36:02.577469 27626 test_util.cc:176] Had fatal failures, leaving test files at /tmp/dist-test-taskiTj7m9/test-tmp/rpc-test.6.Parameters_TestRpc.TestCallWithChainCertAndChainCA_SSL_UnixSocket.1790613362510092-27626-0
Full log
Note: This is test shard 7 of 8.
[==========] Running 21 tests from 2 test suites.
[----------] Global test environment set-up.
[----------] 20 tests from Parameters/TestRpc
[ RUN ] Parameters/TestRpc.TestMessengerCreateDestroy/SSL_UnixSocket
WARNING: Logging before InitGoogleLogging() is written to STDERR
I20260928 16:36:02.538928 27626 rpc-test.cc:169] started messenger TestCreateDestroy
[ OK ] Parameters/TestRpc.TestMessengerCreateDestroy/SSL_UnixSocket (24 ms)
[ RUN ] Parameters/TestRpc.TestNegotiationDeadlock/SSL_UnixSocket
I20260928 16:36:02.548931 27646 acceptor_pool.cc:254] collecting diagnostics on the listening RPC socket unix:/tmp/dist-test-taskiTj7m9/test-tmp/rpc-test-701185d7674a4aff999827e4702943ee.sock every 8 connection(s)
I20260928 16:36:02.548931 27647 acceptor_pool.cc:254] collecting diagnostics on the listening RPC socket unix:/tmp/dist-test-taskiTj7m9/test-tmp/rpc-test-701185d7674a4aff999827e4702943ee.sock every 8 connection(s)
[ OK ] Parameters/TestRpc.TestNegotiationDeadlock/SSL_UnixSocket (20 ms)
[ RUN ] Parameters/TestRpc.TestCallWithChainCertAndChainCA/SSL_UnixSocket
I20260928 16:36:02.571265 27662 acceptor_pool.cc:254] collecting diagnostics on the listening RPC socket unix:/tmp/dist-test-taskiTj7m9/test-tmp/rpc-test-2799968a51d248cfa7bf1765ef719583.sock every 8 connection(s)
I20260928 16:36:02.571310 27663 acceptor_pool.cc:254] collecting diagnostics on the listening RPC socket unix:/tmp/dist-test-taskiTj7m9/test-tmp/rpc-test-2799968a51d248cfa7bf1765ef719583.sock every 8 connection(s)
/data0/somelongdirectorytoavoidrpathissues/src/kudu/src/kudu/rpc/rpc-test.cc:270: Failure
Failed
Bad status: Runtime error: could not verify certificate chain (error with cert: subject=CN = localhost, ST = sadfjas, C = AS, emailAddress = sdflkdsajf, O = lskdfjlsad, OU = sldfkja, issuer=C = AS, ST = ASDfkjdhf, L = lskdjf, O = saldfja, OU = skdjf, CN = localhost, emailAddress = sadjflkadsj): : certificate has expired
Google Test trace:
/data0/somelongdirectorytoavoidrpathissues/src/kudu/src/kudu/rpc/rpc-test.cc:267: Connecting to unix:/tmp/dist-test-taskiTj7m9/test-tmp/rpc-test-2799968a51d248cfa7bf1765ef719583.sock
I20260928 16:36:02.577404 27626 test_util.cc:175] -----------------------------------------------
I20260928 16:36:02.577469 27626 test_util.cc:176] Had fatal failures, leaving test files at /tmp/dist-test-taskiTj7m9/test-tmp/rpc-test.6.Parameters_TestRpc.TestCallWithChainCertAndChainCA_SSL_UnixSocket.1790613362510092-27626-0
[ FAILED ] Parameters/TestRpc.TestCallWithChainCertAndChainCA/SSL_UnixSocket, where GetParam() = (true, true) (15 ms)
[ RUN ] Parameters/TestRpc.TestCallWithPasswordProtectedKey/SSL_UnixSocket
I20260928 16:36:02.622792 27687 acceptor_pool.cc:254] collecting diagnostics on the listening RPC socket unix:/tmp/dist-test-taskiTj7m9/test-tmp/rpc-test-59c6ac95f066474eafcad9a06a2f627d.sock every 8 connection(s)
I20260928 16:36:02.622816 27688 acceptor_pool.cc:254] collecting diagnostics on the listening RPC socket unix:/tmp/dist-test-taskiTj7m9/test-tmp/rpc-test-59c6ac95f066474eafcad9a06a2f627d.sock every 8 connection(s)
W20260928 16:36:02.639000 27684 connection.cc:196] Error closing socket: Network error: TlsSocket::Close: Broken pipe
[ OK ] Parameters/TestRpc.TestCallWithPasswordProtectedKey/SSL_UnixSocket (62 ms)
[ RUN ] Parameters/TestRpc.TestCallToBadServer/SSL_UnixSocket
I20260928 16:36:02.662166 27626 rpc-test.cc:394] Status: Network error: Client connection negotiation failed: client connection to 0.0.0.0:0: connect: Connection refused (error 111)
I20260928 16:36:02.662714 27626 rpc-test.cc:394] Status: Network error: Client connection negotiation failed: client connection to 0.0.0.0:0: connect: Connection refused (error 111)
I20260928 16:36:02.663138 27626 rpc-test.cc:394] Status: Network error: Client connection negotiation failed: client connection to 0.0.0.0:0: connect: Connection refused (error 111)
I20260928 16:36:02.663525 27626 rpc-test.cc:394] Status: Network error: Client connection negotiation failed: client connection to 0.0.0.0:0: connect: Connection refused (error 111)
I20260928 16:36:02.663923 27626 rpc-test.cc:394] Status: Network error: Client connection negotiation failed: client connection to 0.0.0.0:0: connect: Connection refused (error 111)
[ OK ] Parameters/TestRpc.TestCallToBadServer/SSL_UnixSocket (24 ms)
[ RUN ] Parameters/TestRpc.TestWrongService/SSL_UnixSocket
I20260928 16:36:02.677779 27723 acceptor_pool.cc:254] collecting diagnostics on the listening RPC socket unix:/tmp/dist-test-taskiTj7m9/test-tmp/rpc-test-0e628cbb0b7f4e969a88d9b25d344314.sock every 8 connection(s)
I20260928 16:36:02.677806 27724 acceptor_pool.cc:254] collecting diagnostics on the listening RPC socket unix:/tmp/dist-test-taskiTj7m9/test-tmp/rpc-test-0e628cbb0b7f4e969a88d9b25d344314.sock every 8 connection(s)
I20260928 16:36:02.688169 27720 messenger.cc:345] service WrongServiceName not registered on TestServer
[ OK ] Parameters/TestRpc.TestWrongService/SSL_UnixSocket (26 ms)
[ RUN ] Parameters/TestRpc.TestConnectionKeepalive/SSL_UnixSocket
I20260928 16:36:02.705704 27746 acceptor_pool.cc:254] collecting diagnostics on the listening RPC socket unix:/tmp/dist-test-taskiTj7m9/test-tmp/rpc-test-1431b8d132d0424dbdbbaf93e2d2fd1a.sock every 8 connection(s)
I20260928 16:36:02.705744 27747 acceptor_pool.cc:254] collecting diagnostics on the listening RPC socket unix:/tmp/dist-test-taskiTj7m9/test-tmp/rpc-test-1431b8d132d0424dbdbbaf93e2d2fd1a.sock every 8 connection(s)
I20260928 16:36:02.706127 27626 rpc-test.cc:488] Connecting to unix:/tmp/dist-test-taskiTj7m9/test-tmp/rpc-test-1431b8d132d0424dbdbbaf93e2d2fd1a.sock
W20260928 16:36:03.193138 27759 connection.cc:196] Error closing socket: Network error: TlsSocket::Close: Broken pipe
[ OK ] Parameters/TestRpc.TestConnectionKeepalive/SSL_UnixSocket (1057 ms)
[ RUN ] Parameters/TestRpc.TestClientConnectionMetrics/SSL_UnixSocket
I20260928 16:36:03.780375 27771 acceptor_pool.cc:254] collecting diagnostics on the listening RPC socket unix:/tmp/dist-test-taskiTj7m9/test-tmp/rpc-test-e31a603a682543b5b5614d68bd94936e.sock every 8 connection(s)
I20260928 16:36:03.780408 27772 acceptor_pool.cc:254] collecting diagnostics on the listening RPC socket unix:/tmp/dist-test-taskiTj7m9/test-tmp/rpc-test-e31a603a682543b5b5614d68bd94936e.sock every 8 connection(s)
I20260928 16:36:03.780766 27626 rpc-test.cc:569] Connecting to unix:/tmp/dist-test-taskiTj7m9/test-tmp/rpc-test-e31a603a682543b5b5614d68bd94936e.sock
W20260928 16:36:14.845547 27768 connection.cc:196] Error closing socket: Network error: TlsSocket::Close: Broken pipe
[ OK ] Parameters/TestRpc.TestClientConnectionMetrics/SSL_UnixSocket (11099 ms)
[ RUN ] Parameters/TestRpc.TestCredentialsPolicy/SSL_UnixSocket
I20260928 16:36:14.876068 27794 acceptor_pool.cc:254] collecting diagnostics on the listening RPC socket unix:/tmp/dist-test-taskiTj7m9/test-tmp/rpc-test-164a2de518eb47e19052f8e35ed134d8.sock every 8 connection(s)
I20260928 16:36:14.876083 27795 acceptor_pool.cc:254] collecting diagnostics on the listening RPC socket unix:/tmp/dist-test-taskiTj7m9/test-tmp/rpc-test-164a2de518eb47e19052f8e35ed134d8.sock every 8 connection(s)
I20260928 16:36:14.876439 27626 rpc-test.cc:700] Connecting to unix:/tmp/dist-test-taskiTj7m9/test-tmp/rpc-test-164a2de518eb47e19052f8e35ed134d8.sock
W20260928 16:36:14.899761 27793 connection.cc:196] Error closing socket: Network error: TlsSocket::Close: Broken pipe
W20260928 16:36:14.905093 27793 connection.cc:196] Error closing socket: Network error: TlsSocket::Close: Broken pipe
[ OK ] Parameters/TestRpc.TestCredentialsPolicy/SSL_UnixSocket (58 ms)
[ RUN ] Parameters/TestRpc.TestCallLongerThanKeepalive/SSL_UnixSocket
I20260928 16:36:14.918689 27819 acceptor_pool.cc:254] collecting diagnostics on the listening RPC socket unix:/tmp/dist-test-taskiTj7m9/test-tmp/rpc-test-3de117dffe4744dc80158af899f8682e.sock every 8 connection(s)
I20260928 16:36:14.918704 27820 acceptor_pool.cc:254] collecting diagnostics on the listening RPC socket unix:/tmp/dist-test-taskiTj7m9/test-tmp/rpc-test-3de117dffe4744dc80158af899f8682e.sock every 8 connection(s)
I20260928 16:36:14.937157 27823 rpc-test-base.h:222] got call: sleep_micros: 3000000 deferred: true
I20260928 16:36:17.938153 27823 rpcz_store.cc:275] Call kudu.rpc.GenericCalculatorService.Sleep from unix:<unnamed> (request call id 0) took 3001 ms. Trace:
I20260928 16:36:17.938289 27823 rpcz_store.cc:276] 0928 16:36:14.937059 (+ 0us) service_pool.cc:170] Inserting onto call queue
0928 16:36:14.937131 (+ 72us) service_pool.cc:227] Handling call
0928 16:36:17.938129 (+3000998us) inbound_call.cc:173] Queueing success response
Metrics: {}
[ OK ] Parameters/TestRpc.TestCallLongerThanKeepalive/SSL_UnixSocket (3035 ms)
[ RUN ] Parameters/TestRpc.TestRpcSidecar/SSL_UnixSocket
I20260928 16:36:17.965317 27846 acceptor_pool.cc:254] collecting diagnostics on the listening RPC socket unix:/tmp/dist-test-taskiTj7m9/test-tmp/rpc-test-1af054cec353422b8bf7f5918c91124c.sock every 8 connection(s)
I20260928 16:36:17.965312 27845 acceptor_pool.cc:254] collecting diagnostics on the listening RPC socket unix:/tmp/dist-test-taskiTj7m9/test-tmp/rpc-test-1af054cec353422b8bf7f5918c91124c.sock every 8 connection(s)
W20260928 16:36:18.026974 27842 connection.cc:196] Error closing socket: Network error: TlsSocket::Close: Broken pipe
[ OK ] Parameters/TestRpc.TestRpcSidecar/SSL_UnixSocket (86 ms)
[ RUN ] Parameters/TestRpc.TestRpcSidecarLimits/SSL_UnixSocket
I20260928 16:36:20.158720 27870 acceptor_pool.cc:254] collecting diagnostics on the listening RPC socket unix:/tmp/dist-test-taskiTj7m9/test-tmp/rpc-test-41ffff441ff34151b064168b890a1586.sock every 8 connection(s)
I20260928 16:36:20.158743 27871 acceptor_pool.cc:254] collecting diagnostics on the listening RPC socket unix:/tmp/dist-test-taskiTj7m9/test-tmp/rpc-test-41ffff441ff34151b064168b890a1586.sock every 8 connection(s)
W20260928 16:36:20.171343 27626 serialization.cc:72] Serialized kudu.rpc_test.PushStringsRequestPB (2147483654 bytes) is larger than the maximum configured RPC message size (52428800 bytes). Sending anyway, but peer may reject the data.
W20260928 16:36:20.176059 27867 connection.cc:535] server connection from unix:<unnamed> recv error: Network error: RPC frame had a length of 2147483714, but we only support messages up to 52428800 bytes long.
W20260928 16:36:20.176155 27867 connection.cc:158] shutting down server connection from unix:<unnamed> with pending inbound data: 4/2147483714 bytes received; last active 0 ns ago: status Network error: RPC frame had a length of 2147483714, but we only support messages up to 52428800 bytes long.
W20260928 16:36:20.176433 27883 connection.cc:698] client connection to unix:/tmp/dist-test-taskiTj7m9/test-tmp/rpc-test-41ffff441ff34151b064168b890a1586.sock send error: Network error: failed to write to TLS socket: Broken pipe
W20260928 16:36:20.176641 27883 connection.cc:196] Error closing socket: Network error: TlsSocket::Close: Success
I20260928 16:36:20.189188 27895 acceptor_pool.cc:254] collecting diagnostics on the listening RPC socket unix:/tmp/dist-test-taskiTj7m9/test-tmp/rpc-test-41ffff441ff34151b064168b890a1586.sock every 8 connection(s)
I20260928 16:36:20.189188 27896 acceptor_pool.cc:254] collecting diagnostics on the listening RPC socket unix:/tmp/dist-test-taskiTj7m9/test-tmp/rpc-test-41ffff441ff34151b064168b890a1586.sock every 8 connection(s)
W20260928 16:36:25.711107 27892 connection.cc:577] server connection from unix:<unnamed>: received bad data: 'Corruption: Invalid packet: message had a length of 2147483710, but we only support messages up to 2147483647 bytes
'
W20260928 16:36:25.711591 27908 connection.cc:196] Error closing socket: Network error: TlsSocket::Close: Broken pipe
[ OK ] Parameters/TestRpc.TestRpcSidecarLimits/SSL_UnixSocket (7687 ms)
[ RUN ] Parameters/TestRpc.TestCallTimeoutDoesntAffectNegotiation/SSL_UnixSocket
I20260928 16:36:25.771082 27920 acceptor_pool.cc:254] collecting diagnostics on the listening RPC socket unix:/tmp/dist-test-taskiTj7m9/test-tmp/rpc-test-cf327afda7e74ad582603cea6de86902.sock every 8 connection(s)
I20260928 16:36:25.771160 27921 acceptor_pool.cc:254] collecting diagnostics on the listening RPC socket unix:/tmp/dist-test-taskiTj7m9/test-tmp/rpc-test-cf327afda7e74ad582603cea6de86902.sock every 8 connection(s)
W20260928 16:36:25.796109 27916 negotiation.cc:266] Injecting 500ms delay in negotiation
I20260928 16:36:25.846625 27626 rpc-test-base.h:595] status: Timed out: connection negotiation to unix:/tmp/dist-test-taskiTj7m9/test-tmp/rpc-test-cf327afda7e74ad582603cea6de86902.sock for RPC Sleep timed out after 0.050s (ON_OUTBOUND_QUEUE), seconds elapsed: 0.0511155
W20260928 16:36:26.302352 27917 connection.cc:196] Error closing socket: Network error: TlsSocket::Close: Broken pipe
[ OK ] Parameters/TestRpc.TestCallTimeoutDoesntAffectNegotiation/SSL_UnixSocket (587 ms)
[ RUN ] Parameters/TestRpc.TestRpcHandlerLatencyMetric/SSL_UnixSocket
I20260928 16:36:26.348806 27945 acceptor_pool.cc:254] collecting diagnostics on the listening RPC socket unix:/tmp/dist-test-taskiTj7m9/test-tmp/rpc-test-0ff028774c284dd2b986ec4c9a21c29d.sock every 8 connection(s)
I20260928 16:36:26.348912 27946 acceptor_pool.cc:254] collecting diagnostics on the listening RPC socket unix:/tmp/dist-test-taskiTj7m9/test-tmp/rpc-test-0ff028774c284dd2b986ec4c9a21c29d.sock every 8 connection(s)
I20260928 16:36:26.389779 27626 rpc-test.cc:1236] Sleep() min lat: 20504
I20260928 16:36:26.389869 27626 rpc-test.cc:1237] Sleep() mean lat: 20504
I20260928 16:36:26.389904 27626 rpc-test.cc:1238] Sleep() max lat: 20504
I20260928 16:36:26.389920 27626 rpc-test.cc:1239] Sleep() #calls: 1
[ OK ] Parameters/TestRpc.TestRpcHandlerLatencyMetric/SSL_UnixSocket (88 ms)
[ RUN ] Parameters/TestRpc.TimedOutOnResponseMetricServiceQueue/SSL_UnixSocket
I20260928 16:36:26.399005 27971 acceptor_pool.cc:254] collecting diagnostics on the listening RPC socket unix:/tmp/dist-test-taskiTj7m9/test-tmp/rpc-test-88e6ad283fe44a8ca1110838c0d1d713.sock every 8 connection(s)
I20260928 16:36:26.399061 27972 acceptor_pool.cc:254] collecting diagnostics on the listening RPC socket unix:/tmp/dist-test-taskiTj7m9/test-tmp/rpc-test-88e6ad283fe44a8ca1110838c0d1d713.sock every 8 connection(s)
W20260928 16:36:26.458930 27973 rpcz_store.cc:267] Call kudu.rpc_test.CalculatorService.Sleep from unix:<unnamed> (request call id 2) took 20 ms (client timeout 20 ms). Trace:
W20260928 16:36:26.459067 27973 rpcz_store.cc:269] 0928 16:36:26.438473 (+ 0us) service_pool.cc:170] Inserting onto call queue
0928 16:36:26.458860 (+ 20387us) service_pool.cc:214] Skipping call since client already timed out
0928 16:36:26.458891 (+ 31us) inbound_call.cc:173] Queueing failure response
Metrics: {}
W20260928 16:36:26.459995 27968 connection.cc:196] Error closing socket: Network error: TlsSocket::Close: Broken pipe
[ OK ] Parameters/TestRpc.TimedOutOnResponseMetricServiceQueue/SSL_UnixSocket (68 ms)
[ RUN ] Parameters/TestRpc.RpcPendingConnectionsMetric/SSL_UnixSocket
I20260928 16:36:26.463995 27995 acceptor_pool.cc:254] collecting diagnostics on the listening RPC socket 0.0.0.0:34725 every 8 connection(s)
I20260928 16:36:26.464061 27996 acceptor_pool.cc:254] collecting diagnostics on the listening RPC socket 0.0.0.0:34725 every 8 connection(s)
W20260928 16:36:26.465286 27991 negotiation.cc:337] Failed RPC negotiation. Trace:
0928 16:36:26.464826 (+ 0us) reactor.cc:625] Submitting negotiation task for server connection from 127.0.0.1:47788 (local address 127.0.0.1:34725)
0928 16:36:26.464935 (+ 109us) server_negotiation.cc:206] Beginning negotiation
0928 16:36:26.464938 (+ 3us) server_negotiation.cc:399] Waiting for connection header
0928 16:36:26.465047 (+ 109us) negotiation.cc:327] Negotiation complete: Network error: Server connection negotiation failed: server connection from 127.0.0.1:47788: BlockingRecv error: recv got EOF from 127.0.0.1:47788 (error 108)
Metrics: {"server-negotiator.queue_time_us":37}
[ OK ] Parameters/TestRpc.RpcPendingConnectionsMetric/SSL_UnixSocket (15 ms)
[ RUN ] Parameters/TestRpc.TestRpcContextClientDeadline/SSL_UnixSocket
I20260928 16:36:26.492513 28012 acceptor_pool.cc:254] collecting diagnostics on the listening RPC socket unix:/tmp/dist-test-taskiTj7m9/test-tmp/rpc-test-953e11245ff1455f9ea225d44a9b0273.sock every 8 connection(s)
I20260928 16:36:26.492503 28011 acceptor_pool.cc:254] collecting diagnostics on the listening RPC socket unix:/tmp/dist-test-taskiTj7m9/test-tmp/rpc-test-953e11245ff1455f9ea225d44a9b0273.sock every 8 connection(s)
[ OK ] Parameters/TestRpc.TestRpcContextClientDeadline/SSL_UnixSocket (52 ms)
[ RUN ] Parameters/TestRpc.TestApplicationFeatureFlagUnsupportedServer/SSL_UnixSocket
I20260928 16:36:26.541371 28036 acceptor_pool.cc:254] collecting diagnostics on the listening RPC socket unix:/tmp/dist-test-taskiTj7m9/test-tmp/rpc-test-58c59246d86646518f6a5cb9e98dcbef.sock every 8 connection(s)
I20260928 16:36:26.541363 28037 acceptor_pool.cc:254] collecting diagnostics on the listening RPC socket unix:/tmp/dist-test-taskiTj7m9/test-tmp/rpc-test-58c59246d86646518f6a5cb9e98dcbef.sock every 8 connection(s)
W20260928 16:36:26.561769 28033 connection.cc:196] Error closing socket: Network error: TlsSocket::Close: Broken pipe
[ OK ] Parameters/TestRpc.TestApplicationFeatureFlagUnsupportedServer/SSL_UnixSocket (33 ms)
[ RUN ] Parameters/TestRpc.TestCancellationAsync/SSL_UnixSocket
I20260928 16:36:26.573179 28061 acceptor_pool.cc:254] collecting diagnostics on the listening RPC socket unix:/tmp/dist-test-taskiTj7m9/test-tmp/rpc-test-f4cb19ee253f4122a5b2bf3124507019.sock every 8 connection(s)
I20260928 16:36:26.573204 28062 acceptor_pool.cc:254] collecting diagnostics on the listening RPC socket unix:/tmp/dist-test-taskiTj7m9/test-tmp/rpc-test-f4cb19ee253f4122a5b2bf3124507019.sock every 8 connection(s)
I20260928 16:36:26.573565 27626 rpc-test.cc:1716] Connecting to unix:/tmp/dist-test-taskiTj7m9/test-tmp/rpc-test-f4cb19ee253f4122a5b2bf3124507019.sock
I20260928 16:36:26.585781 27626 test_util.cc:268] Using random seed: -1428789583
I20260928 16:36:26.609246 28065 rpc-test-base.h:240] got call: sleep_micros: 500 pattern: 4294967295 num_repetitions: 2097152 sidecar_idx: 0
I20260928 16:36:26.626389 28064 rpc-test-base.h:240] got call: sleep_micros: 500 pattern: 4294967295 num_repetitions: 2097152 sidecar_idx: 0
I20260928 16:36:26.646221 28065 rpc-test-base.h:240] got call: sleep_micros: 500 pattern: 4294967295 num_repetitions: 2097152 sidecar_idx: 0
I20260928 16:36:26.664707 28064 rpc-test-base.h:240] got call: sleep_micros: 500 pattern: 4294967295 num_repetitions: 2097152 sidecar_idx: 0
I20260928 16:36:26.681203 28065 rpc-test-base.h:240] got call: sleep_micros: 500 pattern: 4294967295 num_repetitions: 2097152 sidecar_idx: 0
I20260928 16:36:26.698621 28064 rpc-test-base.h:240] got call: sleep_micros: 500 pattern: 4294967295 num_repetitions: 2097152 sidecar_idx: 0
I20260928 16:36:26.715633 28065 rpc-test-base.h:240] got call: sleep_micros: 500 pattern: 4294967295 num_repetitions: 2097152 sidecar_idx: 0
I20260928 16:36:26.732383 28064 rpc-test-base.h:240] got call: sleep_micros: 500 pattern: 4294967295 num_repetitions: 2097152 sidecar_idx: 0
W20260928 16:36:26.734288 28058 connection.cc:196] Error closing socket: Network error: TlsSocket::Close: Broken pipe
W20260928 16:36:26.740217 28058 connection.cc:441] server connection from unix:<unnamed> torn down before Call kudu.rpc.GenericCalculatorService.SleepWithSidecar from unix:<unnamed> (request call id 8) could send its response
W20260928 16:36:26.750874 28058 connection.cc:441] server connection from unix:<unnamed> torn down before Call kudu.rpc.GenericCalculatorService.SleepWithSidecar from unix:<unnamed> (request call id 9) could send its response
[ OK ] Parameters/TestRpc.TestCancellationAsync/SSL_UnixSocket (189 ms)
[ RUN ] Parameters/TestRpc.TestPerformanceBySocketType/SSL_UnixSocket
I20260928 16:36:26.767865 28086 acceptor_pool.cc:254] collecting diagnostics on the listening RPC socket unix:/tmp/dist-test-taskiTj7m9/test-tmp/rpc-test-c3f6922675284277968092cf4ca60046.sock every 8 connection(s)
I20260928 16:36:26.767897 28087 acceptor_pool.cc:254] collecting diagnostics on the listening RPC socket unix:/tmp/dist-test-taskiTj7m9/test-tmp/rpc-test-c3f6922675284277968092cf4ca60046.sock every 8 connection(s)
I20260928 16:36:26.768208 27626 rpc-test.cc:1846] Connecting to unix:/tmp/dist-test-taskiTj7m9/test-tmp/rpc-test-c3f6922675284277968092cf4ca60046.sock
I20260928 16:36:28.577613 27626 rpc-test.cc:1859] Sending 1024MB via ssl-enabled unix socket: real 1.792s user 2.215s sys 0.962s
I20260928 16:36:30.382102 27626 rpc-test.cc:1859] Sending 1024MB via ssl-enabled unix socket: real 1.804s user 2.268s sys 0.944s
I20260928 16:36:32.118257 27626 rpc-test.cc:1859] Sending 1024MB via ssl-enabled unix socket: real 1.736s user 2.258s sys 0.840s
I20260928 16:36:33.916950 27626 rpc-test.cc:1859] Sending 1024MB via ssl-enabled unix socket: real 1.799s user 2.161s sys 1.045s
I20260928 16:36:35.666256 27626 rpc-test.cc:1859] Sending 1024MB via ssl-enabled unix socket: real 1.749s user 2.063s sys 1.058s
W20260928 16:36:35.667253 28083 connection.cc:196] Error closing socket: Network error: TlsSocket::Close: Broken pipe
[ OK ] Parameters/TestRpc.TestPerformanceBySocketType/SSL_UnixSocket (8915 ms)
[----------] 20 tests from Parameters/TestRpc (33152 ms total)
[----------] 1 test from Parameters/TestRpcSocketTxRxQueue
[ RUN ] Parameters/TestRpcSocketTxRxQueue.AcceptorRxQueueSizeMetric/0
I20260928 16:36:35.675918 28111 acceptor_pool.cc:254] collecting diagnostics on the listening RPC socket 0.0.0.0:36549 every 1 connection(s)
I20260928 16:36:35.675940 28112 acceptor_pool.cc:254] collecting diagnostics on the listening RPC socket 0.0.0.0:36549 every 1 connection(s)
W20260928 16:36:35.676867 28107 negotiation.cc:337] Failed RPC negotiation. Trace:
0928 16:36:35.676610 (+ 0us) reactor.cc:625] Submitting negotiation task for server connection from 127.0.0.1:44698 (local address 127.0.0.1:36549)
0928 16:36:35.676703 (+ 93us) server_negotiation.cc:206] Beginning negotiation
0928 16:36:35.676706 (+ 3us) server_negotiation.cc:399] Waiting for connection header
0928 16:36:35.676794 (+ 88us) negotiation.cc:327] Negotiation complete: Network error: Server connection negotiation failed: server connection from 127.0.0.1:44698: BlockingRecv error: recv got EOF from 127.0.0.1:44698 (error 108)
Metrics: {"server-negotiator.queue_time_us":24}
[ OK ] Parameters/TestRpcSocketTxRxQueue.AcceptorRxQueueSizeMetric/0 (10 ms)
[----------] 1 test from Parameters/TestRpcSocketTxRxQueue (10 ms total)
[----------] Global test environment tear-down
[==========] 21 tests from 2 test suites ran. (33162 ms total)
[ PASSED ] 20 tests.
[ FAILED ] 1 test, listed below:
[ FAILED ] Parameters/TestRpc.TestCallWithChainCertAndChainCA/SSL_UnixSocket, where GetParam() = (true, true)
1 FAILED TEST