Diagnosed failure

Parameters/TestRpc.TestCallWithChainCertAndChainCA/SSL_UnixSocket: /data0/somelongdirectorytoavoidrpathissues/src/kudu/src/kudu/rpc/rpc-test.cc:270: Failure
Failed
Bad status: Runtime error: could not verify certificate chain (error with cert: subject=CN = localhost, ST = sadfjas, C = AS, emailAddress = sdflkdsajf, O = lskdfjlsad, OU = sldfkja, issuer=C = AS, ST = ASDfkjdhf, L = lskdjf, O = saldfja, OU = skdjf, CN = localhost, emailAddress = sadjflkadsj): : certificate has expired
Google Test trace:
/data0/somelongdirectorytoavoidrpathissues/src/kudu/src/kudu/rpc/rpc-test.cc:267: Connecting to unix:/tmp/dist-test-task0Qh6TD/test-tmp/rpc-test-f9a7e525095746ba9c884acde767fdf0.sock
I20260929 18:29:25.921860   383 test_util.cc:175] -----------------------------------------------
I20260929 18:29:25.921916   383 test_util.cc:176] Had fatal failures, leaving test files at /tmp/dist-test-task0Qh6TD/test-tmp/rpc-test.6.Parameters_TestRpc.TestCallWithChainCertAndChainCA_SSL_UnixSocket.1790706565838371-383-0

Full log

Note: This is test shard 7 of 8.
[==========] Running 21 tests from 2 test suites.
[----------] Global test environment set-up.
[----------] 20 tests from Parameters/TestRpc
[ RUN      ] Parameters/TestRpc.TestMessengerCreateDestroy/SSL_UnixSocket
WARNING: Logging before InitGoogleLogging() is written to STDERR
I20260929 18:29:25.867409   383 rpc-test.cc:169] started messenger TestCreateDestroy
[       OK ] Parameters/TestRpc.TestMessengerCreateDestroy/SSL_UnixSocket (24 ms)
[ RUN      ] Parameters/TestRpc.TestNegotiationDeadlock/SSL_UnixSocket
I20260929 18:29:25.879549   404 acceptor_pool.cc:254] collecting diagnostics on the listening RPC socket unix:/tmp/dist-test-task0Qh6TD/test-tmp/rpc-test-87be54078e5e451a89a1e36d142b6bed.sock every 8 connection(s)
I20260929 18:29:25.879529   403 acceptor_pool.cc:254] collecting diagnostics on the listening RPC socket unix:/tmp/dist-test-task0Qh6TD/test-tmp/rpc-test-87be54078e5e451a89a1e36d142b6bed.sock every 8 connection(s)
[       OK ] Parameters/TestRpc.TestNegotiationDeadlock/SSL_UnixSocket (20 ms)
[ RUN      ] Parameters/TestRpc.TestCallWithChainCertAndChainCA/SSL_UnixSocket
I20260929 18:29:25.917336   419 acceptor_pool.cc:254] collecting diagnostics on the listening RPC socket unix:/tmp/dist-test-task0Qh6TD/test-tmp/rpc-test-f9a7e525095746ba9c884acde767fdf0.sock every 8 connection(s)
I20260929 18:29:25.917357   420 acceptor_pool.cc:254] collecting diagnostics on the listening RPC socket unix:/tmp/dist-test-task0Qh6TD/test-tmp/rpc-test-f9a7e525095746ba9c884acde767fdf0.sock every 8 connection(s)
/data0/somelongdirectorytoavoidrpathissues/src/kudu/src/kudu/rpc/rpc-test.cc:270: Failure
Failed
Bad status: Runtime error: could not verify certificate chain (error with cert: subject=CN = localhost, ST = sadfjas, C = AS, emailAddress = sdflkdsajf, O = lskdfjlsad, OU = sldfkja, issuer=C = AS, ST = ASDfkjdhf, L = lskdjf, O = saldfja, OU = skdjf, CN = localhost, emailAddress = sadjflkadsj): : certificate has expired
Google Test trace:
/data0/somelongdirectorytoavoidrpathissues/src/kudu/src/kudu/rpc/rpc-test.cc:267: Connecting to unix:/tmp/dist-test-task0Qh6TD/test-tmp/rpc-test-f9a7e525095746ba9c884acde767fdf0.sock
I20260929 18:29:25.921860   383 test_util.cc:175] -----------------------------------------------
I20260929 18:29:25.921916   383 test_util.cc:176] Had fatal failures, leaving test files at /tmp/dist-test-task0Qh6TD/test-tmp/rpc-test.6.Parameters_TestRpc.TestCallWithChainCertAndChainCA_SSL_UnixSocket.1790706565838371-383-0
[  FAILED  ] Parameters/TestRpc.TestCallWithChainCertAndChainCA/SSL_UnixSocket, where GetParam() = (true, true) (32 ms)
[ RUN      ] Parameters/TestRpc.TestCallWithPasswordProtectedKey/SSL_UnixSocket
I20260929 18:29:25.929068   444 acceptor_pool.cc:254] collecting diagnostics on the listening RPC socket unix:/tmp/dist-test-task0Qh6TD/test-tmp/rpc-test-e4247bc6b6474626bd5b793b5cf86d4c.sock every 8 connection(s)
I20260929 18:29:25.929090   445 acceptor_pool.cc:254] collecting diagnostics on the listening RPC socket unix:/tmp/dist-test-task0Qh6TD/test-tmp/rpc-test-e4247bc6b6474626bd5b793b5cf86d4c.sock every 8 connection(s)
W20260929 18:29:25.941927   441 connection.cc:196] Error closing socket: Network error: TlsSocket::Close: Broken pipe
[       OK ] Parameters/TestRpc.TestCallWithPasswordProtectedKey/SSL_UnixSocket (21 ms)
[ RUN      ] Parameters/TestRpc.TestCallToBadServer/SSL_UnixSocket
I20260929 18:29:25.951907   383 rpc-test.cc:394] Status: Network error: Client connection negotiation failed: client connection to 0.0.0.0:0: connect: Connection refused (error 111)
I20260929 18:29:25.952294   383 rpc-test.cc:394] Status: Network error: Client connection negotiation failed: client connection to 0.0.0.0:0: connect: Connection refused (error 111)
I20260929 18:29:25.952621   383 rpc-test.cc:394] Status: Network error: Client connection negotiation failed: client connection to 0.0.0.0:0: connect: Connection refused (error 111)
I20260929 18:29:25.952952   383 rpc-test.cc:394] Status: Network error: Client connection negotiation failed: client connection to 0.0.0.0:0: connect: Connection refused (error 111)
I20260929 18:29:25.953276   383 rpc-test.cc:394] Status: Network error: Client connection negotiation failed: client connection to 0.0.0.0:0: connect: Connection refused (error 111)
[       OK ] Parameters/TestRpc.TestCallToBadServer/SSL_UnixSocket (10 ms)
[ RUN      ] Parameters/TestRpc.TestWrongService/SSL_UnixSocket
I20260929 18:29:25.967448   479 acceptor_pool.cc:254] collecting diagnostics on the listening RPC socket unix:/tmp/dist-test-task0Qh6TD/test-tmp/rpc-test-e09e11512a0a4783b6537463ccca9f64.sock every 8 connection(s)
I20260929 18:29:25.967490   480 acceptor_pool.cc:254] collecting diagnostics on the listening RPC socket unix:/tmp/dist-test-task0Qh6TD/test-tmp/rpc-test-e09e11512a0a4783b6537463ccca9f64.sock every 8 connection(s)
I20260929 18:29:25.976838   476 messenger.cc:345] service WrongServiceName not registered on TestServer
[       OK ] Parameters/TestRpc.TestWrongService/SSL_UnixSocket (24 ms)
[ RUN      ] Parameters/TestRpc.TestConnectionKeepalive/SSL_UnixSocket
I20260929 18:29:25.988319   502 acceptor_pool.cc:254] collecting diagnostics on the listening RPC socket unix:/tmp/dist-test-task0Qh6TD/test-tmp/rpc-test-0658cd0590b54e199e1bfb898d8f46d1.sock every 8 connection(s)
I20260929 18:29:25.988369   503 acceptor_pool.cc:254] collecting diagnostics on the listening RPC socket unix:/tmp/dist-test-task0Qh6TD/test-tmp/rpc-test-0658cd0590b54e199e1bfb898d8f46d1.sock every 8 connection(s)
I20260929 18:29:25.988623   383 rpc-test.cc:488] Connecting to unix:/tmp/dist-test-task0Qh6TD/test-tmp/rpc-test-0658cd0590b54e199e1bfb898d8f46d1.sock
W20260929 18:29:26.480515   515 connection.cc:196] Error closing socket: Network error: TlsSocket::Close: Broken pipe
[       OK ] Parameters/TestRpc.TestConnectionKeepalive/SSL_UnixSocket (1031 ms)
[ RUN      ] Parameters/TestRpc.TestClientConnectionMetrics/SSL_UnixSocket
I20260929 18:29:27.027894   527 acceptor_pool.cc:254] collecting diagnostics on the listening RPC socket unix:/tmp/dist-test-task0Qh6TD/test-tmp/rpc-test-dc0dc2ce1f4947fab07e697a90d547bf.sock every 8 connection(s)
I20260929 18:29:27.027958   528 acceptor_pool.cc:254] collecting diagnostics on the listening RPC socket unix:/tmp/dist-test-task0Qh6TD/test-tmp/rpc-test-dc0dc2ce1f4947fab07e697a90d547bf.sock every 8 connection(s)
I20260929 18:29:27.028177   383 rpc-test.cc:569] Connecting to unix:/tmp/dist-test-task0Qh6TD/test-tmp/rpc-test-dc0dc2ce1f4947fab07e697a90d547bf.sock
W20260929 18:29:37.131104   524 connection.cc:196] Error closing socket: Network error: TlsSocket::Close: Broken pipe
[       OK ] Parameters/TestRpc.TestClientConnectionMetrics/SSL_UnixSocket (10121 ms)
[ RUN      ] Parameters/TestRpc.TestCredentialsPolicy/SSL_UnixSocket
I20260929 18:29:37.146203   550 acceptor_pool.cc:254] collecting diagnostics on the listening RPC socket unix:/tmp/dist-test-task0Qh6TD/test-tmp/rpc-test-db6fd66f972a4b65a2d90e1af0bb2551.sock every 8 connection(s)
I20260929 18:29:37.146242   551 acceptor_pool.cc:254] collecting diagnostics on the listening RPC socket unix:/tmp/dist-test-task0Qh6TD/test-tmp/rpc-test-db6fd66f972a4b65a2d90e1af0bb2551.sock every 8 connection(s)
I20260929 18:29:37.146488   383 rpc-test.cc:700] Connecting to unix:/tmp/dist-test-task0Qh6TD/test-tmp/rpc-test-db6fd66f972a4b65a2d90e1af0bb2551.sock
W20260929 18:29:37.162636   549 connection.cc:196] Error closing socket: Network error: TlsSocket::Close: Broken pipe
W20260929 18:29:37.167021   549 connection.cc:196] Error closing socket: Network error: TlsSocket::Close: Broken pipe
[       OK ] Parameters/TestRpc.TestCredentialsPolicy/SSL_UnixSocket (35 ms)
[ RUN      ] Parameters/TestRpc.TestCallLongerThanKeepalive/SSL_UnixSocket
I20260929 18:29:37.176481   575 acceptor_pool.cc:254] collecting diagnostics on the listening RPC socket unix:/tmp/dist-test-task0Qh6TD/test-tmp/rpc-test-1005865167e44e05a6adff6ecb8e802e.sock every 8 connection(s)
I20260929 18:29:37.176529   576 acceptor_pool.cc:254] collecting diagnostics on the listening RPC socket unix:/tmp/dist-test-task0Qh6TD/test-tmp/rpc-test-1005865167e44e05a6adff6ecb8e802e.sock every 8 connection(s)
I20260929 18:29:37.198791   579 rpc-test-base.h:222] got call: sleep_micros: 3000000 deferred: true
I20260929 18:29:40.199831   579 rpcz_store.cc:275] Call kudu.rpc.GenericCalculatorService.Sleep from unix:<unnamed> (request call id 0) took 3001 ms. Trace:
I20260929 18:29:40.199939   579 rpcz_store.cc:276] 0929 18:29:37.198726 (+     0us) service_pool.cc:170] Inserting onto call queue
0929 18:29:37.198770 (+    44us) service_pool.cc:227] Handling call
0929 18:29:40.199812 (+3001042us) inbound_call.cc:173] Queueing success response
Metrics: {}
W20260929 18:29:40.201422   572 connection.cc:196] Error closing socket: Network error: TlsSocket::Close: Broken pipe
[       OK ] Parameters/TestRpc.TestCallLongerThanKeepalive/SSL_UnixSocket (3035 ms)
[ RUN      ] Parameters/TestRpc.TestRpcSidecar/SSL_UnixSocket
I20260929 18:29:40.226613   600 acceptor_pool.cc:254] collecting diagnostics on the listening RPC socket unix:/tmp/dist-test-task0Qh6TD/test-tmp/rpc-test-e695ee993f0d42a48e5a071ecc000fcb.sock every 8 connection(s)
I20260929 18:29:40.226655   601 acceptor_pool.cc:254] collecting diagnostics on the listening RPC socket unix:/tmp/dist-test-task0Qh6TD/test-tmp/rpc-test-e695ee993f0d42a48e5a071ecc000fcb.sock every 8 connection(s)
W20260929 18:29:40.276937   597 connection.cc:196] Error closing socket: Network error: TlsSocket::Close: Broken pipe
[       OK ] Parameters/TestRpc.TestRpcSidecar/SSL_UnixSocket (74 ms)
[ RUN      ] Parameters/TestRpc.TestRpcSidecarLimits/SSL_UnixSocket
I20260929 18:29:41.950811   625 acceptor_pool.cc:254] collecting diagnostics on the listening RPC socket unix:/tmp/dist-test-task0Qh6TD/test-tmp/rpc-test-c602eba136534c7bbd7bd14d6b805f0c.sock every 8 connection(s)
I20260929 18:29:41.950836   626 acceptor_pool.cc:254] collecting diagnostics on the listening RPC socket unix:/tmp/dist-test-task0Qh6TD/test-tmp/rpc-test-c602eba136534c7bbd7bd14d6b805f0c.sock every 8 connection(s)
W20260929 18:29:41.959668   383 serialization.cc:72] Serialized kudu.rpc_test.PushStringsRequestPB (2147483654 bytes) is larger than the maximum configured RPC message size (52428800 bytes). Sending anyway, but peer may reject the data.
W20260929 18:29:41.963012   622 connection.cc:535] server connection from unix:<unnamed> recv error: Network error: RPC frame had a length of 2147483714, but we only support messages up to 52428800 bytes long.
W20260929 18:29:41.963083   622 connection.cc:158] shutting down server connection from unix:<unnamed> with pending inbound data: 4/2147483714 bytes received; last active 0 ns ago: status Network error: RPC frame had a length of 2147483714, but we only support messages up to 52428800 bytes long.
W20260929 18:29:41.963220   638 connection.cc:698] client connection to unix:/tmp/dist-test-task0Qh6TD/test-tmp/rpc-test-c602eba136534c7bbd7bd14d6b805f0c.sock send error: Network error: failed to write to TLS socket: Broken pipe
W20260929 18:29:41.963356   638 connection.cc:196] Error closing socket: Network error: TlsSocket::Close: Success
I20260929 18:29:41.975077   650 acceptor_pool.cc:254] collecting diagnostics on the listening RPC socket unix:/tmp/dist-test-task0Qh6TD/test-tmp/rpc-test-c602eba136534c7bbd7bd14d6b805f0c.sock every 8 connection(s)
I20260929 18:29:41.975085   651 acceptor_pool.cc:254] collecting diagnostics on the listening RPC socket unix:/tmp/dist-test-task0Qh6TD/test-tmp/rpc-test-c602eba136534c7bbd7bd14d6b805f0c.sock every 8 connection(s)
W20260929 18:29:46.596794   647 connection.cc:577] server connection from unix:<unnamed>: received bad data: 'Corruption: Invalid packet: message had a length of 2147483710, but we only support messages up to 2147483647 bytes
'
W20260929 18:29:46.597150   663 connection.cc:196] Error closing socket: Network error: TlsSocket::Close: Broken pipe
[       OK ] Parameters/TestRpc.TestRpcSidecarLimits/SSL_UnixSocket (6321 ms)
[ RUN      ] Parameters/TestRpc.TestCallTimeoutDoesntAffectNegotiation/SSL_UnixSocket
I20260929 18:29:46.614557   675 acceptor_pool.cc:254] collecting diagnostics on the listening RPC socket unix:/tmp/dist-test-task0Qh6TD/test-tmp/rpc-test-c122dedfb4ad4138854a4f1b3b518939.sock every 8 connection(s)
I20260929 18:29:46.614593   676 acceptor_pool.cc:254] collecting diagnostics on the listening RPC socket unix:/tmp/dist-test-task0Qh6TD/test-tmp/rpc-test-c122dedfb4ad4138854a4f1b3b518939.sock every 8 connection(s)
W20260929 18:29:46.636026   671 negotiation.cc:266] Injecting 500ms delay in negotiation
I20260929 18:29:46.686300   383 rpc-test-base.h:595] status: Timed out: connection negotiation to unix:/tmp/dist-test-task0Qh6TD/test-tmp/rpc-test-c122dedfb4ad4138854a4f1b3b518939.sock for RPC Sleep timed out after 0.050s (ON_OUTBOUND_QUEUE), seconds elapsed: 0.0507312
[       OK ] Parameters/TestRpc.TestCallTimeoutDoesntAffectNegotiation/SSL_UnixSocket (542 ms)
[ RUN      ] Parameters/TestRpc.TestRpcHandlerLatencyMetric/SSL_UnixSocket
I20260929 18:29:47.160995   700 acceptor_pool.cc:254] collecting diagnostics on the listening RPC socket unix:/tmp/dist-test-task0Qh6TD/test-tmp/rpc-test-369c5c07390f48c8a8ccfe868af09d39.sock every 8 connection(s)
I20260929 18:29:47.161034   701 acceptor_pool.cc:254] collecting diagnostics on the listening RPC socket unix:/tmp/dist-test-task0Qh6TD/test-tmp/rpc-test-369c5c07390f48c8a8ccfe868af09d39.sock every 8 connection(s)
I20260929 18:29:47.195576   383 rpc-test.cc:1236] Sleep() min lat: 20333
I20260929 18:29:47.195637   383 rpc-test.cc:1237] Sleep() mean lat: 20333
I20260929 18:29:47.195667   383 rpc-test.cc:1238] Sleep() max lat: 20333
I20260929 18:29:47.195679   383 rpc-test.cc:1239] Sleep() #calls: 1
W20260929 18:29:47.196388   697 connection.cc:196] Error closing socket: Network error: TlsSocket::Close: Broken pipe
[       OK ] Parameters/TestRpc.TestRpcHandlerLatencyMetric/SSL_UnixSocket (55 ms)
[ RUN      ] Parameters/TestRpc.TimedOutOnResponseMetricServiceQueue/SSL_UnixSocket
I20260929 18:29:47.214711   726 acceptor_pool.cc:254] collecting diagnostics on the listening RPC socket unix:/tmp/dist-test-task0Qh6TD/test-tmp/rpc-test-453105b28f5f4a9fa10756cda9d6b29d.sock every 8 connection(s)
I20260929 18:29:47.214748   727 acceptor_pool.cc:254] collecting diagnostics on the listening RPC socket unix:/tmp/dist-test-task0Qh6TD/test-tmp/rpc-test-453105b28f5f4a9fa10756cda9d6b29d.sock every 8 connection(s)
W20260929 18:29:47.263847   728 rpcz_store.cc:267] Call kudu.rpc_test.CalculatorService.Sleep from unix:<unnamed> (request call id 2) took 20 ms (client timeout 20 ms). Trace:
W20260929 18:29:47.263940   728 rpcz_store.cc:269] 0929 18:29:47.243543 (+     0us) service_pool.cc:170] Inserting onto call queue
0929 18:29:47.263791 (+ 20248us) service_pool.cc:214] Skipping call since client already timed out
0929 18:29:47.263814 (+    23us) inbound_call.cc:173] Queueing failure response
Metrics: {}
W20260929 18:29:47.264636   723 connection.cc:196] Error closing socket: Network error: TlsSocket::Close: Broken pipe
[       OK ] Parameters/TestRpc.TimedOutOnResponseMetricServiceQueue/SSL_UnixSocket (68 ms)
[ RUN      ] Parameters/TestRpc.RpcPendingConnectionsMetric/SSL_UnixSocket
I20260929 18:29:47.267649   749 acceptor_pool.cc:254] collecting diagnostics on the listening RPC socket 0.0.0.0:35519 every 8 connection(s)
I20260929 18:29:47.267719   750 acceptor_pool.cc:254] collecting diagnostics on the listening RPC socket 0.0.0.0:35519 every 8 connection(s)
W20260929 18:29:47.276274   745 negotiation.cc:337] Failed RPC negotiation. Trace:
0929 18:29:47.275736 (+     0us) reactor.cc:625] Submitting negotiation task for server connection from 127.0.0.1:59776 (local address 127.0.0.1:35519)
0929 18:29:47.275861 (+   125us) server_negotiation.cc:206] Beginning negotiation
0929 18:29:47.275865 (+     4us) server_negotiation.cc:399] Waiting for connection header
0929 18:29:47.275983 (+   118us) negotiation.cc:327] Negotiation complete: Network error: Server connection negotiation failed: server connection from 127.0.0.1:59776: BlockingRecv error: recv got EOF from 127.0.0.1:59776 (error 108)
Metrics: {"server-negotiator.queue_time_us":42}
[       OK ] Parameters/TestRpc.RpcPendingConnectionsMetric/SSL_UnixSocket (21 ms)
[ RUN      ] Parameters/TestRpc.TestRpcContextClientDeadline/SSL_UnixSocket
I20260929 18:29:47.301843   765 acceptor_pool.cc:254] collecting diagnostics on the listening RPC socket unix:/tmp/dist-test-task0Qh6TD/test-tmp/rpc-test-2b41ea3e549d4e19af0c0fa95f4752fc.sock every 8 connection(s)
I20260929 18:29:47.301877   766 acceptor_pool.cc:254] collecting diagnostics on the listening RPC socket unix:/tmp/dist-test-task0Qh6TD/test-tmp/rpc-test-2b41ea3e549d4e19af0c0fa95f4752fc.sock every 8 connection(s)
[       OK ] Parameters/TestRpc.TestRpcContextClientDeadline/SSL_UnixSocket (67 ms)
[ RUN      ] Parameters/TestRpc.TestApplicationFeatureFlagUnsupportedServer/SSL_UnixSocket
I20260929 18:29:47.379498   791 acceptor_pool.cc:254] collecting diagnostics on the listening RPC socket unix:/tmp/dist-test-task0Qh6TD/test-tmp/rpc-test-0a2232799fa946df8eb8409fb423c5e5.sock every 8 connection(s)
I20260929 18:29:47.379473   790 acceptor_pool.cc:254] collecting diagnostics on the listening RPC socket unix:/tmp/dist-test-task0Qh6TD/test-tmp/rpc-test-0a2232799fa946df8eb8409fb423c5e5.sock every 8 connection(s)
W20260929 18:29:47.390812   787 connection.cc:196] Error closing socket: Network error: TlsSocket::Close: Broken pipe
[       OK ] Parameters/TestRpc.TestApplicationFeatureFlagUnsupportedServer/SSL_UnixSocket (36 ms)
[ RUN      ] Parameters/TestRpc.TestCancellationAsync/SSL_UnixSocket
I20260929 18:29:47.399765   815 acceptor_pool.cc:254] collecting diagnostics on the listening RPC socket unix:/tmp/dist-test-task0Qh6TD/test-tmp/rpc-test-b0a3286f32c346e8b5716dcdcec8867c.sock every 8 connection(s)
I20260929 18:29:47.399838   816 acceptor_pool.cc:254] collecting diagnostics on the listening RPC socket unix:/tmp/dist-test-task0Qh6TD/test-tmp/rpc-test-b0a3286f32c346e8b5716dcdcec8867c.sock every 8 connection(s)
I20260929 18:29:47.400053   383 rpc-test.cc:1716] Connecting to unix:/tmp/dist-test-task0Qh6TD/test-tmp/rpc-test-b0a3286f32c346e8b5716dcdcec8867c.sock
I20260929 18:29:47.407871   383 test_util.cc:268] Using random seed: 1577719294
I20260929 18:29:47.422609   819 rpc-test-base.h:240] got call: sleep_micros: 500 pattern: 4294967295 num_repetitions: 2097152 sidecar_idx: 0
I20260929 18:29:47.439450   818 rpc-test-base.h:240] got call: sleep_micros: 500 pattern: 4294967295 num_repetitions: 2097152 sidecar_idx: 0
I20260929 18:29:47.453794   819 rpc-test-base.h:240] got call: sleep_micros: 500 pattern: 4294967295 num_repetitions: 2097152 sidecar_idx: 0
I20260929 18:29:47.468256   818 rpc-test-base.h:240] got call: sleep_micros: 500 pattern: 4294967295 num_repetitions: 2097152 sidecar_idx: 0
I20260929 18:29:47.483958   819 rpc-test-base.h:240] got call: sleep_micros: 500 pattern: 4294967295 num_repetitions: 2097152 sidecar_idx: 0
I20260929 18:29:47.498492   817 rpc-test-base.h:240] got call: sleep_micros: 500 pattern: 4294967295 num_repetitions: 2097152 sidecar_idx: 0
I20260929 18:29:47.523931   817 rpc-test-base.h:240] got call: sleep_micros: 500 pattern: 4294967295 num_repetitions: 2097152 sidecar_idx: 0
I20260929 18:29:47.541225   819 rpc-test-base.h:240] got call: sleep_micros: 500 pattern: 4294967295 num_repetitions: 2097152 sidecar_idx: 0
W20260929 18:29:47.543058   812 connection.cc:196] Error closing socket: Network error: TlsSocket::Close: Broken pipe
W20260929 18:29:47.547665   812 connection.cc:441] server connection from unix:<unnamed> torn down before Call kudu.rpc.GenericCalculatorService.SleepWithSidecar from unix:<unnamed> (request call id 8) could send its response
W20260929 18:29:47.558920   812 connection.cc:441] server connection from unix:<unnamed> torn down before Call kudu.rpc.GenericCalculatorService.SleepWithSidecar from unix:<unnamed> (request call id 9) could send its response
[       OK ] Parameters/TestRpc.TestCancellationAsync/SSL_UnixSocket (168 ms)
[ RUN      ] Parameters/TestRpc.TestPerformanceBySocketType/SSL_UnixSocket
I20260929 18:29:47.582569   840 acceptor_pool.cc:254] collecting diagnostics on the listening RPC socket unix:/tmp/dist-test-task0Qh6TD/test-tmp/rpc-test-0aff4a69767240c8aa670eb8fa16c2e8.sock every 8 connection(s)
I20260929 18:29:47.582616   841 acceptor_pool.cc:254] collecting diagnostics on the listening RPC socket unix:/tmp/dist-test-task0Qh6TD/test-tmp/rpc-test-0aff4a69767240c8aa670eb8fa16c2e8.sock every 8 connection(s)
I20260929 18:29:47.582832   383 rpc-test.cc:1846] Connecting to unix:/tmp/dist-test-task0Qh6TD/test-tmp/rpc-test-0aff4a69767240c8aa670eb8fa16c2e8.sock
I20260929 18:29:48.984740   383 rpc-test.cc:1859] Sending 1024MB via ssl-enabled unix socket: real 1.388s	user 1.827s	sys 0.697s
I20260929 18:29:50.393865   383 rpc-test.cc:1859] Sending 1024MB via ssl-enabled unix socket: real 1.409s	user 1.799s	sys 0.767s
I20260929 18:29:51.871158   383 rpc-test.cc:1859] Sending 1024MB via ssl-enabled unix socket: real 1.477s	user 1.855s	sys 0.821s
I20260929 18:29:53.274816   383 rpc-test.cc:1859] Sending 1024MB via ssl-enabled unix socket: real 1.404s	user 1.815s	sys 0.741s
I20260929 18:29:54.735462   383 rpc-test.cc:1859] Sending 1024MB via ssl-enabled unix socket: real 1.461s	user 1.914s	sys 0.734s
W20260929 18:29:54.736186   837 connection.cc:196] Error closing socket: Network error: TlsSocket::Close: Broken pipe
[       OK ] Parameters/TestRpc.TestPerformanceBySocketType/SSL_UnixSocket (7177 ms)
[----------] 20 tests from Parameters/TestRpc (28892 ms total)

[----------] 1 test from Parameters/TestRpcSocketTxRxQueue
[ RUN      ] Parameters/TestRpcSocketTxRxQueue.AcceptorRxQueueSizeMetric/0
I20260929 18:29:54.739569   865 acceptor_pool.cc:254] collecting diagnostics on the listening RPC socket 0.0.0.0:38069 every 1 connection(s)
I20260929 18:29:54.739614   866 acceptor_pool.cc:254] collecting diagnostics on the listening RPC socket 0.0.0.0:38069 every 1 connection(s)
W20260929 18:29:54.740324   861 negotiation.cc:337] Failed RPC negotiation. Trace:
0929 18:29:54.740077 (+     0us) reactor.cc:625] Submitting negotiation task for server connection from 127.0.0.1:33258 (local address 127.0.0.1:38069)
0929 18:29:54.740174 (+    97us) server_negotiation.cc:206] Beginning negotiation
0929 18:29:54.740178 (+     4us) server_negotiation.cc:399] Waiting for connection header
0929 18:29:54.740259 (+    81us) negotiation.cc:327] Negotiation complete: Network error: Server connection negotiation failed: server connection from 127.0.0.1:33258: BlockingRecv error: recv got EOF from 127.0.0.1:33258 (error 108)
Metrics: {"server-negotiator.queue_time_us":30}
[       OK ] Parameters/TestRpcSocketTxRxQueue.AcceptorRxQueueSizeMetric/0 (4 ms)
[----------] 1 test from Parameters/TestRpcSocketTxRxQueue (4 ms total)

[----------] Global test environment tear-down
[==========] 21 tests from 2 test suites ran. (28897 ms total)
[  PASSED  ] 20 tests.
[  FAILED  ] 1 test, listed below:
[  FAILED  ] Parameters/TestRpc.TestCallWithChainCertAndChainCA/SSL_UnixSocket, where GetParam() = (true, true)

 1 FAILED TEST