Diagnosed failure

Parameters/TestRpc.TestCallWithChainCertAndChainCA/SSL_UnixSocket: /data0/somelongdirectorytoavoidrpathissues/src/kudu/src/kudu/rpc/rpc-test.cc:270: Failure
Failed
Bad status: Runtime error: could not verify certificate chain (error with cert: subject=CN = localhost, ST = sadfjas, C = AS, emailAddress = sdflkdsajf, O = lskdfjlsad, OU = sldfkja, issuer=C = AS, ST = ASDfkjdhf, L = lskdjf, O = saldfja, OU = skdjf, CN = localhost, emailAddress = sadjflkadsj): : certificate has expired
Google Test trace:
/data0/somelongdirectorytoavoidrpathissues/src/kudu/src/kudu/rpc/rpc-test.cc:267: Connecting to unix:/tmp/dist-test-taskGfrhni/test-tmp/rpc-test-c71e130a1a884aa69c0bd8e24c31e4f0.sock
I20260928 02:45:39.673966  5695 test_util.cc:175] -----------------------------------------------
I20260928 02:45:39.674045  5695 test_util.cc:176] Had fatal failures, leaving test files at /tmp/dist-test-taskGfrhni/test-tmp/rpc-test.6.Parameters_TestRpc.TestCallWithChainCertAndChainCA_SSL_UnixSocket.1790563539607702-5695-0

Full log

Note: This is test shard 7 of 8.
[==========] Running 21 tests from 2 test suites.
[----------] Global test environment set-up.
[----------] 20 tests from Parameters/TestRpc
[ RUN      ] Parameters/TestRpc.TestMessengerCreateDestroy/SSL_UnixSocket
WARNING: Logging before InitGoogleLogging() is written to STDERR
I20260928 02:45:39.638455  5695 rpc-test.cc:169] started messenger TestCreateDestroy
[       OK ] Parameters/TestRpc.TestMessengerCreateDestroy/SSL_UnixSocket (25 ms)
[ RUN      ] Parameters/TestRpc.TestNegotiationDeadlock/SSL_UnixSocket
I20260928 02:45:39.649711  5715 acceptor_pool.cc:254] collecting diagnostics on the listening RPC socket unix:/tmp/dist-test-taskGfrhni/test-tmp/rpc-test-74ccebc6a61546be8a47c7137c3cf13f.sock every 8 connection(s)
I20260928 02:45:39.649727  5716 acceptor_pool.cc:254] collecting diagnostics on the listening RPC socket unix:/tmp/dist-test-taskGfrhni/test-tmp/rpc-test-74ccebc6a61546be8a47c7137c3cf13f.sock every 8 connection(s)
[       OK ] Parameters/TestRpc.TestNegotiationDeadlock/SSL_UnixSocket (21 ms)
[ RUN      ] Parameters/TestRpc.TestCallWithChainCertAndChainCA/SSL_UnixSocket
I20260928 02:45:39.668637  5731 acceptor_pool.cc:254] collecting diagnostics on the listening RPC socket unix:/tmp/dist-test-taskGfrhni/test-tmp/rpc-test-c71e130a1a884aa69c0bd8e24c31e4f0.sock every 8 connection(s)
I20260928 02:45:39.668695  5732 acceptor_pool.cc:254] collecting diagnostics on the listening RPC socket unix:/tmp/dist-test-taskGfrhni/test-tmp/rpc-test-c71e130a1a884aa69c0bd8e24c31e4f0.sock every 8 connection(s)
/data0/somelongdirectorytoavoidrpathissues/src/kudu/src/kudu/rpc/rpc-test.cc:270: Failure
Failed
Bad status: Runtime error: could not verify certificate chain (error with cert: subject=CN = localhost, ST = sadfjas, C = AS, emailAddress = sdflkdsajf, O = lskdfjlsad, OU = sldfkja, issuer=C = AS, ST = ASDfkjdhf, L = lskdjf, O = saldfja, OU = skdjf, CN = localhost, emailAddress = sadjflkadsj): : certificate has expired
Google Test trace:
/data0/somelongdirectorytoavoidrpathissues/src/kudu/src/kudu/rpc/rpc-test.cc:267: Connecting to unix:/tmp/dist-test-taskGfrhni/test-tmp/rpc-test-c71e130a1a884aa69c0bd8e24c31e4f0.sock
I20260928 02:45:39.673966  5695 test_util.cc:175] -----------------------------------------------
I20260928 02:45:39.674045  5695 test_util.cc:176] Had fatal failures, leaving test files at /tmp/dist-test-taskGfrhni/test-tmp/rpc-test.6.Parameters_TestRpc.TestCallWithChainCertAndChainCA_SSL_UnixSocket.1790563539607702-5695-0
[  FAILED  ] Parameters/TestRpc.TestCallWithChainCertAndChainCA/SSL_UnixSocket, where GetParam() = (true, true) (12 ms)
[ RUN      ] Parameters/TestRpc.TestCallWithPasswordProtectedKey/SSL_UnixSocket
I20260928 02:45:39.679953  5756 acceptor_pool.cc:254] collecting diagnostics on the listening RPC socket unix:/tmp/dist-test-taskGfrhni/test-tmp/rpc-test-4335ff8153944fe8b5fe6b13f9389369.sock every 8 connection(s)
I20260928 02:45:39.679991  5757 acceptor_pool.cc:254] collecting diagnostics on the listening RPC socket unix:/tmp/dist-test-taskGfrhni/test-tmp/rpc-test-4335ff8153944fe8b5fe6b13f9389369.sock every 8 connection(s)
W20260928 02:45:39.700014  5753 connection.cc:196] Error closing socket: Network error: TlsSocket::Close: Broken pipe
[       OK ] Parameters/TestRpc.TestCallWithPasswordProtectedKey/SSL_UnixSocket (28 ms)
[ RUN      ] Parameters/TestRpc.TestCallToBadServer/SSL_UnixSocket
I20260928 02:45:39.709173  5695 rpc-test.cc:394] Status: Network error: Client connection negotiation failed: client connection to 0.0.0.0:0: connect: Connection refused (error 111)
I20260928 02:45:39.709749  5695 rpc-test.cc:394] Status: Network error: Client connection negotiation failed: client connection to 0.0.0.0:0: connect: Connection refused (error 111)
I20260928 02:45:39.710284  5695 rpc-test.cc:394] Status: Network error: Client connection negotiation failed: client connection to 0.0.0.0:0: connect: Connection refused (error 111)
I20260928 02:45:39.710851  5695 rpc-test.cc:394] Status: Network error: Client connection negotiation failed: client connection to 0.0.0.0:0: connect: Connection refused (error 111)
I20260928 02:45:39.711385  5695 rpc-test.cc:394] Status: Network error: Client connection negotiation failed: client connection to 0.0.0.0:0: connect: Connection refused (error 111)
[       OK ] Parameters/TestRpc.TestCallToBadServer/SSL_UnixSocket (9 ms)
[ RUN      ] Parameters/TestRpc.TestWrongService/SSL_UnixSocket
I20260928 02:45:39.731848  5792 acceptor_pool.cc:254] collecting diagnostics on the listening RPC socket unix:/tmp/dist-test-taskGfrhni/test-tmp/rpc-test-4cc3c738e36d45b49db6c77f56b3eef6.sock every 8 connection(s)
I20260928 02:45:39.731842  5791 acceptor_pool.cc:254] collecting diagnostics on the listening RPC socket unix:/tmp/dist-test-taskGfrhni/test-tmp/rpc-test-4cc3c738e36d45b49db6c77f56b3eef6.sock every 8 connection(s)
I20260928 02:45:39.753710  5788 messenger.cc:345] service WrongServiceName not registered on TestServer
[       OK ] Parameters/TestRpc.TestWrongService/SSL_UnixSocket (43 ms)
[ RUN      ] Parameters/TestRpc.TestConnectionKeepalive/SSL_UnixSocket
I20260928 02:45:39.778707  5814 acceptor_pool.cc:254] collecting diagnostics on the listening RPC socket unix:/tmp/dist-test-taskGfrhni/test-tmp/rpc-test-1fed9cc1a6c64a95bd382277ee8ec80e.sock every 8 connection(s)
I20260928 02:45:39.778720  5815 acceptor_pool.cc:254] collecting diagnostics on the listening RPC socket unix:/tmp/dist-test-taskGfrhni/test-tmp/rpc-test-1fed9cc1a6c64a95bd382277ee8ec80e.sock every 8 connection(s)
I20260928 02:45:39.779052  5695 rpc-test.cc:488] Connecting to unix:/tmp/dist-test-taskGfrhni/test-tmp/rpc-test-1fed9cc1a6c64a95bd382277ee8ec80e.sock
W20260928 02:45:40.258311  5827 connection.cc:196] Error closing socket: Network error: TlsSocket::Close: Broken pipe
[       OK ] Parameters/TestRpc.TestConnectionKeepalive/SSL_UnixSocket (1049 ms)
[ RUN      ] Parameters/TestRpc.TestClientConnectionMetrics/SSL_UnixSocket
I20260928 02:45:40.820096  5839 acceptor_pool.cc:254] collecting diagnostics on the listening RPC socket unix:/tmp/dist-test-taskGfrhni/test-tmp/rpc-test-ccfa621c4a074081a4e89891ea5bdb4e.sock every 8 connection(s)
I20260928 02:45:40.820125  5840 acceptor_pool.cc:254] collecting diagnostics on the listening RPC socket unix:/tmp/dist-test-taskGfrhni/test-tmp/rpc-test-ccfa621c4a074081a4e89891ea5bdb4e.sock every 8 connection(s)
I20260928 02:45:40.820505  5695 rpc-test.cc:569] Connecting to unix:/tmp/dist-test-taskGfrhni/test-tmp/rpc-test-ccfa621c4a074081a4e89891ea5bdb4e.sock
W20260928 02:45:51.515004  5836 connection.cc:196] Error closing socket: Network error: TlsSocket::Close: Broken pipe
[       OK ] Parameters/TestRpc.TestClientConnectionMetrics/SSL_UnixSocket (10711 ms)
[ RUN      ] Parameters/TestRpc.TestCredentialsPolicy/SSL_UnixSocket
I20260928 02:45:51.535691  5862 acceptor_pool.cc:254] collecting diagnostics on the listening RPC socket unix:/tmp/dist-test-taskGfrhni/test-tmp/rpc-test-aa5d0f3c9d4047d884c801bd026ebf6d.sock every 8 connection(s)
I20260928 02:45:51.535725  5863 acceptor_pool.cc:254] collecting diagnostics on the listening RPC socket unix:/tmp/dist-test-taskGfrhni/test-tmp/rpc-test-aa5d0f3c9d4047d884c801bd026ebf6d.sock every 8 connection(s)
I20260928 02:45:51.536015  5695 rpc-test.cc:700] Connecting to unix:/tmp/dist-test-taskGfrhni/test-tmp/rpc-test-aa5d0f3c9d4047d884c801bd026ebf6d.sock
W20260928 02:45:51.567775  5861 connection.cc:196] Error closing socket: Network error: TlsSocket::Close: Broken pipe
W20260928 02:45:51.573189  5861 connection.cc:196] Error closing socket: Network error: TlsSocket::Close: Broken pipe
[       OK ] Parameters/TestRpc.TestCredentialsPolicy/SSL_UnixSocket (57 ms)
[ RUN      ] Parameters/TestRpc.TestCallLongerThanKeepalive/SSL_UnixSocket
I20260928 02:45:51.583141  5887 acceptor_pool.cc:254] collecting diagnostics on the listening RPC socket unix:/tmp/dist-test-taskGfrhni/test-tmp/rpc-test-7edf35b213de4c479e07e3983da18684.sock every 8 connection(s)
I20260928 02:45:51.583189  5888 acceptor_pool.cc:254] collecting diagnostics on the listening RPC socket unix:/tmp/dist-test-taskGfrhni/test-tmp/rpc-test-7edf35b213de4c479e07e3983da18684.sock every 8 connection(s)
I20260928 02:45:51.612391  5891 rpc-test-base.h:222] got call: sleep_micros: 3000000 deferred: true
I20260928 02:45:54.613380  5891 rpcz_store.cc:275] Call kudu.rpc.GenericCalculatorService.Sleep from unix:<unnamed> (request call id 0) took 3001 ms. Trace:
I20260928 02:45:54.613502  5891 rpcz_store.cc:276] 0928 02:45:51.612296 (+     0us) service_pool.cc:170] Inserting onto call queue
0928 02:45:51.612364 (+    68us) service_pool.cc:227] Handling call
0928 02:45:54.613359 (+3000995us) inbound_call.cc:173] Queueing success response
Metrics: {}
W20260928 02:45:54.615396  5884 connection.cc:196] Error closing socket: Network error: TlsSocket::Close: Broken pipe
[       OK ] Parameters/TestRpc.TestCallLongerThanKeepalive/SSL_UnixSocket (3042 ms)
[ RUN      ] Parameters/TestRpc.TestRpcSidecar/SSL_UnixSocket
I20260928 02:45:54.637020  5912 acceptor_pool.cc:254] collecting diagnostics on the listening RPC socket unix:/tmp/dist-test-taskGfrhni/test-tmp/rpc-test-2180c5cb3b964d1594e3996e71f54237.sock every 8 connection(s)
I20260928 02:45:54.637203  5913 acceptor_pool.cc:254] collecting diagnostics on the listening RPC socket unix:/tmp/dist-test-taskGfrhni/test-tmp/rpc-test-2180c5cb3b964d1594e3996e71f54237.sock every 8 connection(s)
[       OK ] Parameters/TestRpc.TestRpcSidecar/SSL_UnixSocket (84 ms)
[ RUN      ] Parameters/TestRpc.TestRpcSidecarLimits/SSL_UnixSocket
I20260928 02:45:56.329936  5938 acceptor_pool.cc:254] collecting diagnostics on the listening RPC socket unix:/tmp/dist-test-taskGfrhni/test-tmp/rpc-test-d43625bd16424323880423c6c67242d8.sock every 8 connection(s)
I20260928 02:45:56.329931  5937 acceptor_pool.cc:254] collecting diagnostics on the listening RPC socket unix:/tmp/dist-test-taskGfrhni/test-tmp/rpc-test-d43625bd16424323880423c6c67242d8.sock every 8 connection(s)
W20260928 02:45:56.337991  5695 serialization.cc:72] Serialized kudu.rpc_test.PushStringsRequestPB (2147483654 bytes) is larger than the maximum configured RPC message size (52428800 bytes). Sending anyway, but peer may reject the data.
W20260928 02:45:56.342358  5934 connection.cc:535] server connection from unix:<unnamed> recv error: Network error: RPC frame had a length of 2147483714, but we only support messages up to 52428800 bytes long.
W20260928 02:45:56.342434  5934 connection.cc:158] shutting down server connection from unix:<unnamed> with pending inbound data: 4/2147483714 bytes received; last active 0 ns ago: status Network error: RPC frame had a length of 2147483714, but we only support messages up to 52428800 bytes long.
W20260928 02:45:56.342804  5950 connection.cc:196] Error closing socket: Network error: TlsSocket::Close: Broken pipe
I20260928 02:45:56.355863  5962 acceptor_pool.cc:254] collecting diagnostics on the listening RPC socket unix:/tmp/dist-test-taskGfrhni/test-tmp/rpc-test-d43625bd16424323880423c6c67242d8.sock every 8 connection(s)
I20260928 02:45:56.355887  5963 acceptor_pool.cc:254] collecting diagnostics on the listening RPC socket unix:/tmp/dist-test-taskGfrhni/test-tmp/rpc-test-d43625bd16424323880423c6c67242d8.sock every 8 connection(s)
W20260928 02:46:01.081048  5959 connection.cc:577] server connection from unix:<unnamed>: received bad data: 'Corruption: Invalid packet: message had a length of 2147483710, but we only support messages up to 2147483647 bytes
'
W20260928 02:46:01.081620  5975 connection.cc:196] Error closing socket: Network error: TlsSocket::Close: Broken pipe
[       OK ] Parameters/TestRpc.TestRpcSidecarLimits/SSL_UnixSocket (6382 ms)
[ RUN      ] Parameters/TestRpc.TestCallTimeoutDoesntAffectNegotiation/SSL_UnixSocket
I20260928 02:46:01.100672  5987 acceptor_pool.cc:254] collecting diagnostics on the listening RPC socket unix:/tmp/dist-test-taskGfrhni/test-tmp/rpc-test-50601b934ddc43d090d980116d4194ae.sock every 8 connection(s)
I20260928 02:46:01.100811  5988 acceptor_pool.cc:254] collecting diagnostics on the listening RPC socket unix:/tmp/dist-test-taskGfrhni/test-tmp/rpc-test-50601b934ddc43d090d980116d4194ae.sock every 8 connection(s)
W20260928 02:46:01.108548  5983 negotiation.cc:266] Injecting 500ms delay in negotiation
I20260928 02:46:01.158941  5695 rpc-test-base.h:595] status: Timed out: connection negotiation to unix:/tmp/dist-test-taskGfrhni/test-tmp/rpc-test-50601b934ddc43d090d980116d4194ae.sock for RPC Sleep timed out after 0.050s (ON_OUTBOUND_QUEUE), seconds elapsed: 0.0509167
[       OK ] Parameters/TestRpc.TestCallTimeoutDoesntAffectNegotiation/SSL_UnixSocket (531 ms)
[ RUN      ] Parameters/TestRpc.TestRpcHandlerLatencyMetric/SSL_UnixSocket
I20260928 02:46:01.639643  6012 acceptor_pool.cc:254] collecting diagnostics on the listening RPC socket unix:/tmp/dist-test-taskGfrhni/test-tmp/rpc-test-3dd37ade0f444edca55ce5ce11d2fc93.sock every 8 connection(s)
I20260928 02:46:01.639664  6013 acceptor_pool.cc:254] collecting diagnostics on the listening RPC socket unix:/tmp/dist-test-taskGfrhni/test-tmp/rpc-test-3dd37ade0f444edca55ce5ce11d2fc93.sock every 8 connection(s)
I20260928 02:46:01.705466  5695 rpc-test.cc:1236] Sleep() min lat: 20438
I20260928 02:46:01.705538  5695 rpc-test.cc:1237] Sleep() mean lat: 20438
I20260928 02:46:01.705567  5695 rpc-test.cc:1238] Sleep() max lat: 20438
I20260928 02:46:01.705581  5695 rpc-test.cc:1239] Sleep() #calls: 1
[       OK ] Parameters/TestRpc.TestRpcHandlerLatencyMetric/SSL_UnixSocket (91 ms)
[ RUN      ] Parameters/TestRpc.TimedOutOnResponseMetricServiceQueue/SSL_UnixSocket
I20260928 02:46:01.730074  6038 acceptor_pool.cc:254] collecting diagnostics on the listening RPC socket unix:/tmp/dist-test-taskGfrhni/test-tmp/rpc-test-cd43e77f9d104d0aafe9186d44cbef11.sock every 8 connection(s)
I20260928 02:46:01.730103  6039 acceptor_pool.cc:254] collecting diagnostics on the listening RPC socket unix:/tmp/dist-test-taskGfrhni/test-tmp/rpc-test-cd43e77f9d104d0aafe9186d44cbef11.sock every 8 connection(s)
W20260928 02:46:01.794039  6040 rpcz_store.cc:267] Call kudu.rpc_test.CalculatorService.Sleep from unix:<unnamed> (request call id 2) took 20 ms (client timeout 20 ms). Trace:
W20260928 02:46:01.794181  6040 rpcz_store.cc:269] 0928 02:46:01.773547 (+     0us) service_pool.cc:170] Inserting onto call queue
0928 02:46:01.793974 (+ 20427us) service_pool.cc:214] Skipping call since client already timed out
0928 02:46:01.794015 (+    41us) inbound_call.cc:173] Queueing failure response
Metrics: {}
W20260928 02:46:01.795083  6035 connection.cc:196] Error closing socket: Network error: TlsSocket::Close: Broken pipe
[       OK ] Parameters/TestRpc.TimedOutOnResponseMetricServiceQueue/SSL_UnixSocket (89 ms)
[ RUN      ] Parameters/TestRpc.RpcPendingConnectionsMetric/SSL_UnixSocket
I20260928 02:46:01.799511  6061 acceptor_pool.cc:254] collecting diagnostics on the listening RPC socket 0.0.0.0:40211 every 8 connection(s)
I20260928 02:46:01.799595  6062 acceptor_pool.cc:254] collecting diagnostics on the listening RPC socket 0.0.0.0:40211 every 8 connection(s)
W20260928 02:46:01.800747  6057 negotiation.cc:337] Failed RPC negotiation. Trace:
0928 02:46:01.800316 (+     0us) reactor.cc:625] Submitting negotiation task for server connection from 127.0.0.1:60104 (local address 127.0.0.1:40211)
0928 02:46:01.800448 (+   132us) server_negotiation.cc:206] Beginning negotiation
0928 02:46:01.800458 (+    10us) server_negotiation.cc:399] Waiting for connection header
0928 02:46:01.800546 (+    88us) negotiation.cc:327] Negotiation complete: Network error: Server connection negotiation failed: server connection from 127.0.0.1:60104: BlockingRecv error: recv got EOF from 127.0.0.1:60104 (error 108)
Metrics: {"server-negotiator.queue_time_us":51}
[       OK ] Parameters/TestRpc.RpcPendingConnectionsMetric/SSL_UnixSocket (15 ms)
[ RUN      ] Parameters/TestRpc.TestRpcContextClientDeadline/SSL_UnixSocket
I20260928 02:46:01.822532  6077 acceptor_pool.cc:254] collecting diagnostics on the listening RPC socket unix:/tmp/dist-test-taskGfrhni/test-tmp/rpc-test-771ab2ec22bf411a9963ea746d0d9fde.sock every 8 connection(s)
I20260928 02:46:01.822623  6078 acceptor_pool.cc:254] collecting diagnostics on the listening RPC socket unix:/tmp/dist-test-taskGfrhni/test-tmp/rpc-test-771ab2ec22bf411a9963ea746d0d9fde.sock every 8 connection(s)
W20260928 02:46:01.884953  6074 connection.cc:196] Error closing socket: Network error: TlsSocket::Close: Broken pipe
[       OK ] Parameters/TestRpc.TestRpcContextClientDeadline/SSL_UnixSocket (74 ms)
[ RUN      ] Parameters/TestRpc.TestApplicationFeatureFlagUnsupportedServer/SSL_UnixSocket
I20260928 02:46:01.916371  6103 acceptor_pool.cc:254] collecting diagnostics on the listening RPC socket unix:/tmp/dist-test-taskGfrhni/test-tmp/rpc-test-950e9dc491fd4f45a72859ac20cbf9ec.sock every 8 connection(s)
I20260928 02:46:01.916944  6102 acceptor_pool.cc:254] collecting diagnostics on the listening RPC socket unix:/tmp/dist-test-taskGfrhni/test-tmp/rpc-test-950e9dc491fd4f45a72859ac20cbf9ec.sock every 8 connection(s)
[       OK ] Parameters/TestRpc.TestApplicationFeatureFlagUnsupportedServer/SSL_UnixSocket (44 ms)
[ RUN      ] Parameters/TestRpc.TestCancellationAsync/SSL_UnixSocket
I20260928 02:46:01.942518  6127 acceptor_pool.cc:254] collecting diagnostics on the listening RPC socket unix:/tmp/dist-test-taskGfrhni/test-tmp/rpc-test-f6aa87a220094b6abd91f19657abcccf.sock every 8 connection(s)
I20260928 02:46:01.942538  6128 acceptor_pool.cc:254] collecting diagnostics on the listening RPC socket unix:/tmp/dist-test-taskGfrhni/test-tmp/rpc-test-f6aa87a220094b6abd91f19657abcccf.sock every 8 connection(s)
I20260928 02:46:01.942862  5695 rpc-test.cc:1716] Connecting to unix:/tmp/dist-test-taskGfrhni/test-tmp/rpc-test-f6aa87a220094b6abd91f19657abcccf.sock
I20260928 02:46:01.964576  5695 test_util.cc:268] Using random seed: 286196764
I20260928 02:46:01.990406  6131 rpc-test-base.h:240] got call: sleep_micros: 500 pattern: 4294967295 num_repetitions: 2097152 sidecar_idx: 0
I20260928 02:46:02.009043  6131 rpc-test-base.h:240] got call: sleep_micros: 500 pattern: 4294967295 num_repetitions: 2097152 sidecar_idx: 0
I20260928 02:46:02.028380  6131 rpc-test-base.h:240] got call: sleep_micros: 500 pattern: 4294967295 num_repetitions: 2097152 sidecar_idx: 0
I20260928 02:46:02.046550  6130 rpc-test-base.h:240] got call: sleep_micros: 500 pattern: 4294967295 num_repetitions: 2097152 sidecar_idx: 0
I20260928 02:46:02.064254  6131 rpc-test-base.h:240] got call: sleep_micros: 500 pattern: 4294967295 num_repetitions: 2097152 sidecar_idx: 0
I20260928 02:46:02.081575  6130 rpc-test-base.h:240] got call: sleep_micros: 500 pattern: 4294967295 num_repetitions: 2097152 sidecar_idx: 0
I20260928 02:46:02.099411  6131 rpc-test-base.h:240] got call: sleep_micros: 500 pattern: 4294967295 num_repetitions: 2097152 sidecar_idx: 0
W20260928 02:46:02.106947  6124 connection.cc:196] Error closing socket: Network error: TlsSocket::Close: Broken pipe
W20260928 02:46:02.117822  6124 connection.cc:441] server connection from unix:<unnamed> torn down before Call kudu.rpc.GenericCalculatorService.SleepWithSidecar from unix:<unnamed> (request call id 9) could send its response
[       OK ] Parameters/TestRpc.TestCancellationAsync/SSL_UnixSocket (188 ms)
[ RUN      ] Parameters/TestRpc.TestPerformanceBySocketType/SSL_UnixSocket
I20260928 02:46:02.152426  6152 acceptor_pool.cc:254] collecting diagnostics on the listening RPC socket unix:/tmp/dist-test-taskGfrhni/test-tmp/rpc-test-627471b822174305aacbb292dee29c3f.sock every 8 connection(s)
I20260928 02:46:02.152457  6153 acceptor_pool.cc:254] collecting diagnostics on the listening RPC socket unix:/tmp/dist-test-taskGfrhni/test-tmp/rpc-test-627471b822174305aacbb292dee29c3f.sock every 8 connection(s)
I20260928 02:46:02.152760  5695 rpc-test.cc:1846] Connecting to unix:/tmp/dist-test-taskGfrhni/test-tmp/rpc-test-627471b822174305aacbb292dee29c3f.sock
I20260928 02:46:03.921741  5695 rpc-test.cc:1859] Sending 1024MB via ssl-enabled unix socket: real 1.749s	user 2.105s	sys 0.995s
I20260928 02:46:05.792521  5695 rpc-test.cc:1859] Sending 1024MB via ssl-enabled unix socket: real 1.871s	user 2.337s	sys 0.937s
I20260928 02:46:07.528270  5695 rpc-test.cc:1859] Sending 1024MB via ssl-enabled unix socket: real 1.736s	user 2.039s	sys 1.034s
I20260928 02:46:09.346748  5695 rpc-test.cc:1859] Sending 1024MB via ssl-enabled unix socket: real 1.818s	user 2.265s	sys 0.946s
I20260928 02:46:11.463788  5695 rpc-test.cc:1859] Sending 1024MB via ssl-enabled unix socket: real 2.117s	user 2.606s	sys 1.089s
W20260928 02:46:11.464771  6149 connection.cc:196] Error closing socket: Network error: TlsSocket::Close: Broken pipe
[       OK ] Parameters/TestRpc.TestPerformanceBySocketType/SSL_UnixSocket (9346 ms)
[----------] 20 tests from Parameters/TestRpc (31851 ms total)

[----------] 1 test from Parameters/TestRpcSocketTxRxQueue
[ RUN      ] Parameters/TestRpcSocketTxRxQueue.AcceptorRxQueueSizeMetric/0
I20260928 02:46:11.468796  6177 acceptor_pool.cc:254] collecting diagnostics on the listening RPC socket 0.0.0.0:38237 every 1 connection(s)
I20260928 02:46:11.468815  6178 acceptor_pool.cc:254] collecting diagnostics on the listening RPC socket 0.0.0.0:38237 every 1 connection(s)
W20260928 02:46:11.469919  6173 negotiation.cc:337] Failed RPC negotiation. Trace:
0928 02:46:11.469595 (+     0us) reactor.cc:625] Submitting negotiation task for server connection from 127.0.0.1:49138 (local address 127.0.0.1:38237)
0928 02:46:11.469714 (+   119us) server_negotiation.cc:206] Beginning negotiation
0928 02:46:11.469719 (+     5us) server_negotiation.cc:399] Waiting for connection header
0928 02:46:11.469834 (+   115us) negotiation.cc:327] Negotiation complete: Network error: Server connection negotiation failed: server connection from 127.0.0.1:49138: BlockingRecv error: recv got EOF from 127.0.0.1:49138 (error 108)
Metrics: {"server-negotiator.queue_time_us":44}
[       OK ] Parameters/TestRpcSocketTxRxQueue.AcceptorRxQueueSizeMetric/0 (5 ms)
[----------] 1 test from Parameters/TestRpcSocketTxRxQueue (5 ms total)

[----------] Global test environment tear-down
[==========] 21 tests from 2 test suites ran. (31857 ms total)
[  PASSED  ] 20 tests.
[  FAILED  ] 1 test, listed below:
[  FAILED  ] Parameters/TestRpc.TestCallWithChainCertAndChainCA/SSL_UnixSocket, where GetParam() = (true, true)

 1 FAILED TEST