Diagnosed failure

AuthzProviders/TSAuthzITest.TestReadsAndWrites/Ranger: /data0/somelongdirectorytoavoidrpathissues/src/kudu/src/kudu/integration-tests/external_mini_cluster-itest-base.cc:66: Failure
Failed
Bad status: Timed out: Failed to start the Ranger service: process with PID 5474 is not yet bound to any port at the specified addresses; last attempt running lsof returned 'Not found: could not find pattern of a bound port in lsof output: p5474
f310
n127.0.0.1:59072->127.5.11.212:35955
f311
n127.0.0.1:59098->127.5.11.212:35955
f312
n127.0.0.1:59086->127.5.11.212:35955
f313
n127.0.0.1:59110->127.5.11.212:35955
f314
n127.0.0.1:59116->127.5.11.212:35955'
/data0/somelongdirectorytoavoidrpathissues/src/kudu/src/kudu/integration-tests/ts_authz-itest.cc:462: Failure
Expected: StartClusterWithOpts(std::move(opts)) doesn't generate new fatal failures in the current thread.
  Actual: it does.
I20260929 00:56:13.008585  5167 external_mini_cluster-itest-base.cc:80] Found fatal failure
I20260929 00:56:13.009992  5167 mini_ranger.cc:66] Stopping Ranger...
I20260929 00:56:13.030900  5167 mini_ranger.cc:68] Stopped Ranger
2026-09-29 00:56:13.031 UTC [5204] LOG:  received smart shutdown request
2026-09-29 00:56:13.034 UTC [5204] LOG:  background worker "logical replication launcher" (PID 5213) exited with exit code 1
2026-09-29 00:56:13.034 UTC [5208] LOG:  shutting down
2026-09-29 00:56:13.203 UTC [5204] LOG:  database system is shut down
2026-09-29T00:56:13Z chronyd exiting
I20260929 00:56:13.227072  5167 test_util.cc:175] -----------------------------------------------
I20260929 00:56:13.227221  5167 test_util.cc:176] Had fatal failures, leaving test files at /tmp/dist-test-taskeXDuD2/test-tmp/ts_authz-itest.0.AuthzProviders_TSAuthzITest.TestReadsAndWrites_Ranger.1790643240301354-5167-0

Full log

Note: This is test shard 1 of 2.
[==========] Running 3 tests from 2 test suites.
[----------] Global test environment set-up.
[----------] 2 tests from AuthzProviders/TSAuthzITest
[ RUN      ] AuthzProviders/TSAuthzITest.TestReadsAndWrites/Ranger
Loading random data
Initializing database '/tmp/dist-test-taskeXDuD2/test-tmp/ts_authz-itest.0.AuthzProviders_TSAuthzITest.TestReadsAndWrites_Ranger.1790643240301354-5167-0/krb5kdc/principal' for realm 'KRBTEST.COM',
master key name 'K/M@KRBTEST.COM'
Sep 29 00:54:00 dist-test-slave-w3ts krb5kdc[5174](info): setting up network...
krb5kdc: setsockopt(10,IPV6_V6ONLY,1) worked
Sep 29 00:54:00 dist-test-slave-w3ts krb5kdc[5174](info): set up 2 sockets
Sep 29 00:54:00 dist-test-slave-w3ts krb5kdc[5174](info): commencing operation
krb5kdc: starting...
WARNING: Logging before InitGoogleLogging() is written to STDERR
W20260929 00:54:01.350802  5167 mini_kdc.cc:121] Time spent starting KDC: real 0.965s	user 0.002s	sys 0.011s
WARNING: no policy specified for test-admin@KRBTEST.COM; defaulting to no policy
Authenticating as principal slave/admin@KRBTEST.COM with password.
Principal "test-admin@KRBTEST.COM" created.
WARNING: no policy specified for test-user@KRBTEST.COM; defaulting to no policy
Authenticating as principal slave/admin@KRBTEST.COM with password.
Principal "test-user@KRBTEST.COM" created.
WARNING: no policy specified for joe-interloper@KRBTEST.COM; defaulting to no policy
Authenticating as principal slave/admin@KRBTEST.COM with password.
Principal "joe-interloper@KRBTEST.COM" created.
Authenticating as principal slave/admin@KRBTEST.COM with password.
Entry for principal test-user with kvno 1, encryption type aes256-cts-hmac-sha1-96 added to keytab WRFILE:/tmp/dist-test-taskeXDuD2/test-tmp/ts_authz-itest.0.AuthzProviders_TSAuthzITest.TestReadsAndWrites_Ranger.1790643240301354-5167-0/krb5kdc/test-user.keytab.
Entry for principal test-user with kvno 1, encryption type aes128-cts-hmac-sha1-96 added to keytab WRFILE:/tmp/dist-test-taskeXDuD2/test-tmp/ts_authz-itest.0.AuthzProviders_TSAuthzITest.TestReadsAndWrites_Ranger.1790643240301354-5167-0/krb5kdc/test-user.keytab.
Sep 29 00:54:01 dist-test-slave-w3ts krb5kdc[5174](info): AS_REQ (2 etypes {17 16}) 127.0.0.1: ISSUE: authtime 1790643241, etypes {rep=17 tkt=17 ses=17}, test-admin@KRBTEST.COM for krbtgt/KRBTEST.COM@KRBTEST.COM
Password for test-admin@KRBTEST.COM: 
2026-09-29T00:54:01Z chronyd version 3.5 starting (+CMDMON +NTP +REFCLOCK +RTC -PRIVDROP -SCFILTER -SIGND +ASYNCDNS -SECHASH -IPV6 +DEBUG)
2026-09-29T00:54:01Z Disabled control of system clock
WARNING: no policy specified for rangeradmin/127.5.11.212@KRBTEST.COM; defaulting to no policy
Authenticating as principal test-admin/admin@KRBTEST.COM with password.
Principal "rangeradmin/127.5.11.212@KRBTEST.COM" created.
Authenticating as principal test-admin/admin@KRBTEST.COM with password.
Entry for principal rangeradmin/127.5.11.212@KRBTEST.COM with kvno 2, encryption type aes256-cts-hmac-sha1-96 added to keytab WRFILE:/tmp/dist-test-taskeXDuD2/test-tmp/ts_authz-itest.0.AuthzProviders_TSAuthzITest.TestReadsAndWrites_Ranger.1790643240301354-5167-0/krb5kdc/rangeradmin_127.5.11.212@KRBTEST.COM.keytab.
Entry for principal rangeradmin/127.5.11.212@KRBTEST.COM with kvno 2, encryption type aes128-cts-hmac-sha1-96 added to keytab WRFILE:/tmp/dist-test-taskeXDuD2/test-tmp/ts_authz-itest.0.AuthzProviders_TSAuthzITest.TestReadsAndWrites_Ranger.1790643240301354-5167-0/krb5kdc/rangeradmin_127.5.11.212@KRBTEST.COM.keytab.
WARNING: no policy specified for rangerlookup/127.5.11.212@KRBTEST.COM; defaulting to no policy
Authenticating as principal test-admin/admin@KRBTEST.COM with password.
Principal "rangerlookup/127.5.11.212@KRBTEST.COM" created.
Authenticating as principal test-admin/admin@KRBTEST.COM with password.
Entry for principal rangerlookup/127.5.11.212@KRBTEST.COM with kvno 2, encryption type aes256-cts-hmac-sha1-96 added to keytab WRFILE:/tmp/dist-test-taskeXDuD2/test-tmp/ts_authz-itest.0.AuthzProviders_TSAuthzITest.TestReadsAndWrites_Ranger.1790643240301354-5167-0/krb5kdc/rangerlookup_127.5.11.212@KRBTEST.COM.keytab.
Entry for principal rangerlookup/127.5.11.212@KRBTEST.COM with kvno 2, encryption type aes128-cts-hmac-sha1-96 added to keytab WRFILE:/tmp/dist-test-taskeXDuD2/test-tmp/ts_authz-itest.0.AuthzProviders_TSAuthzITest.TestReadsAndWrites_Ranger.1790643240301354-5167-0/krb5kdc/rangerlookup_127.5.11.212@KRBTEST.COM.keytab.
WARNING: no policy specified for HTTP/127.5.11.212@KRBTEST.COM; defaulting to no policy
Authenticating as principal test-admin/admin@KRBTEST.COM with password.
Principal "HTTP/127.5.11.212@KRBTEST.COM" created.
Authenticating as principal test-admin/admin@KRBTEST.COM with password.
Entry for principal HTTP/127.5.11.212@KRBTEST.COM with kvno 2, encryption type aes256-cts-hmac-sha1-96 added to keytab WRFILE:/tmp/dist-test-taskeXDuD2/test-tmp/ts_authz-itest.0.AuthzProviders_TSAuthzITest.TestReadsAndWrites_Ranger.1790643240301354-5167-0/krb5kdc/HTTP_127.5.11.212@KRBTEST.COM.keytab.
Entry for principal HTTP/127.5.11.212@KRBTEST.COM with kvno 2, encryption type aes128-cts-hmac-sha1-96 added to keytab WRFILE:/tmp/dist-test-taskeXDuD2/test-tmp/ts_authz-itest.0.AuthzProviders_TSAuthzITest.TestReadsAndWrites_Ranger.1790643240301354-5167-0/krb5kdc/HTTP_127.5.11.212@KRBTEST.COM.keytab.
I20260929 00:54:01.571727  5167 mini_postgres.cc:62] Running initdb...
The files belonging to this database system will be owned by user "slave".
This user must also own the server process.

The database cluster will be initialized with locale "C".
The default database encoding has accordingly been set to "SQL_ASCII".
The default text search configuration will be set to "english".

Data page checksums are disabled.

creating directory /tmp/dist-test-taskeXDuD2/test-tmp/ts_authz-itest.0.AuthzProviders_TSAuthzITest.TestReadsAndWrites_Ranger.1790643240301354-5167-0/minicluster-data/postgres ... ok
creating subdirectories ... ok
selecting dynamic shared memory implementation ... posix
selecting default max_connections ... 100
selecting default shared_buffers ... 128MB
selecting default time zone ... Etc/UTC
creating configuration files ... ok
running bootstrap script ... ok
performing post-bootstrap initialization ... ok
syncing data to disk ... ok

initdb: warning: enabling "trust" authentication for local connections
You can change this by editing pg_hba.conf or using the option -A, or
--auth-local and --auth-host, the next time you run initdb.

Success. You can now start the database server using:

    /tmp/dist-test-taskeXDuD2/build/asan/bin/postgres/pg_ctl -D /tmp/dist-test-taskeXDuD2/test-tmp/ts_authz-itest.0.AuthzProviders_TSAuthzITest.TestReadsAndWrites_Ranger.1790643240301354-5167-0/minicluster-data/postgres -l logfile start

2026-09-29 00:54:04.138 UTC [5204] LOG:  starting PostgreSQL 12.2 on x86_64-pc-linux-gnu, compiled by cc (GCC) 8.3.1 20190311 (Red Hat 8.3.1-3), 64-bit
2026-09-29 00:54:04.138 UTC [5204] LOG:  listening on IPv4 address "127.5.11.212", port 35955
2026-09-29 00:54:04.141 UTC [5204] LOG:  listening on Unix socket "/tmp/.s.PGSQL.35955"
2026-09-29 00:54:04.162 UTC [5207] LOG:  database system was shut down at 2026-09-29 00:54:02 UTC
2026-09-29 00:54:04.165 UTC [5204] LOG:  database system is ready to accept connections
I20260929 00:54:05.049461  5167 mini_postgres.cc:96] Postgres bound to 35955
2026-09-29 00:54:05.059 UTC [5215] FATAL:  database "slave" does not exist
127.5.11.212:35955 - accepting connections
I20260929 00:54:05.059770  5167 mini_ranger.cc:161] Starting Ranger...
I20260929 00:54:05.077450  5167 mini_ranger.cc:84] Created miniranger Postgres user
I20260929 00:54:05.580406  5167 mini_ranger.cc:87] Created ranger Postgres database
I20260929 00:54:05.580540  5167 mini_ranger.cc:178] Starting Ranger out of /tmp/dist-test-taskeXDuD2/test-tmp/ts_authz-itest.0.AuthzProviders_TSAuthzITest.TestReadsAndWrites_Ranger.1790643240301354-5167-0/minicluster-data/ranger-admin
2026-09-29 00:54:05,863  [I] DB FLAVOR :POSTGRES
2026-09-29 00:54:05,863  [I] --------- Verifying Ranger DB connection ---------
2026-09-29 00:54:05,863  [I] Checking connection..
2026-09-29 00:54:05,864  [JISQL] /usr/lib/jvm/java-1.8.0-openjdk-amd64/bin/java  -cp /tmp/dist-test-taskeXDuD2/build/asan/bin/postgresql.jar:/tmp/dist-test-taskeXDuD2/thirdparty/src/ranger-2.1.0-admin/jisql/lib/* org.apache.util.sql.Jisql -driver postgresql -cstring jdbc:postgresql://127.5.11.212:35955/ranger -u miniranger -p '********' -noheader -trim -c \;  -query "select 1;"
2026-09-29 00:54:06,124  [I] Checking connection passed.
2026-09-29 00:54:06,124  [I] --------- Verifying version history table ---------
2026-09-29 00:54:06,124  [JISQL] /usr/lib/jvm/java-1.8.0-openjdk-amd64/bin/java  -cp /tmp/dist-test-taskeXDuD2/build/asan/bin/postgresql.jar:/tmp/dist-test-taskeXDuD2/thirdparty/src/ranger-2.1.0-admin/jisql/lib/* org.apache.util.sql.Jisql -driver postgresql -cstring jdbc:postgresql://127.5.11.212:35955/ranger -u miniranger -p '********' -noheader -trim -c \;  -query "select * from (select table_name from information_schema.tables where table_catalog='ranger' and table_name = 'x_db_version_h') as temp;"
2026-09-29 00:54:06,366  [I] Table x_db_version_h does not exist in database ranger
2026-09-29 00:54:06,367  [JISQL] /usr/lib/jvm/java-1.8.0-openjdk-amd64/bin/java  -cp /tmp/dist-test-taskeXDuD2/build/asan/bin/postgresql.jar:/tmp/dist-test-taskeXDuD2/thirdparty/src/ranger-2.1.0-admin/jisql/lib/* org.apache.util.sql.Jisql -driver postgresql -cstring jdbc:postgresql://127.5.11.212:35955/ranger -u miniranger -p '********' -noheader -trim -c \;  -query "select * from (select table_name from information_schema.tables where table_catalog='ranger' and table_name = 'x_db_version_h') as temp;"
2026-09-29 00:54:06,617  [I] Table x_db_version_h does not exist in database ranger
2026-09-29 00:54:06,617  [I] Importing x_db_version_h table schema to database ranger from file: create_dbversion_catalog.sql
2026-09-29 00:54:06,618  [JISQL] /usr/lib/jvm/java-1.8.0-openjdk-amd64/bin/java  -cp /tmp/dist-test-taskeXDuD2/build/asan/bin/postgresql.jar:/tmp/dist-test-taskeXDuD2/thirdparty/src/ranger-2.1.0-admin/jisql/lib/* org.apache.util.sql.Jisql -driver postgresql -cstring jdbc:postgresql://127.5.11.212:35955/ranger -u miniranger -p '********' -noheader -trim -c \; -input /tmp/dist-test-taskeXDuD2/thirdparty/src/ranger-2.1.0-admin/db/postgres/create_dbversion_catalog.sql 
2026-09-29 00:54:06.850 UTC [5279] WARNING:  there is no transaction in progress
2026-09-29 00:54:06,856  [I] create_dbversion_catalog.sql file imported successfully
2026-09-29 00:54:06,857  [JISQL] /usr/lib/jvm/java-1.8.0-openjdk-amd64/bin/java  -cp /tmp/dist-test-taskeXDuD2/build/asan/bin/postgresql.jar:/tmp/dist-test-taskeXDuD2/thirdparty/src/ranger-2.1.0-admin/jisql/lib/* org.apache.util.sql.Jisql -driver postgresql -cstring jdbc:postgresql://127.5.11.212:35955/ranger -u miniranger -p '********' -noheader -trim -c \;  -query "select * from (select table_name from information_schema.tables where table_catalog='ranger' and table_name = 'x_db_version_h') as temp;"
2026-09-29 00:54:07,088  [I] Table x_db_version_h already exists in database 'ranger'
2026-09-29 00:54:07,089  [I] --------- Importing Ranger Core DB Schema ---------
2026-09-29 00:54:07,089  [JISQL] /usr/lib/jvm/java-1.8.0-openjdk-amd64/bin/java  -cp /tmp/dist-test-taskeXDuD2/build/asan/bin/postgresql.jar:/tmp/dist-test-taskeXDuD2/thirdparty/src/ranger-2.1.0-admin/jisql/lib/* org.apache.util.sql.Jisql -driver postgresql -cstring jdbc:postgresql://127.5.11.212:35955/ranger -u miniranger -p '********' -noheader -trim -c \;  -query "select version from x_db_version_h where version = 'CORE_DB_SCHEMA' and active = 'Y';"
2026-09-29 00:54:07,343  [JISQL] /usr/lib/jvm/java-1.8.0-openjdk-amd64/bin/java  -cp /tmp/dist-test-taskeXDuD2/build/asan/bin/postgresql.jar:/tmp/dist-test-taskeXDuD2/thirdparty/src/ranger-2.1.0-admin/jisql/lib/* org.apache.util.sql.Jisql -driver postgresql -cstring jdbc:postgresql://127.5.11.212:35955/ranger -u miniranger -p '********' -noheader -trim -c \;  -query "select version from x_db_version_h where version = 'CORE_DB_SCHEMA' and active = 'N';"
2026-09-29 00:54:07,587  [JISQL] /usr/lib/jvm/java-1.8.0-openjdk-amd64/bin/java  -cp /tmp/dist-test-taskeXDuD2/build/asan/bin/postgresql.jar:/tmp/dist-test-taskeXDuD2/thirdparty/src/ranger-2.1.0-admin/jisql/lib/* org.apache.util.sql.Jisql -driver postgresql -cstring jdbc:postgresql://127.5.11.212:35955/ranger -u miniranger -p '********' -noheader -trim -c \;  -query "insert into x_db_version_h (version, inst_at, inst_by, updated_at, updated_by,active) values ('CORE_DB_SCHEMA', current_timestamp, 'Ranger 2.1.0', current_timestamp, 'dist-test-slave-w3ts.c.gcp-upstream.internal','N') ;"
2026-09-29 00:54:07,825  [JISQL] /usr/lib/jvm/java-1.8.0-openjdk-amd64/bin/java  -cp /tmp/dist-test-taskeXDuD2/build/asan/bin/postgresql.jar:/tmp/dist-test-taskeXDuD2/thirdparty/src/ranger-2.1.0-admin/jisql/lib/* org.apache.util.sql.Jisql -driver postgresql -cstring jdbc:postgresql://127.5.11.212:35955/ranger -u miniranger -p '********' -noheader -trim -c \;  -query "select * from (select table_name from information_schema.tables where table_catalog='ranger' and table_name = 'x_portal_user') as temp;"
2026-09-29 00:54:08,081  [I] Table x_portal_user does not exist in database ranger
2026-09-29 00:54:08,081  [JISQL] /usr/lib/jvm/java-1.8.0-openjdk-amd64/bin/java  -cp /tmp/dist-test-taskeXDuD2/build/asan/bin/postgresql.jar:/tmp/dist-test-taskeXDuD2/thirdparty/src/ranger-2.1.0-admin/jisql/lib/* org.apache.util.sql.Jisql -driver postgresql -cstring jdbc:postgresql://127.5.11.212:35955/ranger -u miniranger -p '********' -noheader -trim -c \;  -query "select * from (select table_name from information_schema.tables where table_catalog='ranger' and table_name = 'x_policy_ref_group') as temp;"
2026-09-29 00:54:08,314  [I] Table x_policy_ref_group does not exist in database ranger
2026-09-29 00:54:08,314  [JISQL] /usr/lib/jvm/java-1.8.0-openjdk-amd64/bin/java  -cp /tmp/dist-test-taskeXDuD2/build/asan/bin/postgresql.jar:/tmp/dist-test-taskeXDuD2/thirdparty/src/ranger-2.1.0-admin/jisql/lib/* org.apache.util.sql.Jisql -driver postgresql -cstring jdbc:postgresql://127.5.11.212:35955/ranger -u miniranger -p '********' -noheader -trim -c \;  -query "select version from x_db_version_h where version = 'DB_PATCHES' and active = 'Y';"
2026-09-29 00:54:08,551  [JISQL] /usr/lib/jvm/java-1.8.0-openjdk-amd64/bin/java  -cp /tmp/dist-test-taskeXDuD2/build/asan/bin/postgresql.jar:/tmp/dist-test-taskeXDuD2/thirdparty/src/ranger-2.1.0-admin/jisql/lib/* org.apache.util.sql.Jisql -driver postgresql -cstring jdbc:postgresql://127.5.11.212:35955/ranger -u miniranger -p '********' -noheader -trim -c \;  -query "select version from x_db_version_h where version = 'JAVA_PATCHES' and active = 'Y';"
2026-09-29 00:54:08,802  [I] Importing DB schema to database ranger from file: ranger_core_db_postgres.sql
2026-09-29 00:54:08,802  [JISQL] /usr/lib/jvm/java-1.8.0-openjdk-amd64/bin/java  -cp /tmp/dist-test-taskeXDuD2/build/asan/bin/postgresql.jar:/tmp/dist-test-taskeXDuD2/thirdparty/src/ranger-2.1.0-admin/jisql/lib/* org.apache.util.sql.Jisql -driver postgresql -cstring jdbc:postgresql://127.5.11.212:35955/ranger -u miniranger -p '********' -noheader -trim -c \; -input /tmp/dist-test-taskeXDuD2/thirdparty/src/ranger-2.1.0-admin/db/postgres/optimized/current/ranger_core_db_postgres.sql 
2026-09-29 00:54:09.774 UTC [5387] WARNING:  there is no transaction in progress
2026-09-29 00:54:09.790 UTC [5387] WARNING:  there is no transaction in progress
2026-09-29 00:54:09.806 UTC [5387] WARNING:  there is no transaction in progress
2026-09-29 00:54:09.821 UTC [5387] WARNING:  there is no transaction in progress
2026-09-29 00:54:09.841 UTC [5387] WARNING:  there is no transaction in progress
2026-09-29 00:54:09.862 UTC [5387] WARNING:  there is no transaction in progress
2026-09-29 00:54:09.920 UTC [5387] WARNING:  there is no transaction in progress
2026-09-29 00:54:09.927 UTC [5387] WARNING:  there is no transaction in progress
2026-09-29 00:54:09.941 UTC [5387] WARNING:  there is no transaction in progress
2026-09-29 00:54:09.951 UTC [5387] WARNING:  there is no transaction in progress
2026-09-29 00:54:09.961 UTC [5387] WARNING:  there is no transaction in progress
2026-09-29 00:54:09.975 UTC [5387] WARNING:  there is no transaction in progress
2026-09-29 00:54:09.984 UTC [5387] WARNING:  there is no transaction in progress
2026-09-29 00:54:09.990 UTC [5387] WARNING:  there is no transaction in progress
2026-09-29 00:54:09.997 UTC [5387] WARNING:  there is no transaction in progress
2026-09-29 00:54:10.004 UTC [5387] WARNING:  there is no transaction in progress
2026-09-29 00:54:10,664  [I] ranger_core_db_postgres.sql file imported successfully
2026-09-29 00:54:10,664  [JISQL] /usr/lib/jvm/java-1.8.0-openjdk-amd64/bin/java  -cp /tmp/dist-test-taskeXDuD2/build/asan/bin/postgresql.jar:/tmp/dist-test-taskeXDuD2/thirdparty/src/ranger-2.1.0-admin/jisql/lib/* org.apache.util.sql.Jisql -driver postgresql -cstring jdbc:postgresql://127.5.11.212:35955/ranger -u miniranger -p '********' -noheader -trim -c \;  -query "update x_db_version_h set inst_by='Ranger 2.1.0' where active='Y' and updated_by='localhost';"
2026-09-29 00:54:10,910  [I] Patches status entries updated from base ranger version to current installed ranger version:Ranger 2.1.0
2026-09-29 00:54:10,910  [JISQL] /usr/lib/jvm/java-1.8.0-openjdk-amd64/bin/java  -cp /tmp/dist-test-taskeXDuD2/build/asan/bin/postgresql.jar:/tmp/dist-test-taskeXDuD2/thirdparty/src/ranger-2.1.0-admin/jisql/lib/* org.apache.util.sql.Jisql -driver postgresql -cstring jdbc:postgresql://127.5.11.212:35955/ranger -u miniranger -p '********' -noheader -trim -c \;  -query "select * from (select table_name from information_schema.tables where table_catalog='ranger' and table_name = 'x_portal_user') as temp;"
2026-09-29 00:54:11,171  [I] Table x_portal_user already exists in database 'ranger'
2026-09-29 00:54:11,171  [JISQL] /usr/lib/jvm/java-1.8.0-openjdk-amd64/bin/java  -cp /tmp/dist-test-taskeXDuD2/build/asan/bin/postgresql.jar:/tmp/dist-test-taskeXDuD2/thirdparty/src/ranger-2.1.0-admin/jisql/lib/* org.apache.util.sql.Jisql -driver postgresql -cstring jdbc:postgresql://127.5.11.212:35955/ranger -u miniranger -p '********' -noheader -trim -c \;  -query "select * from (select table_name from information_schema.tables where table_catalog='ranger' and table_name = 'x_policy_ref_group') as temp;"
2026-09-29 00:54:11,429  [I] Table x_policy_ref_group already exists in database 'ranger'
2026-09-29 00:54:11,429  [JISQL] /usr/lib/jvm/java-1.8.0-openjdk-amd64/bin/java  -cp /tmp/dist-test-taskeXDuD2/build/asan/bin/postgresql.jar:/tmp/dist-test-taskeXDuD2/thirdparty/src/ranger-2.1.0-admin/jisql/lib/* org.apache.util.sql.Jisql -driver postgresql -cstring jdbc:postgresql://127.5.11.212:35955/ranger -u miniranger -p '********' -noheader -trim -c \;  -query "select version from x_db_version_h where version = 'DB_PATCHES' and active = 'Y';"
2026-09-29 00:54:11,676  [JISQL] /usr/lib/jvm/java-1.8.0-openjdk-amd64/bin/java  -cp /tmp/dist-test-taskeXDuD2/build/asan/bin/postgresql.jar:/tmp/dist-test-taskeXDuD2/thirdparty/src/ranger-2.1.0-admin/jisql/lib/* org.apache.util.sql.Jisql -driver postgresql -cstring jdbc:postgresql://127.5.11.212:35955/ranger -u miniranger -p '********' -noheader -trim -c \;  -query "select version from x_db_version_h where version = 'JAVA_PATCHES' and active = 'Y';"
2026-09-29 00:54:11,907  [JISQL] /usr/lib/jvm/java-1.8.0-openjdk-amd64/bin/java  -cp /tmp/dist-test-taskeXDuD2/build/asan/bin/postgresql.jar:/tmp/dist-test-taskeXDuD2/thirdparty/src/ranger-2.1.0-admin/jisql/lib/* org.apache.util.sql.Jisql -driver postgresql -cstring jdbc:postgresql://127.5.11.212:35955/ranger -u miniranger -p '********' -noheader -trim -c \;  -query "update x_db_version_h set active='Y' where version='CORE_DB_SCHEMA' and active='N' and updated_by='dist-test-slave-w3ts.c.gcp-upstream.internal';"
2026-09-29 00:54:12,155  [I] CORE_DB_SCHEMA import status has been updated
2026-09-29 00:54:12,155  [JISQL] /usr/lib/jvm/java-1.8.0-openjdk-amd64/bin/java  -cp /tmp/dist-test-taskeXDuD2/build/asan/bin/postgresql.jar:/tmp/dist-test-taskeXDuD2/thirdparty/src/ranger-2.1.0-admin/jisql/lib/* org.apache.util.sql.Jisql -driver postgresql -cstring jdbc:postgresql://127.5.11.212:35955/ranger -u miniranger -p '********' -noheader -trim -c \;  -query "select version from x_db_version_h where version = 'DB_PATCHES' and inst_by = 'Ranger 2.1.0' and active = 'Y';"
2026-09-29 00:54:12,397  [I] DB_PATCHES have already been applied
I20260929 00:54:12.402779  5167 mini_ranger.cc:191] Using Ranger class path: /tmp/dist-test-taskeXDuD2/test-tmp/ts_authz-itest.0.AuthzProviders_TSAuthzITest.TestReadsAndWrites_Ranger.1790643240301354-5167-0/minicluster-data/ranger-admin:/tmp/dist-test-taskeXDuD2/thirdparty/src/ranger-2.1.0-admin/ews/lib/*:/usr/lib/jvm/java-1.8.0-openjdk-amd64/lib/*:/tmp/dist-test-taskeXDuD2/thirdparty/src/hadoop-3.2.0/*:/tmp/dist-test-taskeXDuD2/build/asan/bin/postgresql.jar:/tmp/dist-test-taskeXDuD2/thirdparty/src/ranger-2.1.0-admin/ews/webapp
I20260929 00:54:12.402875  5167 mini_ranger.cc:193] Using host: 127.5.11.212
I20260929 00:54:12.410451  5167 mini_ranger.cc:227] Ranger admin URL: http://127.5.11.212:53255
Sep 29, 2026 12:54:12 AM org.apache.ranger.server.tomcat.EmbeddedServer getKeyManagers
WARNING: Config 'ranger.keystore.file' or 'ranger.service.https.attrib.keystore.file' is not found or contains blank value
Sep 29, 2026 12:54:12 AM org.apache.ranger.server.tomcat.EmbeddedServer getTrustManagers
WARNING: Config 'ranger.truststore.file' is not found or contains blank value!
Sep 29, 2026 12:54:12 AM org.apache.ranger.server.tomcat.EmbeddedServer start
INFO: Deriving webapp folder from catalina.base property. folder=/tmp/dist-test-taskeXDuD2/test-tmp/ts_authz-itest.0.AuthzProviders_TSAuthzITest.TestReadsAndWrites_Ranger.1790643240301354-5167-0/minicluster-data/ranger-admin/ews/webapp
Sep 29, 2026 12:54:12 AM org.apache.ranger.server.tomcat.EmbeddedServer start
INFO: Webapp file =/tmp/dist-test-taskeXDuD2/test-tmp/ts_authz-itest.0.AuthzProviders_TSAuthzITest.TestReadsAndWrites_Ranger.1790643240301354-5167-0/minicluster-data/ranger-admin/ews/webapp, webAppName = /
Sep 29, 2026 12:54:12 AM org.apache.ranger.server.tomcat.EmbeddedServer start
INFO: Adding webapp [/] = path [/tmp/dist-test-taskeXDuD2/test-tmp/ts_authz-itest.0.AuthzProviders_TSAuthzITest.TestReadsAndWrites_Ranger.1790643240301354-5167-0/minicluster-data/ranger-admin/ews/webapp] .....
Sep 29, 2026 12:54:13 AM org.apache.ranger.server.tomcat.EmbeddedServer start
INFO: Finished init of webapp [/] = path [/tmp/dist-test-taskeXDuD2/test-tmp/ts_authz-itest.0.AuthzProviders_TSAuthzITest.TestReadsAndWrites_Ranger.1790643240301354-5167-0/minicluster-data/ranger-admin/ews/webapp].
Sep 29, 2026 12:54:13 AM org.apache.ranger.server.tomcat.EmbeddedServer startServer
INFO: Server Name : miniranger
Sep 29, 2026 12:54:34 AM com.sun.jersey.api.core.PackagesResourceConfig init
INFO: Scanning for root resource and provider classes in the packages:
  org.apache.ranger.rest
  org.apache.ranger.common
  xa.rest
Sep 29, 2026 12:54:34 AM com.sun.jersey.api.core.ScanningResourceConfig logClasses
INFO: Root resource classes found:
  class org.apache.ranger.rest.AssetREST
  class org.apache.ranger.rest.XUserREST
  class org.apache.ranger.rest.TagREST
  class org.apache.ranger.rest.ServiceREST
  class org.apache.ranger.rest.UserREST
  class org.apache.ranger.rest.PublicAPIs
  class org.apache.ranger.rest.XKeyREST
  class org.apache.ranger.rest.RoleREST
  class org.apache.ranger.rest.SecurityZoneREST
  class org.apache.ranger.rest.XAuditREST
  class org.apache.ranger.rest.MetricsREST
  class org.apache.ranger.rest.PublicAPIsv2
Sep 29, 2026 12:54:34 AM com.sun.jersey.api.core.ScanningResourceConfig logClasses
INFO: Provider classes found:
  class org.apache.ranger.common.RangerJAXBContextResolver
Sep 29, 2026 12:54:34 AM com.sun.jersey.spi.spring.container.servlet.SpringServlet getContext
INFO: Using default applicationContext
Sep 29, 2026 12:54:34 AM com.sun.jersey.spi.spring.container.SpringComponentProviderFactory registerSpringBeans
INFO: Registering Spring bean, assetREST, of type org.apache.ranger.rest.AssetREST as a root resource class
Sep 29, 2026 12:54:34 AM com.sun.jersey.spi.spring.container.SpringComponentProviderFactory registerSpringBeans
INFO: Registering Spring bean, metricsREST, of type org.apache.ranger.rest.MetricsREST as a root resource class
Sep 29, 2026 12:54:34 AM com.sun.jersey.spi.spring.container.SpringComponentProviderFactory registerSpringBeans
INFO: Registering Spring bean, publicAPIs, of type org.apache.ranger.rest.PublicAPIs as a root resource class
Sep 29, 2026 12:54:34 AM com.sun.jersey.spi.spring.container.SpringComponentProviderFactory registerSpringBeans
INFO: Registering Spring bean, publicAPIsv2, of type org.apache.ranger.rest.PublicAPIsv2 as a root resource class
Sep 29, 2026 12:54:34 AM com.sun.jersey.spi.spring.container.SpringComponentProviderFactory registerSpringBeans
INFO: Registering Spring bean, roleREST, of type org.apache.ranger.rest.RoleREST as a root resource class
Sep 29, 2026 12:54:34 AM com.sun.jersey.spi.spring.container.SpringComponentProviderFactory registerSpringBeans
INFO: Registering Spring bean, securityZoneREST, of type org.apache.ranger.rest.SecurityZoneREST as a root resource class
Sep 29, 2026 12:54:34 AM com.sun.jersey.spi.spring.container.SpringComponentProviderFactory registerSpringBeans
INFO: Registering Spring bean, serviceREST, of type org.apache.ranger.rest.ServiceREST as a root resource class
Sep 29, 2026 12:54:34 AM com.sun.jersey.spi.spring.container.SpringComponentProviderFactory registerSpringBeans
INFO: Registering Spring bean, tagREST, of type org.apache.ranger.rest.TagREST as a root resource class
Sep 29, 2026 12:54:34 AM com.sun.jersey.spi.spring.container.SpringComponentProviderFactory registerSpringBeans
INFO: Registering Spring bean, userREST, of type org.apache.ranger.rest.UserREST as a root resource class
Sep 29, 2026 12:54:34 AM com.sun.jersey.spi.spring.container.SpringComponentProviderFactory registerSpringBeans
INFO: Registering Spring bean, XAuditREST, of type org.apache.ranger.rest.XAuditREST as a root resource class
Sep 29, 2026 12:54:34 AM com.sun.jersey.spi.spring.container.SpringComponentProviderFactory registerSpringBeans
INFO: Registering Spring bean, XKeyREST, of type org.apache.ranger.rest.XKeyREST as a root resource class
Sep 29, 2026 12:54:34 AM com.sun.jersey.spi.spring.container.SpringComponentProviderFactory registerSpringBeans
INFO: Registering Spring bean, XUserREST, of type org.apache.ranger.rest.XUserREST as a root resource class
Sep 29, 2026 12:54:34 AM com.sun.jersey.server.impl.application.WebApplicationImpl _initiate
INFO: Initiating Jersey application, version 'Jersey: 1.19.3 10/24/2016 03:58 PM'
Sep 29, 2026 12:54:35 AM com.sun.jersey.spi.inject.Errors processErrorMessages
WARNING: The following warnings have been detected with resource and/or provider classes:
  WARNING: A HTTP GET method, public void org.apache.ranger.rest.ServiceREST.getPoliciesInExcel(javax.servlet.http.HttpServletRequest,javax.servlet.http.HttpServletResponse), MUST return a non-void type.
  WARNING: A HTTP GET method, public void org.apache.ranger.rest.ServiceREST.getPoliciesInJson(javax.servlet.http.HttpServletRequest,javax.servlet.http.HttpServletResponse,java.lang.Boolean), MUST return a non-void type.
  WARNING: A HTTP GET method, public void org.apache.ranger.rest.ServiceREST.getPoliciesInCsv(javax.servlet.http.HttpServletRequest,javax.servlet.http.HttpServletResponse) throws java.io.IOException, MUST return a non-void type.
I20260929 00:56:13.006211  5167 mini_ranger.cc:160] Time spent starting Ranger: real 127.946s	user 0.054s	sys 0.293s
/data0/somelongdirectorytoavoidrpathissues/src/kudu/src/kudu/integration-tests/external_mini_cluster-itest-base.cc:66: Failure
Failed
Bad status: Timed out: Failed to start the Ranger service: process with PID 5474 is not yet bound to any port at the specified addresses; last attempt running lsof returned 'Not found: could not find pattern of a bound port in lsof output: p5474
f310
n127.0.0.1:59072->127.5.11.212:35955
f311
n127.0.0.1:59098->127.5.11.212:35955
f312
n127.0.0.1:59086->127.5.11.212:35955
f313
n127.0.0.1:59110->127.5.11.212:35955
f314
n127.0.0.1:59116->127.5.11.212:35955'
/data0/somelongdirectorytoavoidrpathissues/src/kudu/src/kudu/integration-tests/ts_authz-itest.cc:462: Failure
Expected: StartClusterWithOpts(std::move(opts)) doesn't generate new fatal failures in the current thread.
  Actual: it does.
I20260929 00:56:13.008585  5167 external_mini_cluster-itest-base.cc:80] Found fatal failure
I20260929 00:56:13.009992  5167 mini_ranger.cc:66] Stopping Ranger...
I20260929 00:56:13.030900  5167 mini_ranger.cc:68] Stopped Ranger
2026-09-29 00:56:13.031 UTC [5204] LOG:  received smart shutdown request
2026-09-29 00:56:13.034 UTC [5204] LOG:  background worker "logical replication launcher" (PID 5213) exited with exit code 1
2026-09-29 00:56:13.034 UTC [5208] LOG:  shutting down
2026-09-29 00:56:13.203 UTC [5204] LOG:  database system is shut down
2026-09-29T00:56:13Z chronyd exiting
I20260929 00:56:13.227072  5167 test_util.cc:175] -----------------------------------------------
I20260929 00:56:13.227221  5167 test_util.cc:176] Had fatal failures, leaving test files at /tmp/dist-test-taskeXDuD2/test-tmp/ts_authz-itest.0.AuthzProviders_TSAuthzITest.TestReadsAndWrites_Ranger.1790643240301354-5167-0
[  FAILED  ] AuthzProviders/TSAuthzITest.TestReadsAndWrites/Ranger, where GetParam() = 0 (132855 ms)
[ RUN      ] AuthzProviders/TSAuthzITest.TableScanCLI/Ranger
Loading random data
Initializing database '/tmp/dist-test-taskeXDuD2/test-tmp/ts_authz-itest.0.AuthzProviders_TSAuthzITest.TableScanCLI_Ranger.1790643240301354-5167-0/krb5kdc/principal' for realm 'KRBTEST.COM',
master key name 'K/M@KRBTEST.COM'
Sep 29 00:56:13 dist-test-slave-w3ts krb5kdc[5599](info): setting up network...
krb5kdc: setsockopt(10,IPV6_V6ONLY,1) worked
Sep 29 00:56:13 dist-test-slave-w3ts krb5kdc[5599](info): set up 2 sockets
Sep 29 00:56:13 dist-test-slave-w3ts krb5kdc[5599](info): commencing operation
krb5kdc: starting...
W20260929 00:56:14.188823  5167 mini_kdc.cc:121] Time spent starting KDC: real 0.957s	user 0.002s	sys 0.012s
WARNING: no policy specified for test-admin@KRBTEST.COM; defaulting to no policy
Authenticating as principal slave/admin@KRBTEST.COM with password.
Principal "test-admin@KRBTEST.COM" created.
WARNING: no policy specified for test-user@KRBTEST.COM; defaulting to no policy
Authenticating as principal slave/admin@KRBTEST.COM with password.
Principal "test-user@KRBTEST.COM" created.
WARNING: no policy specified for joe-interloper@KRBTEST.COM; defaulting to no policy
Authenticating as principal slave/admin@KRBTEST.COM with password.
Principal "joe-interloper@KRBTEST.COM" created.
Authenticating as principal slave/admin@KRBTEST.COM with password.
Entry for principal test-user with kvno 1, encryption type aes256-cts-hmac-sha1-96 added to keytab WRFILE:/tmp/dist-test-taskeXDuD2/test-tmp/ts_authz-itest.0.AuthzProviders_TSAuthzITest.TableScanCLI_Ranger.1790643240301354-5167-0/krb5kdc/test-user.keytab.
Entry for principal test-user with kvno 1, encryption type aes128-cts-hmac-sha1-96 added to keytab WRFILE:/tmp/dist-test-taskeXDuD2/test-tmp/ts_authz-itest.0.AuthzProviders_TSAuthzITest.TableScanCLI_Ranger.1790643240301354-5167-0/krb5kdc/test-user.keytab.
Sep 29 00:56:14 dist-test-slave-w3ts krb5kdc[5599](info): AS_REQ (2 etypes {17 16}) 127.0.0.1: ISSUE: authtime 1790643374, etypes {rep=17 tkt=17 ses=17}, test-admin@KRBTEST.COM for krbtgt/KRBTEST.COM@KRBTEST.COM
Password for test-admin@KRBTEST.COM: 
2026-09-29T00:56:14Z chronyd version 3.5 starting (+CMDMON +NTP +REFCLOCK +RTC -PRIVDROP -SCFILTER -SIGND +ASYNCDNS -SECHASH -IPV6 +DEBUG)
2026-09-29T00:56:14Z Disabled control of system clock
WARNING: no policy specified for rangeradmin/127.5.11.212@KRBTEST.COM; defaulting to no policy
Authenticating as principal test-admin/admin@KRBTEST.COM with password.
Principal "rangeradmin/127.5.11.212@KRBTEST.COM" created.
Authenticating as principal test-admin/admin@KRBTEST.COM with password.
Entry for principal rangeradmin/127.5.11.212@KRBTEST.COM with kvno 2, encryption type aes256-cts-hmac-sha1-96 added to keytab WRFILE:/tmp/dist-test-taskeXDuD2/test-tmp/ts_authz-itest.0.AuthzProviders_TSAuthzITest.TableScanCLI_Ranger.1790643240301354-5167-0/krb5kdc/rangeradmin_127.5.11.212@KRBTEST.COM.keytab.
Entry for principal rangeradmin/127.5.11.212@KRBTEST.COM with kvno 2, encryption type aes128-cts-hmac-sha1-96 added to keytab WRFILE:/tmp/dist-test-taskeXDuD2/test-tmp/ts_authz-itest.0.AuthzProviders_TSAuthzITest.TableScanCLI_Ranger.1790643240301354-5167-0/krb5kdc/rangeradmin_127.5.11.212@KRBTEST.COM.keytab.
WARNING: no policy specified for rangerlookup/127.5.11.212@KRBTEST.COM; defaulting to no policy
Authenticating as principal test-admin/admin@KRBTEST.COM with password.
Principal "rangerlookup/127.5.11.212@KRBTEST.COM" created.
Authenticating as principal test-admin/admin@KRBTEST.COM with password.
Entry for principal rangerlookup/127.5.11.212@KRBTEST.COM with kvno 2, encryption type aes256-cts-hmac-sha1-96 added to keytab WRFILE:/tmp/dist-test-taskeXDuD2/test-tmp/ts_authz-itest.0.AuthzProviders_TSAuthzITest.TableScanCLI_Ranger.1790643240301354-5167-0/krb5kdc/rangerlookup_127.5.11.212@KRBTEST.COM.keytab.
Entry for principal rangerlookup/127.5.11.212@KRBTEST.COM with kvno 2, encryption type aes128-cts-hmac-sha1-96 added to keytab WRFILE:/tmp/dist-test-taskeXDuD2/test-tmp/ts_authz-itest.0.AuthzProviders_TSAuthzITest.TableScanCLI_Ranger.1790643240301354-5167-0/krb5kdc/rangerlookup_127.5.11.212@KRBTEST.COM.keytab.
WARNING: no policy specified for HTTP/127.5.11.212@KRBTEST.COM; defaulting to no policy
Authenticating as principal test-admin/admin@KRBTEST.COM with password.
Principal "HTTP/127.5.11.212@KRBTEST.COM" created.
Authenticating as principal test-admin/admin@KRBTEST.COM with password.
Entry for principal HTTP/127.5.11.212@KRBTEST.COM with kvno 2, encryption type aes256-cts-hmac-sha1-96 added to keytab WRFILE:/tmp/dist-test-taskeXDuD2/test-tmp/ts_authz-itest.0.AuthzProviders_TSAuthzITest.TableScanCLI_Ranger.1790643240301354-5167-0/krb5kdc/HTTP_127.5.11.212@KRBTEST.COM.keytab.
Entry for principal HTTP/127.5.11.212@KRBTEST.COM with kvno 2, encryption type aes128-cts-hmac-sha1-96 added to keytab WRFILE:/tmp/dist-test-taskeXDuD2/test-tmp/ts_authz-itest.0.AuthzProviders_TSAuthzITest.TableScanCLI_Ranger.1790643240301354-5167-0/krb5kdc/HTTP_127.5.11.212@KRBTEST.COM.keytab.
I20260929 00:56:14.425982  5167 mini_postgres.cc:62] Running initdb...
The files belonging to this database system will be owned by user "slave".
This user must also own the server process.

The database cluster will be initialized with locale "C".
The default database encoding has accordingly been set to "SQL_ASCII".
The default text search configuration will be set to "english".

Data page checksums are disabled.

creating directory /tmp/dist-test-taskeXDuD2/test-tmp/ts_authz-itest.0.AuthzProviders_TSAuthzITest.TableScanCLI_Ranger.1790643240301354-5167-0/minicluster-data/postgres ... ok
creating subdirectories ... ok
selecting dynamic shared memory implementation ... posix
selecting default max_connections ... 100
selecting default shared_buffers ... 128MB
selecting default time zone ... Etc/UTC
creating configuration files ... ok
running bootstrap script ... ok
performing post-bootstrap initialization ... ok
syncing data to disk ... ok

initdb: warning: enabling "trust" authentication for local connections
You can change this by editing pg_hba.conf or using the option -A, or
--auth-local and --auth-host, the next time you run initdb.

Success. You can now start the database server using:

    /tmp/dist-test-taskeXDuD2/build/asan/bin/postgres/pg_ctl -D /tmp/dist-test-taskeXDuD2/test-tmp/ts_authz-itest.0.AuthzProviders_TSAuthzITest.TableScanCLI_Ranger.1790643240301354-5167-0/minicluster-data/postgres -l logfile start

2026-09-29 00:56:16.882 UTC [5629] LOG:  starting PostgreSQL 12.2 on x86_64-pc-linux-gnu, compiled by cc (GCC) 8.3.1 20190311 (Red Hat 8.3.1-3), 64-bit
2026-09-29 00:56:16.882 UTC [5629] LOG:  listening on IPv4 address "127.5.11.212", port 49285
2026-09-29 00:56:16.885 UTC [5629] LOG:  listening on Unix socket "/tmp/.s.PGSQL.49285"
2026-09-29 00:56:16.910 UTC [5632] LOG:  database system was shut down at 2026-09-29 00:56:15 UTC
2026-09-29 00:56:16.914 UTC [5629] LOG:  database system is ready to accept connections
I20260929 00:56:17.792543  5167 mini_postgres.cc:96] Postgres bound to 49285
2026-09-29 00:56:17.803 UTC [5640] FATAL:  database "slave" does not exist
127.5.11.212:49285 - accepting connections
I20260929 00:56:17.803714  5167 mini_ranger.cc:161] Starting Ranger...
I20260929 00:56:17.822206  5167 mini_ranger.cc:84] Created miniranger Postgres user
I20260929 00:56:18.320974  5167 mini_ranger.cc:87] Created ranger Postgres database
I20260929 00:56:18.321101  5167 mini_ranger.cc:178] Starting Ranger out of /tmp/dist-test-taskeXDuD2/test-tmp/ts_authz-itest.0.AuthzProviders_TSAuthzITest.TableScanCLI_Ranger.1790643240301354-5167-0/minicluster-data/ranger-admin
2026-09-29 00:56:18,593  [I] DB FLAVOR :POSTGRES
2026-09-29 00:56:18,593  [I] --------- Verifying Ranger DB connection ---------
2026-09-29 00:56:18,594  [I] Checking connection..
2026-09-29 00:56:18,594  [JISQL] /usr/lib/jvm/java-1.8.0-openjdk-amd64/bin/java  -cp /tmp/dist-test-taskeXDuD2/build/asan/bin/postgresql.jar:/tmp/dist-test-taskeXDuD2/thirdparty/src/ranger-2.1.0-admin/jisql/lib/* org.apache.util.sql.Jisql -driver postgresql -cstring jdbc:postgresql://127.5.11.212:49285/ranger -u miniranger -p '********' -noheader -trim -c \;  -query "select 1;"
2026-09-29 00:56:18,850  [I] Checking connection passed.
2026-09-29 00:56:18,850  [I] --------- Verifying version history table ---------
2026-09-29 00:56:18,850  [JISQL] /usr/lib/jvm/java-1.8.0-openjdk-amd64/bin/java  -cp /tmp/dist-test-taskeXDuD2/build/asan/bin/postgresql.jar:/tmp/dist-test-taskeXDuD2/thirdparty/src/ranger-2.1.0-admin/jisql/lib/* org.apache.util.sql.Jisql -driver postgresql -cstring jdbc:postgresql://127.5.11.212:49285/ranger -u miniranger -p '********' -noheader -trim -c \;  -query "select * from (select table_name from information_schema.tables where table_catalog='ranger' and table_name = 'x_db_version_h') as temp;"
2026-09-29 00:56:19,097  [I] Table x_db_version_h does not exist in database ranger
2026-09-29 00:56:19,097  [JISQL] /usr/lib/jvm/java-1.8.0-openjdk-amd64/bin/java  -cp /tmp/dist-test-taskeXDuD2/build/asan/bin/postgresql.jar:/tmp/dist-test-taskeXDuD2/thirdparty/src/ranger-2.1.0-admin/jisql/lib/* org.apache.util.sql.Jisql -driver postgresql -cstring jdbc:postgresql://127.5.11.212:49285/ranger -u miniranger -p '********' -noheader -trim -c \;  -query "select * from (select table_name from information_schema.tables where table_catalog='ranger' and table_name = 'x_db_version_h') as temp;"
2026-09-29 00:56:19,339  [I] Table x_db_version_h does not exist in database ranger
2026-09-29 00:56:19,340  [I] Importing x_db_version_h table schema to database ranger from file: create_dbversion_catalog.sql
2026-09-29 00:56:19,340  [JISQL] /usr/lib/jvm/java-1.8.0-openjdk-amd64/bin/java  -cp /tmp/dist-test-taskeXDuD2/build/asan/bin/postgresql.jar:/tmp/dist-test-taskeXDuD2/thirdparty/src/ranger-2.1.0-admin/jisql/lib/* org.apache.util.sql.Jisql -driver postgresql -cstring jdbc:postgresql://127.5.11.212:49285/ranger -u miniranger -p '********' -noheader -trim -c \; -input /tmp/dist-test-taskeXDuD2/thirdparty/src/ranger-2.1.0-admin/db/postgres/create_dbversion_catalog.sql 
2026-09-29 00:56:19.577 UTC [5704] WARNING:  there is no transaction in progress
2026-09-29 00:56:19,583  [I] create_dbversion_catalog.sql file imported successfully
2026-09-29 00:56:19,583  [JISQL] /usr/lib/jvm/java-1.8.0-openjdk-amd64/bin/java  -cp /tmp/dist-test-taskeXDuD2/build/asan/bin/postgresql.jar:/tmp/dist-test-taskeXDuD2/thirdparty/src/ranger-2.1.0-admin/jisql/lib/* org.apache.util.sql.Jisql -driver postgresql -cstring jdbc:postgresql://127.5.11.212:49285/ranger -u miniranger -p '********' -noheader -trim -c \;  -query "select * from (select table_name from information_schema.tables where table_catalog='ranger' and table_name = 'x_db_version_h') as temp;"
2026-09-29 00:56:19,838  [I] Table x_db_version_h already exists in database 'ranger'
2026-09-29 00:56:19,838  [I] --------- Importing Ranger Core DB Schema ---------
2026-09-29 00:56:19,838  [JISQL] /usr/lib/jvm/java-1.8.0-openjdk-amd64/bin/java  -cp /tmp/dist-test-taskeXDuD2/build/asan/bin/postgresql.jar:/tmp/dist-test-taskeXDuD2/thirdparty/src/ranger-2.1.0-admin/jisql/lib/* org.apache.util.sql.Jisql -driver postgresql -cstring jdbc:postgresql://127.5.11.212:49285/ranger -u miniranger -p '********' -noheader -trim -c \;  -query "select version from x_db_version_h where version = 'CORE_DB_SCHEMA' and active = 'Y';"
2026-09-29 00:56:20,095  [JISQL] /usr/lib/jvm/java-1.8.0-openjdk-amd64/bin/java  -cp /tmp/dist-test-taskeXDuD2/build/asan/bin/postgresql.jar:/tmp/dist-test-taskeXDuD2/thirdparty/src/ranger-2.1.0-admin/jisql/lib/* org.apache.util.sql.Jisql -driver postgresql -cstring jdbc:postgresql://127.5.11.212:49285/ranger -u miniranger -p '********' -noheader -trim -c \;  -query "select version from x_db_version_h where version = 'CORE_DB_SCHEMA' and active = 'N';"
2026-09-29 00:56:20,351  [JISQL] /usr/lib/jvm/java-1.8.0-openjdk-amd64/bin/java  -cp /tmp/dist-test-taskeXDuD2/build/asan/bin/postgresql.jar:/tmp/dist-test-taskeXDuD2/thirdparty/src/ranger-2.1.0-admin/jisql/lib/* org.apache.util.sql.Jisql -driver postgresql -cstring jdbc:postgresql://127.5.11.212:49285/ranger -u miniranger -p '********' -noheader -trim -c \;  -query "insert into x_db_version_h (version, inst_at, inst_by, updated_at, updated_by,active) values ('CORE_DB_SCHEMA', current_timestamp, 'Ranger 2.1.0', current_timestamp, 'dist-test-slave-w3ts.c.gcp-upstream.internal','N') ;"
2026-09-29 00:56:20,579  [JISQL] /usr/lib/jvm/java-1.8.0-openjdk-amd64/bin/java  -cp /tmp/dist-test-taskeXDuD2/build/asan/bin/postgresql.jar:/tmp/dist-test-taskeXDuD2/thirdparty/src/ranger-2.1.0-admin/jisql/lib/* org.apache.util.sql.Jisql -driver postgresql -cstring jdbc:postgresql://127.5.11.212:49285/ranger -u miniranger -p '********' -noheader -trim -c \;  -query "select * from (select table_name from information_schema.tables where table_catalog='ranger' and table_name = 'x_portal_user') as temp;"
2026-09-29 00:56:20,823  [I] Table x_portal_user does not exist in database ranger
2026-09-29 00:56:20,824  [JISQL] /usr/lib/jvm/java-1.8.0-openjdk-amd64/bin/java  -cp /tmp/dist-test-taskeXDuD2/build/asan/bin/postgresql.jar:/tmp/dist-test-taskeXDuD2/thirdparty/src/ranger-2.1.0-admin/jisql/lib/* org.apache.util.sql.Jisql -driver postgresql -cstring jdbc:postgresql://127.5.11.212:49285/ranger -u miniranger -p '********' -noheader -trim -c \;  -query "select * from (select table_name from information_schema.tables where table_catalog='ranger' and table_name = 'x_policy_ref_group') as temp;"
2026-09-29 00:56:21,083  [I] Table x_policy_ref_group does not exist in database ranger
2026-09-29 00:56:21,084  [JISQL] /usr/lib/jvm/java-1.8.0-openjdk-amd64/bin/java  -cp /tmp/dist-test-taskeXDuD2/build/asan/bin/postgresql.jar:/tmp/dist-test-taskeXDuD2/thirdparty/src/ranger-2.1.0-admin/jisql/lib/* org.apache.util.sql.Jisql -driver postgresql -cstring jdbc:postgresql://127.5.11.212:49285/ranger -u miniranger -p '********' -noheader -trim -c \;  -query "select version from x_db_version_h where version = 'DB_PATCHES' and active = 'Y';"
2026-09-29 00:56:21,314  [JISQL] /usr/lib/jvm/java-1.8.0-openjdk-amd64/bin/java  -cp /tmp/dist-test-taskeXDuD2/build/asan/bin/postgresql.jar:/tmp/dist-test-taskeXDuD2/thirdparty/src/ranger-2.1.0-admin/jisql/lib/* org.apache.util.sql.Jisql -driver postgresql -cstring jdbc:postgresql://127.5.11.212:49285/ranger -u miniranger -p '********' -noheader -trim -c \;  -query "select version from x_db_version_h where version = 'JAVA_PATCHES' and active = 'Y';"
2026-09-29 00:56:21,554  [I] Importing DB schema to database ranger from file: ranger_core_db_postgres.sql
2026-09-29 00:56:21,554  [JISQL] /usr/lib/jvm/java-1.8.0-openjdk-amd64/bin/java  -cp /tmp/dist-test-taskeXDuD2/build/asan/bin/postgresql.jar:/tmp/dist-test-taskeXDuD2/thirdparty/src/ranger-2.1.0-admin/jisql/lib/* org.apache.util.sql.Jisql -driver postgresql -cstring jdbc:postgresql://127.5.11.212:49285/ranger -u miniranger -p '********' -noheader -trim -c \; -input /tmp/dist-test-taskeXDuD2/thirdparty/src/ranger-2.1.0-admin/db/postgres/optimized/current/ranger_core_db_postgres.sql 
2026-09-29 00:56:22.529 UTC [5812] WARNING:  there is no transaction in progress
2026-09-29 00:56:22.545 UTC [5812] WARNING:  there is no transaction in progress
2026-09-29 00:56:22.563 UTC [5812] WARNING:  there is no transaction in progress
2026-09-29 00:56:22.578 UTC [5812] WARNING:  there is no transaction in progress
2026-09-29 00:56:22.593 UTC [5812] WARNING:  there is no transaction in progress
2026-09-29 00:56:22.612 UTC [5812] WARNING:  there is no transaction in progress
2026-09-29 00:56:22.673 UTC [5812] WARNING:  there is no transaction in progress
2026-09-29 00:56:22.681 UTC [5812] WARNING:  there is no transaction in progress
2026-09-29 00:56:22.695 UTC [5812] WARNING:  there is no transaction in progress
2026-09-29 00:56:22.706 UTC [5812] WARNING:  there is no transaction in progress
2026-09-29 00:56:22.718 UTC [5812] WARNING:  there is no transaction in progress
2026-09-29 00:56:22.733 UTC [5812] WARNING:  there is no transaction in progress
2026-09-29 00:56:22.744 UTC [5812] WARNING:  there is no transaction in progress
2026-09-29 00:56:22.751 UTC [5812] WARNING:  there is no transaction in progress
2026-09-29 00:56:22.759 UTC [5812] WARNING:  there is no transaction in progress
2026-09-29 00:56:22.766 UTC [5812] WARNING:  there is no transaction in progress
2026-09-29 00:56:23,417  [I] ranger_core_db_postgres.sql file imported successfully
2026-09-29 00:56:23,417  [JISQL] /usr/lib/jvm/java-1.8.0-openjdk-amd64/bin/java  -cp /tmp/dist-test-taskeXDuD2/build/asan/bin/postgresql.jar:/tmp/dist-test-taskeXDuD2/thirdparty/src/ranger-2.1.0-admin/jisql/lib/* org.apache.util.sql.Jisql -driver postgresql -cstring jdbc:postgresql://127.5.11.212:49285/ranger -u miniranger -p '********' -noheader -trim -c \;  -query "update x_db_version_h set inst_by='Ranger 2.1.0' where active='Y' and updated_by='localhost';"
2026-09-29 00:56:23,663  [I] Patches status entries updated from base ranger version to current installed ranger version:Ranger 2.1.0
2026-09-29 00:56:23,663  [JISQL] /usr/lib/jvm/java-1.8.0-openjdk-amd64/bin/java  -cp /tmp/dist-test-taskeXDuD2/build/asan/bin/postgresql.jar:/tmp/dist-test-taskeXDuD2/thirdparty/src/ranger-2.1.0-admin/jisql/lib/* org.apache.util.sql.Jisql -driver postgresql -cstring jdbc:postgresql://127.5.11.212:49285/ranger -u miniranger -p '********' -noheader -trim -c \;  -query "select * from (select table_name from information_schema.tables where table_catalog='ranger' and table_name = 'x_portal_user') as temp;"
2026-09-29 00:56:23,932  [I] Table x_portal_user already exists in database 'ranger'
2026-09-29 00:56:23,932  [JISQL] /usr/lib/jvm/java-1.8.0-openjdk-amd64/bin/java  -cp /tmp/dist-test-taskeXDuD2/build/asan/bin/postgresql.jar:/tmp/dist-test-taskeXDuD2/thirdparty/src/ranger-2.1.0-admin/jisql/lib/* org.apache.util.sql.Jisql -driver postgresql -cstring jdbc:postgresql://127.5.11.212:49285/ranger -u miniranger -p '********' -noheader -trim -c \;  -query "select * from (select table_name from information_schema.tables where table_catalog='ranger' and table_name = 'x_policy_ref_group') as temp;"
2026-09-29 00:56:24,177  [I] Table x_policy_ref_group already exists in database 'ranger'
2026-09-29 00:56:24,177  [JISQL] /usr/lib/jvm/java-1.8.0-openjdk-amd64/bin/java  -cp /tmp/dist-test-taskeXDuD2/build/asan/bin/postgresql.jar:/tmp/dist-test-taskeXDuD2/thirdparty/src/ranger-2.1.0-admin/jisql/lib/* org.apache.util.sql.Jisql -driver postgresql -cstring jdbc:postgresql://127.5.11.212:49285/ranger -u miniranger -p '********' -noheader -trim -c \;  -query "select version from x_db_version_h where version = 'DB_PATCHES' and active = 'Y';"
2026-09-29 00:56:24,426  [JISQL] /usr/lib/jvm/java-1.8.0-openjdk-amd64/bin/java  -cp /tmp/dist-test-taskeXDuD2/build/asan/bin/postgresql.jar:/tmp/dist-test-taskeXDuD2/thirdparty/src/ranger-2.1.0-admin/jisql/lib/* org.apache.util.sql.Jisql -driver postgresql -cstring jdbc:postgresql://127.5.11.212:49285/ranger -u miniranger -p '********' -noheader -trim -c \;  -query "select version from x_db_version_h where version = 'JAVA_PATCHES' and active = 'Y';"
2026-09-29 00:56:24,670  [JISQL] /usr/lib/jvm/java-1.8.0-openjdk-amd64/bin/java  -cp /tmp/dist-test-taskeXDuD2/build/asan/bin/postgresql.jar:/tmp/dist-test-taskeXDuD2/thirdparty/src/ranger-2.1.0-admin/jisql/lib/* org.apache.util.sql.Jisql -driver postgresql -cstring jdbc:postgresql://127.5.11.212:49285/ranger -u miniranger -p '********' -noheader -trim -c \;  -query "update x_db_version_h set active='Y' where version='CORE_DB_SCHEMA' and active='N' and updated_by='dist-test-slave-w3ts.c.gcp-upstream.internal';"
2026-09-29 00:56:24,916  [I] CORE_DB_SCHEMA import status has been updated
2026-09-29 00:56:24,916  [JISQL] /usr/lib/jvm/java-1.8.0-openjdk-amd64/bin/java  -cp /tmp/dist-test-taskeXDuD2/build/asan/bin/postgresql.jar:/tmp/dist-test-taskeXDuD2/thirdparty/src/ranger-2.1.0-admin/jisql/lib/* org.apache.util.sql.Jisql -driver postgresql -cstring jdbc:postgresql://127.5.11.212:49285/ranger -u miniranger -p '********' -noheader -trim -c \;  -query "select version from x_db_version_h where version = 'DB_PATCHES' and inst_by = 'Ranger 2.1.0' and active = 'Y';"
2026-09-29 00:56:25,158  [I] DB_PATCHES have already been applied
I20260929 00:56:25.164197  5167 mini_ranger.cc:191] Using Ranger class path: /tmp/dist-test-taskeXDuD2/test-tmp/ts_authz-itest.0.AuthzProviders_TSAuthzITest.TableScanCLI_Ranger.1790643240301354-5167-0/minicluster-data/ranger-admin:/tmp/dist-test-taskeXDuD2/thirdparty/src/ranger-2.1.0-admin/ews/lib/*:/usr/lib/jvm/java-1.8.0-openjdk-amd64/lib/*:/tmp/dist-test-taskeXDuD2/thirdparty/src/hadoop-3.2.0/*:/tmp/dist-test-taskeXDuD2/build/asan/bin/postgresql.jar:/tmp/dist-test-taskeXDuD2/thirdparty/src/ranger-2.1.0-admin/ews/webapp
I20260929 00:56:25.164294  5167 mini_ranger.cc:193] Using host: 127.5.11.212
I20260929 00:56:25.172874  5167 mini_ranger.cc:227] Ranger admin URL: http://127.5.11.212:58949
Sep 29, 2026 12:56:25 AM org.apache.ranger.server.tomcat.EmbeddedServer getKeyManagers
WARNING: Config 'ranger.keystore.file' or 'ranger.service.https.attrib.keystore.file' is not found or contains blank value
Sep 29, 2026 12:56:25 AM org.apache.ranger.server.tomcat.EmbeddedServer getTrustManagers
WARNING: Config 'ranger.truststore.file' is not found or contains blank value!
Sep 29, 2026 12:56:25 AM org.apache.ranger.server.tomcat.EmbeddedServer start
INFO: Deriving webapp folder from catalina.base property. folder=/tmp/dist-test-taskeXDuD2/test-tmp/ts_authz-itest.0.AuthzProviders_TSAuthzITest.TableScanCLI_Ranger.1790643240301354-5167-0/minicluster-data/ranger-admin/ews/webapp
Sep 29, 2026 12:56:25 AM org.apache.ranger.server.tomcat.EmbeddedServer start
INFO: Webapp file =/tmp/dist-test-taskeXDuD2/test-tmp/ts_authz-itest.0.AuthzProviders_TSAuthzITest.TableScanCLI_Ranger.1790643240301354-5167-0/minicluster-data/ranger-admin/ews/webapp, webAppName = /
Sep 29, 2026 12:56:25 AM org.apache.ranger.server.tomcat.EmbeddedServer start
INFO: Adding webapp [/] = path [/tmp/dist-test-taskeXDuD2/test-tmp/ts_authz-itest.0.AuthzProviders_TSAuthzITest.TableScanCLI_Ranger.1790643240301354-5167-0/minicluster-data/ranger-admin/ews/webapp] .....
Sep 29, 2026 12:56:26 AM org.apache.ranger.server.tomcat.EmbeddedServer start
INFO: Finished init of webapp [/] = path [/tmp/dist-test-taskeXDuD2/test-tmp/ts_authz-itest.0.AuthzProviders_TSAuthzITest.TableScanCLI_Ranger.1790643240301354-5167-0/minicluster-data/ranger-admin/ews/webapp].
Sep 29, 2026 12:56:26 AM org.apache.ranger.server.tomcat.EmbeddedServer startServer
INFO: Server Name : miniranger
I20260929 00:56:26.182797  5167 mini_ranger.cc:160] Time spent starting Ranger: real 8.379s	user 0.000s	sys 0.022s
Sep 29, 2026 12:56:45 AM com.sun.jersey.api.core.PackagesResourceConfig init
INFO: Scanning for root resource and provider classes in the packages:
  org.apache.ranger.rest
  org.apache.ranger.common
  xa.rest
Sep 29, 2026 12:56:45 AM com.sun.jersey.api.core.ScanningResourceConfig logClasses
INFO: Root resource classes found:
  class org.apache.ranger.rest.XAuditREST
  class org.apache.ranger.rest.SecurityZoneREST
  class org.apache.ranger.rest.PublicAPIsv2
  class org.apache.ranger.rest.XKeyREST
  class org.apache.ranger.rest.RoleREST
  class org.apache.ranger.rest.ServiceREST
  class org.apache.ranger.rest.AssetREST
  class org.apache.ranger.rest.XUserREST
  class org.apache.ranger.rest.TagREST
  class org.apache.ranger.rest.MetricsREST
  class org.apache.ranger.rest.PublicAPIs
  class org.apache.ranger.rest.UserREST
Sep 29, 2026 12:56:45 AM com.sun.jersey.api.core.ScanningResourceConfig logClasses
INFO: Provider classes found:
  class org.apache.ranger.common.RangerJAXBContextResolver
Sep 29, 2026 12:56:45 AM com.sun.jersey.spi.spring.container.servlet.SpringServlet getContext
INFO: Using default applicationContext
Sep 29, 2026 12:56:45 AM com.sun.jersey.spi.spring.container.SpringComponentProviderFactory registerSpringBeans
INFO: Registering Spring bean, assetREST, of type org.apache.ranger.rest.AssetREST as a root resource class
Sep 29, 2026 12:56:45 AM com.sun.jersey.spi.spring.container.SpringComponentProviderFactory registerSpringBeans
INFO: Registering Spring bean, metricsREST, of type org.apache.ranger.rest.MetricsREST as a root resource class
Sep 29, 2026 12:56:45 AM com.sun.jersey.spi.spring.container.SpringComponentProviderFactory registerSpringBeans
INFO: Registering Spring bean, publicAPIs, of type org.apache.ranger.rest.PublicAPIs as a root resource class
Sep 29, 2026 12:56:45 AM com.sun.jersey.spi.spring.container.SpringComponentProviderFactory registerSpringBeans
INFO: Registering Spring bean, publicAPIsv2, of type org.apache.ranger.rest.PublicAPIsv2 as a root resource class
Sep 29, 2026 12:56:45 AM com.sun.jersey.spi.spring.container.SpringComponentProviderFactory registerSpringBeans
INFO: Registering Spring bean, roleREST, of type org.apache.ranger.rest.RoleREST as a root resource class
Sep 29, 2026 12:56:45 AM com.sun.jersey.spi.spring.container.SpringComponentProviderFactory registerSpringBeans
INFO: Registering Spring bean, securityZoneREST, of type org.apache.ranger.rest.SecurityZoneREST as a root resource class
Sep 29, 2026 12:56:45 AM com.sun.jersey.spi.spring.container.SpringComponentProviderFactory registerSpringBeans
INFO: Registering Spring bean, serviceREST, of type org.apache.ranger.rest.ServiceREST as a root resource class
Sep 29, 2026 12:56:45 AM com.sun.jersey.spi.spring.container.SpringComponentProviderFactory registerSpringBeans
INFO: Registering Spring bean, tagREST, of type org.apache.ranger.rest.TagREST as a root resource class
Sep 29, 2026 12:56:45 AM com.sun.jersey.spi.spring.container.SpringComponentProviderFactory registerSpringBeans
INFO: Registering Spring bean, userREST, of type org.apache.ranger.rest.UserREST as a root resource class
Sep 29, 2026 12:56:45 AM com.sun.jersey.spi.spring.container.SpringComponentProviderFactory registerSpringBeans
INFO: Registering Spring bean, XAuditREST, of type org.apache.ranger.rest.XAuditREST as a root resource class
Sep 29, 2026 12:56:45 AM com.sun.jersey.spi.spring.container.SpringComponentProviderFactory registerSpringBeans
INFO: Registering Spring bean, XKeyREST, of type org.apache.ranger.rest.XKeyREST as a root resource class
Sep 29, 2026 12:56:45 AM com.sun.jersey.spi.spring.container.SpringComponentProviderFactory registerSpringBeans
INFO: Registering Spring bean, XUserREST, of type org.apache.ranger.rest.XUserREST as a root resource class
Sep 29, 2026 12:56:45 AM com.sun.jersey.server.impl.application.WebApplicationImpl _initiate
INFO: Initiating Jersey application, version 'Jersey: 1.19.3 10/24/2016 03:58 PM'
Sep 29, 2026 12:56:46 AM com.sun.jersey.spi.inject.Errors processErrorMessages
WARNING: The following warnings have been detected with resource and/or provider classes:
  WARNING: A HTTP GET method, public void org.apache.ranger.rest.ServiceREST.getPoliciesInExcel(javax.servlet.http.HttpServletRequest,javax.servlet.http.HttpServletResponse), MUST return a non-void type.
  WARNING: A HTTP GET method, public void org.apache.ranger.rest.ServiceREST.getPoliciesInJson(javax.servlet.http.HttpServletRequest,javax.servlet.http.HttpServletResponse,java.lang.Boolean), MUST return a non-void type.
  WARNING: A HTTP GET method, public void org.apache.ranger.rest.ServiceREST.getPoliciesInCsv(javax.servlet.http.HttpServletRequest,javax.servlet.http.HttpServletResponse) throws java.io.IOException, MUST return a non-void type.
I20260929 00:56:46.678313  5167 mini_ranger.cc:261] Created Kudu service
WARNING: no policy specified for kudu/127.5.11.254@KRBTEST.COM; defaulting to no policy
Authenticating as principal test-admin/admin@KRBTEST.COM with password.
Principal "kudu/127.5.11.254@KRBTEST.COM" created.
Authenticating as principal test-admin/admin@KRBTEST.COM with password.
Entry for principal kudu/127.5.11.254 with kvno 2, encryption type aes256-cts-hmac-sha1-96 added to keytab WRFILE:/tmp/dist-test-taskeXDuD2/test-tmp/ts_authz-itest.0.AuthzProviders_TSAuthzITest.TableScanCLI_Ranger.1790643240301354-5167-0/krb5kdc/kudu_127.5.11.254.keytab.
Entry for principal kudu/127.5.11.254 with kvno 2, encryption type aes128-cts-hmac-sha1-96 added to keytab WRFILE:/tmp/dist-test-taskeXDuD2/test-tmp/ts_authz-itest.0.AuthzProviders_TSAuthzITest.TableScanCLI_Ranger.1790643240301354-5167-0/krb5kdc/kudu_127.5.11.254.keytab.
I20260929 00:56:46.723318  5167 external_mini_cluster.cc:1326] Running /tmp/dist-test-taskeXDuD2/build/asan/bin/kudu
/tmp/dist-test-taskeXDuD2/build/asan/bin/kudu
--fs_wal_dir=/tmp/dist-test-taskeXDuD2/test-tmp/ts_authz-itest.0.AuthzProviders_TSAuthzITest.TableScanCLI_Ranger.1790643240301354-5167-0/minicluster-data/master-0/wal
--fs_data_dirs=/tmp/dist-test-taskeXDuD2/test-tmp/ts_authz-itest.0.AuthzProviders_TSAuthzITest.TableScanCLI_Ranger.1790643240301354-5167-0/minicluster-data/master-0/data
--block_manager=log
--webserver_interface=localhost
--never_fsync
--enable_minidumps=false
--redact=none
--metrics_log_interval_ms=1000
--log_dir=/tmp/dist-test-taskeXDuD2/test-tmp/ts_authz-itest.0.AuthzProviders_TSAuthzITest.TableScanCLI_Ranger.1790643240301354-5167-0/minicluster-data/master-0/logs
--server_dump_info_path=/tmp/dist-test-taskeXDuD2/test-tmp/ts_authz-itest.0.AuthzProviders_TSAuthzITest.TableScanCLI_Ranger.1790643240301354-5167-0/minicluster-data/master-0/data/info.pb
--server_dump_info_format=pb
--rpc_server_allow_ephemeral_ports
--unlock_experimental_flags
--unlock_unsafe_flags
--logtostderr
--logbuflevel=-1
--ipki_server_key_size=768
--openssl_security_level_override=0
master
run
--ipki_ca_key_size=768
--tsk_num_rsa_bits=512
--rpc_bind_addresses=127.5.11.254:46807
--webserver_interface=127.5.11.254
--webserver_port=0
--keytab_file=/tmp/dist-test-taskeXDuD2/test-tmp/ts_authz-itest.0.AuthzProviders_TSAuthzITest.TableScanCLI_Ranger.1790643240301354-5167-0/krb5kdc/kudu_127.5.11.254.keytab
--principal=kudu/127.5.11.254
--rpc_authentication=required
--superuser_acl=test-admin
--user_acl=test-user
--builtin_ntp_servers=127.5.11.212:37241
--builtin_ntp_poll_interval_ms=100
--ntp_initial_sync_wait_secs=10
--time_source=builtin
--rpc_reuseport=true
--master_addresses=127.5.11.254:46807
--ranger_config_path=/tmp/dist-test-taskeXDuD2/test-tmp/ts_authz-itest.0.AuthzProviders_TSAuthzITest.TableScanCLI_Ranger.1790643240301354-5167-0/minicluster-data/ranger-client
--trusted_user_acl=test-admin
--authz_token_validity_seconds=1
--user_acl=kudu,user0,user1,user2 with env {KRB5CCNAME=/tmp/dist-test-taskeXDuD2/test-tmp/ts_authz-itest.0.AuthzProviders_TSAuthzITest.TableScanCLI_Ranger.1790643240301354-5167-0/krb5kdc/krb5cc,KRB5_CONFIG=/tmp/dist-test-taskeXDuD2/test-tmp/ts_authz-itest.0.AuthzProviders_TSAuthzITest.TableScanCLI_Ranger.1790643240301354-5167-0/krb5kdc/krb5.conf,KRB5_KDC_PROFILE=/tmp/dist-test-taskeXDuD2/test-tmp/ts_authz-itest.0.AuthzProviders_TSAuthzITest.TableScanCLI_Ranger.1790643240301354-5167-0/krb5kdc/kdc.conf,KUDU_ENABLE_KRB5_REALM_FIX=yes}
W20260929 00:56:47.060775  5943 flags.cc:425] Enabled unsafe flag: --openssl_security_level_override=0
W20260929 00:56:47.061103  5943 flags.cc:425] Enabled unsafe flag: --rpc_server_allow_ephemeral_ports=true
W20260929 00:56:47.061256  5943 flags.cc:425] Enabled unsafe flag: --never_fsync=true
W20260929 00:56:47.068660  5943 flags.cc:425] Enabled experimental flag: --authz_token_validity_seconds=1
W20260929 00:56:47.068776  5943 flags.cc:425] Enabled experimental flag: --ipki_ca_key_size=768
W20260929 00:56:47.068849  5943 flags.cc:425] Enabled experimental flag: --ipki_server_key_size=768
W20260929 00:56:47.068921  5943 flags.cc:425] Enabled experimental flag: --tsk_num_rsa_bits=512
W20260929 00:56:47.068989  5943 flags.cc:425] Enabled experimental flag: --rpc_reuseport=true
I20260929 00:56:47.079604  5943 master_runner.cc:386] Master server non-default flags:
--builtin_ntp_poll_interval_ms=100
--builtin_ntp_servers=127.5.11.212:37241
--ntp_initial_sync_wait_secs=10
--time_source=builtin
--fs_data_dirs=/tmp/dist-test-taskeXDuD2/test-tmp/ts_authz-itest.0.AuthzProviders_TSAuthzITest.TableScanCLI_Ranger.1790643240301354-5167-0/minicluster-data/master-0/data
--fs_wal_dir=/tmp/dist-test-taskeXDuD2/test-tmp/ts_authz-itest.0.AuthzProviders_TSAuthzITest.TableScanCLI_Ranger.1790643240301354-5167-0/minicluster-data/master-0/wal
--trusted_user_acl=<redacted>
--authz_token_validity_seconds=1
--ipki_ca_key_size=768
--master_addresses=127.5.11.254:46807
--ranger_config_path=/tmp/dist-test-taskeXDuD2/test-tmp/ts_authz-itest.0.AuthzProviders_TSAuthzITest.TableScanCLI_Ranger.1790643240301354-5167-0/minicluster-data/ranger-client
--keytab_file=/tmp/dist-test-taskeXDuD2/test-tmp/ts_authz-itest.0.AuthzProviders_TSAuthzITest.TableScanCLI_Ranger.1790643240301354-5167-0/krb5kdc/kudu_127.5.11.254.keytab
--principal=kudu/127.5.11.254
--ipki_server_key_size=768
--openssl_security_level_override=0
--tsk_num_rsa_bits=512
--rpc_bind_addresses=127.5.11.254:46807
--rpc_reuseport=true
--rpc_server_allow_ephemeral_ports=true
--rpc_authentication=required
--superuser_acl=<redacted>
--user_acl=<redacted>
--metrics_log_interval_ms=1000
--server_dump_info_format=pb
--server_dump_info_path=/tmp/dist-test-taskeXDuD2/test-tmp/ts_authz-itest.0.AuthzProviders_TSAuthzITest.TableScanCLI_Ranger.1790643240301354-5167-0/minicluster-data/master-0/data/info.pb
--webserver_interface=127.5.11.254
--webserver_port=0
--never_fsync=true
--redact=none
--unlock_experimental_flags=true
--unlock_unsafe_flags=true
--enable_minidumps=false
--log_dir=/tmp/dist-test-taskeXDuD2/test-tmp/ts_authz-itest.0.AuthzProviders_TSAuthzITest.TableScanCLI_Ranger.1790643240301354-5167-0/minicluster-data/master-0/logs
--logbuflevel=-1
--logtostderr=true

Master server version:
kudu 1.18.0-SNAPSHOT
revision c2d25d5f57d102d9ad9869eaf208d035a22e18aa
build type FASTDEBUG
built by systest at 28 Sep 2026 23:53:35 UTC on ccycloud.quasar-vwuirl.root.comops.site
build id 4678654
ASAN enabled
I20260929 00:56:47.080963  5943 env_posix.cc:2256] Not raising this process' open files per process limit of 1048576; it is already as high as it can go
I20260929 00:56:47.082341  5943 file_cache.cc:493] Constructed file cache file cache with capacity 419430
W20260929 00:56:47.094135  5948 instance_detector.cc:116] could not retrieve AWS instance metadata: Network error: curl error: HTTP response code said error: The requested URL returned error: 404
W20260929 00:56:47.094182  5951 instance_detector.cc:116] could not retrieve OpenStack instance metadata: Network error: curl error: HTTP response code said error: The requested URL returned error: 404
W20260929 00:56:47.094213  5949 instance_detector.cc:116] could not retrieve Azure instance metadata: Network error: curl error: HTTP response code said error: The requested URL returned error: 404
I20260929 00:56:47.095115  5943 server_base.cc:1034] running on GCE node
I20260929 00:56:47.095960  5943 hybrid_clock.cc:584] initializing the hybrid clock with 'builtin' time source
I20260929 00:56:47.097510  5943 hybrid_clock.cc:630] waiting up to --ntp_initial_sync_wait_secs=10 seconds for the clock to synchronize
I20260929 00:56:47.098735  5943 hybrid_clock.cc:648] HybridClock initialized: now 1790643407098678 us; error 51 us; skew 500 ppm
I20260929 00:56:47.099099  5943 server_base.cc:834] Flag tcmalloc_max_total_thread_cache_bytes is not working since tcmalloc is not enabled.
Sep 29 00:56:47 dist-test-slave-w3ts krb5kdc[5599](info): AS_REQ (2 etypes {17 16}) 127.0.0.1: ISSUE: authtime 1790643407, etypes {rep=17 tkt=17 ses=17}, kudu/127.5.11.254@KRBTEST.COM for krbtgt/KRBTEST.COM@KRBTEST.COM
I20260929 00:56:47.102391  5943 init.cc:377] Logged in from keytab as kudu/127.5.11.254@KRBTEST.COM (short username kudu)
I20260929 00:56:47.103864  5943 webserver.cc:460] Webserver started at http://127.5.11.254:40417/ using document root <none> and password file <none>
I20260929 00:56:47.104548  5943 fs_manager.cc:359] Metadata directory not provided
I20260929 00:56:47.104637  5943 fs_manager.cc:365] Using write-ahead log directory (fs_wal_dir) as metadata directory
I20260929 00:56:47.104894  5943 server_base.cc:882] This appears to be a new deployment of Kudu; creating new FS layout
I20260929 00:56:47.107746  5943 fs_manager.cc:1063] Generated new instance metadata in path /tmp/dist-test-taskeXDuD2/test-tmp/ts_authz-itest.0.AuthzProviders_TSAuthzITest.TableScanCLI_Ranger.1790643240301354-5167-0/minicluster-data/master-0/data/instance:
uuid: "6cc4b87aabff4a70a3114889706df935"
format_stamp: "Formatted at 2026-09-29 00:56:47 on dist-test-slave-w3ts"
I20260929 00:56:47.108619  5943 fs_manager.cc:1063] Generated new instance metadata in path /tmp/dist-test-taskeXDuD2/test-tmp/ts_authz-itest.0.AuthzProviders_TSAuthzITest.TableScanCLI_Ranger.1790643240301354-5167-0/minicluster-data/master-0/wal/instance:
uuid: "6cc4b87aabff4a70a3114889706df935"
format_stamp: "Formatted at 2026-09-29 00:56:47 on dist-test-slave-w3ts"
I20260929 00:56:47.114168  5943 fs_manager.cc:691] Time spent creating directory manager: real 0.005s	user 0.007s	sys 0.000s
I20260929 00:56:47.117697  5958 log_block_manager.cc:3774] Time spent loading block containers with low live blocks: real 0.000s	user 0.000s	sys 0.000s
I20260929 00:56:47.119160  5943 fs_manager.cc:725] Time spent opening block manager: real 0.003s	user 0.002s	sys 0.002s
I20260929 00:56:47.119318  5943 fs_manager.cc:642] Opened local filesystem: /tmp/dist-test-taskeXDuD2/test-tmp/ts_authz-itest.0.AuthzProviders_TSAuthzITest.TableScanCLI_Ranger.1790643240301354-5167-0/minicluster-data/master-0/data,/tmp/dist-test-taskeXDuD2/test-tmp/ts_authz-itest.0.AuthzProviders_TSAuthzITest.TableScanCLI_Ranger.1790643240301354-5167-0/minicluster-data/master-0/wal
uuid: "6cc4b87aabff4a70a3114889706df935"
format_stamp: "Formatted at 2026-09-29 00:56:47 on dist-test-slave-w3ts"
I20260929 00:56:47.119501  5943 fs_report.cc:383] FS layout report
--------------------
wal directory: /tmp/dist-test-taskeXDuD2/test-tmp/ts_authz-itest.0.AuthzProviders_TSAuthzITest.TableScanCLI_Ranger.1790643240301354-5167-0/minicluster-data/master-0/wal
metadata directory: /tmp/dist-test-taskeXDuD2/test-tmp/ts_authz-itest.0.AuthzProviders_TSAuthzITest.TableScanCLI_Ranger.1790643240301354-5167-0/minicluster-data/master-0/wal
1 data directories: /tmp/dist-test-taskeXDuD2/test-tmp/ts_authz-itest.0.AuthzProviders_TSAuthzITest.TableScanCLI_Ranger.1790643240301354-5167-0/minicluster-data/master-0/data/data
Total live blocks: 0
Total live bytes: 0
Total live bytes (after alignment): 0
Total number of LBM containers: 0 (0 full)
Did not check for missing blocks
Did not check for orphaned blocks
Total full LBM containers with extra space: 0 (0 repaired)
Total full LBM container extra space in bytes: 0 (0 repaired)
Total incomplete LBM containers: 0 (0 repaired)
Total LBM partial records: 0 (0 repaired)
Total corrupted LBM metadata records in RocksDB: 0 (0 repaired)
I20260929 00:56:47.155383  5943 rpc_server.cc:225] running with OpenSSL 1.0.2k-fips  26 Jan 2017
I20260929 00:56:47.159503  5943 env_posix.cc:2256] Not raising this process' running threads per effective uid limit of 18446744073709551615; it is already as high as it can go
I20260929 00:56:47.159754  5943 kserver.cc:163] Server-wide thread pool size limit: 3276
I20260929 00:56:47.176221  5943 rpc_server.cc:307] RPC server started. Bound to: 127.5.11.254:46807
I20260929 00:56:47.176232  6009 acceptor_pool.cc:254] collecting diagnostics on the listening RPC socket 127.5.11.254:46807 every 8 connection(s)
I20260929 00:56:47.177606  5943 server_base.cc:1166] Dumped server information to /tmp/dist-test-taskeXDuD2/test-tmp/ts_authz-itest.0.AuthzProviders_TSAuthzITest.TableScanCLI_Ranger.1790643240301354-5167-0/minicluster-data/master-0/data/info.pb
I20260929 00:56:47.181458  6010 data_dirs.cc:395] Could only allocate 1 dirs of requested 3 for tablet 00000000000000000000000000000000. 1 dirs total, 0 dirs full, 0 dirs failed
I20260929 00:56:47.182739  5167 external_mini_cluster.cc:1388] Started /tmp/dist-test-taskeXDuD2/build/asan/bin/kudu as pid 5943
I20260929 00:56:47.182961  5167 external_mini_cluster.cc:1402] Reading /tmp/dist-test-taskeXDuD2/test-tmp/ts_authz-itest.0.AuthzProviders_TSAuthzITest.TableScanCLI_Ranger.1790643240301354-5167-0/minicluster-data/master-0/wal/instance
I20260929 00:56:47.192328  6010 tablet_bootstrap.cc:492] T 00000000000000000000000000000000 P 6cc4b87aabff4a70a3114889706df935: Bootstrap starting.
I20260929 00:56:47.195470  6010 tablet_bootstrap.cc:654] T 00000000000000000000000000000000 P 6cc4b87aabff4a70a3114889706df935: Neither blocks nor log segments found. Creating new log.
I20260929 00:56:47.196463  6010 log.cc:824] T 00000000000000000000000000000000 P 6cc4b87aabff4a70a3114889706df935: Log is configured to *not* fsync() on all Append() calls
I20260929 00:56:47.199162  6010 tablet_bootstrap.cc:492] T 00000000000000000000000000000000 P 6cc4b87aabff4a70a3114889706df935: No bootstrap required, opened a new log
I20260929 00:56:47.206219  6010 raft_consensus.cc:348] T 00000000000000000000000000000000 P 6cc4b87aabff4a70a3114889706df935 [term 0 FOLLOWER]: Replica starting. Triggering 0 pending ops. Active config: opid_index: -1 OBSOLETE_local: true peers { permanent_uuid: "6cc4b87aabff4a70a3114889706df935" member_type: VOTER last_known_addr { host: "127.5.11.254" port: 46807 } }
I20260929 00:56:47.206609  6010 raft_consensus.cc:374] T 00000000000000000000000000000000 P 6cc4b87aabff4a70a3114889706df935 [term 0 FOLLOWER]: Consensus starting up: Expiring failure detector timer to make a prompt election more likely
I20260929 00:56:47.206700  6010 raft_consensus.cc:729] T 00000000000000000000000000000000 P 6cc4b87aabff4a70a3114889706df935 [term 0 FOLLOWER]: Becoming Follower/Learner. State: Replica: 6cc4b87aabff4a70a3114889706df935, State: Initialized, Role: FOLLOWER
I20260929 00:56:47.207448  6010 consensus_queue.cc:260] T 00000000000000000000000000000000 P 6cc4b87aabff4a70a3114889706df935 [NON_LEADER]: Queue going to NON_LEADER mode. State: All replicated index: 0, Majority replicated index: 0, Committed index: 0, Last appended: 0.0, Last appended by leader: 0, Current term: 0, Majority size: -1, State: 0, Mode: NON_LEADER, active raft config: opid_index: -1 OBSOLETE_local: true peers { permanent_uuid: "6cc4b87aabff4a70a3114889706df935" member_type: VOTER last_known_addr { host: "127.5.11.254" port: 46807 } }
I20260929 00:56:47.207732  6010 raft_consensus.cc:388] T 00000000000000000000000000000000 P 6cc4b87aabff4a70a3114889706df935 [term 0 FOLLOWER]: Only one voter in the Raft config. Triggering election immediately
I20260929 00:56:47.207873  6010 raft_consensus.cc:482] T 00000000000000000000000000000000 P 6cc4b87aabff4a70a3114889706df935 [term 0 FOLLOWER]: Starting leader election (initial election of a single-replica configuration)
I20260929 00:56:47.208050  6010 raft_consensus.cc:3037] T 00000000000000000000000000000000 P 6cc4b87aabff4a70a3114889706df935 [term 0 FOLLOWER]: Advancing to term 1
I20260929 00:56:47.211102  6010 raft_consensus.cc:504] T 00000000000000000000000000000000 P 6cc4b87aabff4a70a3114889706df935 [term 1 FOLLOWER]: Starting leader election with config: opid_index: -1 OBSOLETE_local: true peers { permanent_uuid: "6cc4b87aabff4a70a3114889706df935" member_type: VOTER last_known_addr { host: "127.5.11.254" port: 46807 } }
I20260929 00:56:47.211714  6010 leader_election.cc:302] T 00000000000000000000000000000000 P 6cc4b87aabff4a70a3114889706df935 [CANDIDATE]: Term 1 election: Election decided. Result: candidate won. Election summary: received 1 responses out of 1 voters: 1 yes votes; 0 no votes. yes voters: 6cc4b87aabff4a70a3114889706df935; no voters: 
Sep 29 00:56:47 dist-test-slave-w3ts krb5kdc[5599](info): TGS_REQ (2 etypes {17 16}) 127.0.0.1: ISSUE: authtime 1790643374, etypes {rep=17 tkt=17 ses=17}, test-admin@KRBTEST.COM for kudu/127.5.11.254@KRBTEST.COM
I20260929 00:56:47.212345  6010 leader_election.cc:288] T 00000000000000000000000000000000 P 6cc4b87aabff4a70a3114889706df935 [CANDIDATE]: Term 1 election: Requested vote from peers 
I20260929 00:56:47.212525  6015 raft_consensus.cc:2781] T 00000000000000000000000000000000 P 6cc4b87aabff4a70a3114889706df935 [term 1 FOLLOWER]: Leader election won for term 1
I20260929 00:56:47.213532  6015 raft_consensus.cc:686] T 00000000000000000000000000000000 P 6cc4b87aabff4a70a3114889706df935 [term 1 LEADER]: Becoming Leader. State: Replica: 6cc4b87aabff4a70a3114889706df935, State: Running, Role: LEADER
I20260929 00:56:47.214164  6015 consensus_queue.cc:237] T 00000000000000000000000000000000 P 6cc4b87aabff4a70a3114889706df935 [LEADER]: Queue going to LEADER mode. State: All replicated index: 0, Majority replicated index: 0, Committed index: 0, Last appended: 0.0, Last appended by leader: 0, Current term: 1, Majority size: 1, State: 0, Mode: LEADER, active raft config: opid_index: -1 OBSOLETE_local: true peers { permanent_uuid: "6cc4b87aabff4a70a3114889706df935" member_type: VOTER last_known_addr { host: "127.5.11.254" port: 46807 } }
I20260929 00:56:47.214565  6010 sys_catalog.cc:564] T 00000000000000000000000000000000 P 6cc4b87aabff4a70a3114889706df935 [sys.catalog]: configured and running, proceeding with master startup.
I20260929 00:56:47.217216  6016 sys_catalog.cc:455] T 00000000000000000000000000000000 P 6cc4b87aabff4a70a3114889706df935 [sys.catalog]: SysCatalogTable state changed. Reason: RaftConsensus started. Latest consensus state: current_term: 1 leader_uuid: "6cc4b87aabff4a70a3114889706df935" committed_config { opid_index: -1 OBSOLETE_local: true peers { permanent_uuid: "6cc4b87aabff4a70a3114889706df935" member_type: VOTER last_known_addr { host: "127.5.11.254" port: 46807 } } }
I20260929 00:56:47.217604  6016 sys_catalog.cc:458] T 00000000000000000000000000000000 P 6cc4b87aabff4a70a3114889706df935 [sys.catalog]: This master's current role is: LEADER
I20260929 00:56:47.218881  6017 sys_catalog.cc:455] T 00000000000000000000000000000000 P 6cc4b87aabff4a70a3114889706df935 [sys.catalog]: SysCatalogTable state changed. Reason: New leader 6cc4b87aabff4a70a3114889706df935. Latest consensus state: current_term: 1 leader_uuid: "6cc4b87aabff4a70a3114889706df935" committed_config { opid_index: -1 OBSOLETE_local: true peers { permanent_uuid: "6cc4b87aabff4a70a3114889706df935" member_type: VOTER last_known_addr { host: "127.5.11.254" port: 46807 } } }
I20260929 00:56:47.219223  6017 sys_catalog.cc:458] T 00000000000000000000000000000000 P 6cc4b87aabff4a70a3114889706df935 [sys.catalog]: This master's current role is: LEADER
I20260929 00:56:47.220507  6021 catalog_manager.cc:1475] Loading table and tablet metadata into memory...
I20260929 00:56:47.226446  6021 catalog_manager.cc:1484] Initializing Kudu cluster ID...
I20260929 00:56:47.237447  6021 catalog_manager.cc:1347] Generated new cluster ID: 2a390f4f00fb41a485b92bb5497ecc58
I20260929 00:56:47.237663  6021 catalog_manager.cc:1495] Initializing Kudu internal certificate authority...
I20260929 00:56:47.238865  6010 ranger_client.cc:318] Using new properties file: /tmp/dist-test-taskeXDuD2/test-tmp/ts_authz-itest.0.AuthzProviders_TSAuthzITest.TableScanCLI_Ranger.1790643240301354-5167-0/minicluster-data/master-0/logs/kudu-ranger-subprocess-log4j2.properties
I20260929 00:56:47.253597  6021 catalog_manager.cc:1370] Generated new certificate authority record
I20260929 00:56:47.255071  6021 catalog_manager.cc:1504] Loading token signing keys...
I20260929 00:56:47.267366  6021 catalog_manager.cc:5868] T 00000000000000000000000000000000 P 6cc4b87aabff4a70a3114889706df935: Generated new TSK 0
I20260929 00:56:47.268595  6021 catalog_manager.cc:1514] Initializing in-progress tserver states...
WARNING: no policy specified for kudu/127.5.11.193@KRBTEST.COM; defaulting to no policy
Authenticating as principal test-admin/admin@KRBTEST.COM with password.
Principal "kudu/127.5.11.193@KRBTEST.COM" created.
Authenticating as principal test-admin/admin@KRBTEST.COM with password.
Entry for principal kudu/127.5.11.193 with kvno 2, encryption type aes256-cts-hmac-sha1-96 added to keytab WRFILE:/tmp/dist-test-taskeXDuD2/test-tmp/ts_authz-itest.0.AuthzProviders_TSAuthzITest.TableScanCLI_Ranger.1790643240301354-5167-0/krb5kdc/kudu_127.5.11.193.keytab.
Entry for principal kudu/127.5.11.193 with kvno 2, encryption type aes128-cts-hmac-sha1-96 added to keytab WRFILE:/tmp/dist-test-taskeXDuD2/test-tmp/ts_authz-itest.0.AuthzProviders_TSAuthzITest.TableScanCLI_Ranger.1790643240301354-5167-0/krb5kdc/kudu_127.5.11.193.keytab.
I20260929 00:56:47.957549  5167 external_mini_cluster.cc:1326] Running /tmp/dist-test-taskeXDuD2/build/asan/bin/kudu
/tmp/dist-test-taskeXDuD2/build/asan/bin/kudu
--fs_wal_dir=/tmp/dist-test-taskeXDuD2/test-tmp/ts_authz-itest.0.AuthzProviders_TSAuthzITest.TableScanCLI_Ranger.1790643240301354-5167-0/minicluster-data/ts-0/wal
--fs_data_dirs=/tmp/dist-test-taskeXDuD2/test-tmp/ts_authz-itest.0.AuthzProviders_TSAuthzITest.TableScanCLI_Ranger.1790643240301354-5167-0/minicluster-data/ts-0/data
--block_manager=log
--webserver_interface=localhost
--never_fsync
--enable_minidumps=false
--redact=none
--metrics_log_interval_ms=1000
--log_dir=/tmp/dist-test-taskeXDuD2/test-tmp/ts_authz-itest.0.AuthzProviders_TSAuthzITest.TableScanCLI_Ranger.1790643240301354-5167-0/minicluster-data/ts-0/logs
--server_dump_info_path=/tmp/dist-test-taskeXDuD2/test-tmp/ts_authz-itest.0.AuthzProviders_TSAuthzITest.TableScanCLI_Ranger.1790643240301354-5167-0/minicluster-data/ts-0/data/info.pb
--server_dump_info_format=pb
--rpc_server_allow_ephemeral_ports
--unlock_experimental_flags
--unlock_unsafe_flags
--logtostderr
--logbuflevel=-1
--ipki_server_key_size=768
--openssl_security_level_override=0
tserver
run
--rpc_bind_addresses=127.5.11.193:0
--local_ip_for_outbound_sockets=127.5.11.193
--webserver_interface=127.5.11.193
--webserver_port=0
--tserver_master_addrs=127.5.11.254:46807
--keytab_file=/tmp/dist-test-taskeXDuD2/test-tmp/ts_authz-itest.0.AuthzProviders_TSAuthzITest.TableScanCLI_Ranger.1790643240301354-5167-0/krb5kdc/kudu_127.5.11.193.keytab
--principal=kudu/127.5.11.193
--rpc_authentication=required
--superuser_acl=test-admin
--user_acl=test-user
--builtin_ntp_servers=127.5.11.212:37241
--builtin_ntp_poll_interval_ms=100
--ntp_initial_sync_wait_secs=10
--time_source=builtin
--user_acl=user0,user1,user2
--tserver_enforce_access_control=true with env {KRB5CCNAME=/tmp/dist-test-taskeXDuD2/test-tmp/ts_authz-itest.0.AuthzProviders_TSAuthzITest.TableScanCLI_Ranger.1790643240301354-5167-0/krb5kdc/krb5cc,KRB5_CONFIG=/tmp/dist-test-taskeXDuD2/test-tmp/ts_authz-itest.0.AuthzProviders_TSAuthzITest.TableScanCLI_Ranger.1790643240301354-5167-0/krb5kdc/krb5.conf,KRB5_KDC_PROFILE=/tmp/dist-test-taskeXDuD2/test-tmp/ts_authz-itest.0.AuthzProviders_TSAuthzITest.TableScanCLI_Ranger.1790643240301354-5167-0/krb5kdc/kdc.conf,KUDU_ENABLE_KRB5_REALM_FIX=yes}
Sep 29 00:56:48 dist-test-slave-w3ts krb5kdc[5599](info): AS_REQ (1 etypes {17}) 127.0.0.1: ISSUE: authtime 1790643408, etypes {rep=17 tkt=17 ses=17}, kudu/127.5.11.254@KRBTEST.COM for krbtgt/KRBTEST.COM@KRBTEST.COM
W20260929 00:56:48.404548  6055 flags.cc:425] Enabled unsafe flag: --openssl_security_level_override=0
W20260929 00:56:48.405076  6055 flags.cc:425] Enabled unsafe flag: --rpc_server_allow_ephemeral_ports=true
W20260929 00:56:48.405308  6055 flags.cc:425] Enabled unsafe flag: --never_fsync=true
W20260929 00:56:48.417377  6055 flags.cc:425] Enabled experimental flag: --ipki_server_key_size=768
W20260929 00:56:48.417726  6055 flags.cc:425] Enabled experimental flag: --local_ip_for_outbound_sockets=127.5.11.193
I20260929 00:56:48.433739  6055 tablet_server_runner.cc:78] Tablet server non-default flags:
--builtin_ntp_poll_interval_ms=100
--builtin_ntp_servers=127.5.11.212:37241
--ntp_initial_sync_wait_secs=10
--time_source=builtin
--fs_data_dirs=/tmp/dist-test-taskeXDuD2/test-tmp/ts_authz-itest.0.AuthzProviders_TSAuthzITest.TableScanCLI_Ranger.1790643240301354-5167-0/minicluster-data/ts-0/data
--fs_wal_dir=/tmp/dist-test-taskeXDuD2/test-tmp/ts_authz-itest.0.AuthzProviders_TSAuthzITest.TableScanCLI_Ranger.1790643240301354-5167-0/minicluster-data/ts-0/wal
--keytab_file=/tmp/dist-test-taskeXDuD2/test-tmp/ts_authz-itest.0.AuthzProviders_TSAuthzITest.TableScanCLI_Ranger.1790643240301354-5167-0/krb5kdc/kudu_127.5.11.193.keytab
--principal=kudu/127.5.11.193
--ipki_server_key_size=768
--openssl_security_level_override=0
--rpc_bind_addresses=127.5.11.193:0
--rpc_server_allow_ephemeral_ports=true
--rpc_authentication=required
--superuser_acl=<redacted>
--user_acl=<redacted>
--metrics_log_interval_ms=1000
--server_dump_info_format=pb
--server_dump_info_path=/tmp/dist-test-taskeXDuD2/test-tmp/ts_authz-itest.0.AuthzProviders_TSAuthzITest.TableScanCLI_Ranger.1790643240301354-5167-0/minicluster-data/ts-0/data/info.pb
--webserver_interface=127.5.11.193
--webserver_port=0
--tserver_master_addrs=127.5.11.254:46807
--tserver_enforce_access_control=true
--never_fsync=true
--redact=none
--unlock_experimental_flags=true
--unlock_unsafe_flags=true
--enable_minidumps=false
--local_ip_for_outbound_sockets=127.5.11.193
--log_dir=/tmp/dist-test-taskeXDuD2/test-tmp/ts_authz-itest.0.AuthzProviders_TSAuthzITest.TableScanCLI_Ranger.1790643240301354-5167-0/minicluster-data/ts-0/logs
--logbuflevel=-1
--logtostderr=true

Tablet server version:
kudu 1.18.0-SNAPSHOT
revision c2d25d5f57d102d9ad9869eaf208d035a22e18aa
build type FASTDEBUG
built by systest at 28 Sep 2026 23:53:35 UTC on ccycloud.quasar-vwuirl.root.comops.site
build id 4678654
ASAN enabled
I20260929 00:56:48.435672  6055 env_posix.cc:2256] Not raising this process' open files per process limit of 1048576; it is already as high as it can go
I20260929 00:56:48.437629  6055 file_cache.cc:493] Constructed file cache file cache with capacity 419430
W20260929 00:56:48.454720  6065 instance_detector.cc:116] could not retrieve AWS instance metadata: Network error: curl error: HTTP response code said error: The requested URL returned error: 404
W20260929 00:56:48.454779  6066 instance_detector.cc:116] could not retrieve Azure instance metadata: Network error: curl error: HTTP response code said error: The requested URL returned error: 404
W20260929 00:56:48.462306  6068 instance_detector.cc:116] could not retrieve OpenStack instance metadata: Network error: curl error: HTTP response code said error: The requested URL returned error: 404
I20260929 00:56:48.463102  6055 server_base.cc:1034] running on GCE node
I20260929 00:56:48.463965  6055 hybrid_clock.cc:584] initializing the hybrid clock with 'builtin' time source
I20260929 00:56:48.465332  6055 hybrid_clock.cc:630] waiting up to --ntp_initial_sync_wait_secs=10 seconds for the clock to synchronize
I20260929 00:56:48.466650  6055 hybrid_clock.cc:648] HybridClock initialized: now 1790643408466553 us; error 55 us; skew 500 ppm
I20260929 00:56:48.467034  6055 server_base.cc:834] Flag tcmalloc_max_total_thread_cache_bytes is not working since tcmalloc is not enabled.
Sep 29 00:56:48 dist-test-slave-w3ts krb5kdc[5599](info): AS_REQ (2 etypes {17 16}) 127.0.0.1: ISSUE: authtime 1790643408, etypes {rep=17 tkt=17 ses=17}, kudu/127.5.11.193@KRBTEST.COM for krbtgt/KRBTEST.COM@KRBTEST.COM
I20260929 00:56:48.471338  6055 init.cc:377] Logged in from keytab as kudu/127.5.11.193@KRBTEST.COM (short username kudu)
I20260929 00:56:48.473423  6055 webserver.cc:460] Webserver started at http://127.5.11.193:34077/ using document root <none> and password file <none>
I20260929 00:56:48.474436  6055 fs_manager.cc:359] Metadata directory not provided
I20260929 00:56:48.474566  6055 fs_manager.cc:365] Using write-ahead log directory (fs_wal_dir) as metadata directory
I20260929 00:56:48.474956  6055 server_base.cc:882] This appears to be a new deployment of Kudu; creating new FS layout
I20260929 00:56:48.478775  6055 fs_manager.cc:1063] Generated new instance metadata in path /tmp/dist-test-taskeXDuD2/test-tmp/ts_authz-itest.0.AuthzProviders_TSAuthzITest.TableScanCLI_Ranger.1790643240301354-5167-0/minicluster-data/ts-0/data/instance:
uuid: "c81fc9538aa24f519c348fae922c9743"
format_stamp: "Formatted at 2026-09-29 00:56:48 on dist-test-slave-w3ts"
I20260929 00:56:48.479902  6055 fs_manager.cc:1063] Generated new instance metadata in path /tmp/dist-test-taskeXDuD2/test-tmp/ts_authz-itest.0.AuthzProviders_TSAuthzITest.TableScanCLI_Ranger.1790643240301354-5167-0/minicluster-data/ts-0/wal/instance:
uuid: "c81fc9538aa24f519c348fae922c9743"
format_stamp: "Formatted at 2026-09-29 00:56:48 on dist-test-slave-w3ts"
I20260929 00:56:48.488933  6055 fs_manager.cc:691] Time spent creating directory manager: real 0.009s	user 0.003s	sys 0.004s
I20260929 00:56:48.499598  6075 log_block_manager.cc:3774] Time spent loading block containers with low live blocks: real 0.000s	user 0.000s	sys 0.000s
I20260929 00:56:48.501657  6055 fs_manager.cc:725] Time spent opening block manager: real 0.010s	user 0.004s	sys 0.007s
I20260929 00:56:48.501901  6055 fs_manager.cc:642] Opened local filesystem: /tmp/dist-test-taskeXDuD2/test-tmp/ts_authz-itest.0.AuthzProviders_TSAuthzITest.TableScanCLI_Ranger.1790643240301354-5167-0/minicluster-data/ts-0/data,/tmp/dist-test-taskeXDuD2/test-tmp/ts_authz-itest.0.AuthzProviders_TSAuthzITest.TableScanCLI_Ranger.1790643240301354-5167-0/minicluster-data/ts-0/wal
uuid: "c81fc9538aa24f519c348fae922c9743"
format_stamp: "Formatted at 2026-09-29 00:56:48 on dist-test-slave-w3ts"
I20260929 00:56:48.502208  6055 fs_report.cc:383] FS layout report
--------------------
wal directory: /tmp/dist-test-taskeXDuD2/test-tmp/ts_authz-itest.0.AuthzProviders_TSAuthzITest.TableScanCLI_Ranger.1790643240301354-5167-0/minicluster-data/ts-0/wal
metadata directory: /tmp/dist-test-taskeXDuD2/test-tmp/ts_authz-itest.0.AuthzProviders_TSAuthzITest.TableScanCLI_Ranger.1790643240301354-5167-0/minicluster-data/ts-0/wal
1 data directories: /tmp/dist-test-taskeXDuD2/test-tmp/ts_authz-itest.0.AuthzProviders_TSAuthzITest.TableScanCLI_Ranger.1790643240301354-5167-0/minicluster-data/ts-0/data/data
Total live blocks: 0
Total live bytes: 0
Total live bytes (after alignment): 0
Total number of LBM containers: 0 (0 full)
Did not check for missing blocks
Did not check for orphaned blocks
Total full LBM containers with extra space: 0 (0 repaired)
Total full LBM container extra space in bytes: 0 (0 repaired)
Total incomplete LBM containers: 0 (0 repaired)
Total LBM partial records: 0 (0 repaired)
Total corrupted LBM metadata records in RocksDB: 0 (0 repaired)
I20260929 00:56:48.532560  6055 rpc_server.cc:225] running with OpenSSL 1.0.2k-fips  26 Jan 2017
I20260929 00:56:48.538261  6055 env_posix.cc:2256] Not raising this process' running threads per effective uid limit of 18446744073709551615; it is already as high as it can go
I20260929 00:56:48.538623  6055 kserver.cc:163] Server-wide thread pool size limit: 3276
I20260929 00:56:48.545785  6055 txn_system_client.cc:433] TxnSystemClient initialization is disabled...
I20260929 00:56:48.552492  6055 ts_tablet_manager.cc:579] Loaded tablet metadata (0 total tablets, 0 live tablets)
I20260929 00:56:48.552671  6055 ts_tablet_manager.cc:525] Time spent load tablet metadata: real 0.000s	user 0.000s	sys 0.000s
I20260929 00:56:48.552870  6055 ts_tablet_manager.cc:610] Registered 0 tablets
I20260929 00:56:48.552994  6055 ts_tablet_manager.cc:589] Time spent register tablets: real 0.000s	user 0.000s	sys 0.000s
I20260929 00:56:48.609166  6055 rpc_server.cc:307] RPC server started. Bound to: 127.5.11.193:39787
I20260929 00:56:48.609282  6187 acceptor_pool.cc:254] collecting diagnostics on the listening RPC socket 127.5.11.193:39787 every 8 connection(s)
I20260929 00:56:48.611088  6055 server_base.cc:1166] Dumped server information to /tmp/dist-test-taskeXDuD2/test-tmp/ts_authz-itest.0.AuthzProviders_TSAuthzITest.TableScanCLI_Ranger.1790643240301354-5167-0/minicluster-data/ts-0/data/info.pb
I20260929 00:56:48.619141  5167 external_mini_cluster.cc:1388] Started /tmp/dist-test-taskeXDuD2/build/asan/bin/kudu as pid 6055
I20260929 00:56:48.619387  5167 external_mini_cluster.cc:1402] Reading /tmp/dist-test-taskeXDuD2/test-tmp/ts_authz-itest.0.AuthzProviders_TSAuthzITest.TableScanCLI_Ranger.1790643240301354-5167-0/minicluster-data/ts-0/wal/instance
Sep 29 00:56:48 dist-test-slave-w3ts krb5kdc[5599](info): TGS_REQ (2 etypes {17 16}) 127.0.0.1: ISSUE: authtime 1790643408, etypes {rep=17 tkt=17 ses=17}, kudu/127.5.11.193@KRBTEST.COM for kudu/127.5.11.254@KRBTEST.COM
I20260929 00:56:48.663035  6188 heartbeater.cc:347] Connected to a master server at 127.5.11.254:46807
I20260929 00:56:48.663383  6188 heartbeater.cc:464] Registering TS with master...
I20260929 00:56:48.664256  6188 heartbeater.cc:511] Master 127.5.11.254:46807 requested a full tablet report, sending...
I20260929 00:56:48.666818  5975 ts_manager.cc:194] Registered new tserver with Master: c81fc9538aa24f519c348fae922c9743 (127.5.11.193:39787)
I20260929 00:56:48.668787  5975 master_service.cc:496] Signed X509 certificate for tserver {username='kudu', principal='kudu/127.5.11.193@KRBTEST.COM'} at 127.5.11.193:33121
I20260929 00:56:48.672432  5167 external_mini_cluster.cc:930] 1 TS(s) registered with all masters
Sep 29 00:56:48 dist-test-slave-w3ts krb5kdc[5599](info): TGS_REQ (2 etypes {17 16}) 127.0.0.1: ISSUE: authtime 1790643408, etypes {rep=17 tkt=17 ses=17}, kudu/127.5.11.254@KRBTEST.COM for HTTP/127.5.11.212@KRBTEST.COM
WARNING: no policy specified for kudu@KRBTEST.COM; defaulting to no policy
Authenticating as principal test-admin/admin@KRBTEST.COM with password.
Principal "kudu@KRBTEST.COM" created.
Sep 29 00:56:48 dist-test-slave-w3ts krb5kdc[5599](info): AS_REQ (2 etypes {17 16}) 127.0.0.1: ISSUE: authtime 1790643408, etypes {rep=17 tkt=17 ses=17}, kudu@KRBTEST.COM for krbtgt/KRBTEST.COM@KRBTEST.COM
Password for kudu@KRBTEST.COM: 
Sep 29 00:56:49 dist-test-slave-w3ts krb5kdc[5599](info): TGS_REQ (2 etypes {17 16}) 127.0.0.1: ISSUE: authtime 1790643408, etypes {rep=17 tkt=17 ses=17}, kudu/127.5.11.254@KRBTEST.COM for HTTP/127.5.11.212@KRBTEST.COM
I20260929 00:56:49.450315  5975 master_service.cc:963] request to refresh authz privileges cache from {username='test-admin', principal='test-admin@KRBTEST.COM'} at 127.0.0.1:38648
I20260929 00:56:49.673327  6188 heartbeater.cc:503] Master 127.5.11.254:46807 was elected leader, sending a full tablet report...
Sep 29 00:56:49 dist-test-slave-w3ts krb5kdc[5599](info): TGS_REQ (2 etypes {17 16}) 127.0.0.1: ISSUE: authtime 1790643408, etypes {rep=17 tkt=17 ses=17}, kudu/127.5.11.254@KRBTEST.COM for HTTP/127.5.11.212@KRBTEST.COM
Sep 29 00:56:49 dist-test-slave-w3ts krb5kdc[5599](info): TGS_REQ (2 etypes {17 16}) 127.0.0.1: ISSUE: authtime 1790643408, etypes {rep=17 tkt=17 ses=17}, kudu/127.5.11.254@KRBTEST.COM for HTTP/127.5.11.212@KRBTEST.COM
WARNING: no policy specified for test-admin@KRBTEST.COM; defaulting to no policy
add_principal: Principal or policy already exists while creating "test-admin@KRBTEST.COM".
Authenticating as principal kudu/admin@KRBTEST.COM with password.
Sep 29 00:56:49 dist-test-slave-w3ts krb5kdc[5599](info): AS_REQ (2 etypes {17 16}) 127.0.0.1: ISSUE: authtime 1790643409, etypes {rep=17 tkt=17 ses=17}, test-admin@KRBTEST.COM for krbtgt/KRBTEST.COM@KRBTEST.COM
Password for test-admin@KRBTEST.COM: 
Sep 29 00:56:49 dist-test-slave-w3ts krb5kdc[5599](info): TGS_REQ (2 etypes {17 16}) 127.0.0.1: ISSUE: authtime 1790643409, etypes {rep=17 tkt=17 ses=17}, test-admin@KRBTEST.COM for kudu/127.5.11.254@KRBTEST.COM
WARNING: no policy specified for user0@KRBTEST.COM; defaulting to no policy
Authenticating as principal test-admin/admin@KRBTEST.COM with password.
Principal "user0@KRBTEST.COM" created.
Sep 29 00:56:50 dist-test-slave-w3ts krb5kdc[5599](info): AS_REQ (2 etypes {17 16}) 127.0.0.1: ISSUE: authtime 1790643410, etypes {rep=17 tkt=17 ses=17}, user0@KRBTEST.COM for krbtgt/KRBTEST.COM@KRBTEST.COM
Password for user0@KRBTEST.COM: 
I20260929 00:56:50.054622  5975 catalog_manager.cc:1908] Servicing CreateTable request from {username='test-admin', principal='test-admin@KRBTEST.COM'} at 127.0.0.1:38664:
name: "db.table"
schema {
  columns {
    name: "col0"
    type: INT32
    is_key: true
    is_nullable: false
    encoding: AUTO_ENCODING
    compression: DEFAULT_COMPRESSION
    cfile_block_size: 0
    immutable: false
  }
  columns {
    name: "col1"
    type: INT32
    is_key: false
    is_nullable: true
    encoding: AUTO_ENCODING
    compression: DEFAULT_COMPRESSION
    cfile_block_size: 0
    immutable: false
  }
  columns {
    name: "col2"
    type: INT32
    is_key: false
    is_nullable: true
    encoding: AUTO_ENCODING
    compression: DEFAULT_COMPRESSION
    cfile_block_size: 0
    immutable: false
  }
}
num_replicas: 1
split_rows_range_bounds {
}
partition_schema {
  range_schema {
    columns {
      name: "col0"
    }
  }
}
owner: "user0"
I20260929 00:56:50.083652  6123 tablet_service.cc:1467] Processing CreateTablet for tablet 53a169b2a47042aea4425a664ce747f9 (DEFAULT_TABLE table=db.table [id=aff29c3270fc4a4dad1ad11fde904283]), partition=RANGE (col0) PARTITION UNBOUNDED
I20260929 00:56:50.084882  6123 data_dirs.cc:395] Could only allocate 1 dirs of requested 3 for tablet 53a169b2a47042aea4425a664ce747f9. 1 dirs total, 0 dirs full, 0 dirs failed
I20260929 00:56:50.094877  6230 tablet_bootstrap.cc:492] T 53a169b2a47042aea4425a664ce747f9 P c81fc9538aa24f519c348fae922c9743: Bootstrap starting.
I20260929 00:56:50.098130  6230 tablet_bootstrap.cc:654] T 53a169b2a47042aea4425a664ce747f9 P c81fc9538aa24f519c348fae922c9743: Neither blocks nor log segments found. Creating new log.
I20260929 00:56:50.099118  6230 log.cc:824] T 53a169b2a47042aea4425a664ce747f9 P c81fc9538aa24f519c348fae922c9743: Log is configured to *not* fsync() on all Append() calls
I20260929 00:56:50.101915  6230 tablet_bootstrap.cc:492] T 53a169b2a47042aea4425a664ce747f9 P c81fc9538aa24f519c348fae922c9743: No bootstrap required, opened a new log
I20260929 00:56:50.102192  6230 ts_tablet_manager.cc:1397] T 53a169b2a47042aea4425a664ce747f9 P c81fc9538aa24f519c348fae922c9743: Time spent bootstrapping tablet: real 0.007s	user 0.006s	sys 0.000s
I20260929 00:56:50.109557  6230 raft_consensus.cc:348] T 53a169b2a47042aea4425a664ce747f9 P c81fc9538aa24f519c348fae922c9743 [term 0 FOLLOWER]: Replica starting. Triggering 0 pending ops. Active config: opid_index: -1 OBSOLETE_local: true peers { permanent_uuid: "c81fc9538aa24f519c348fae922c9743" member_type: VOTER last_known_addr { host: "127.5.11.193" port: 39787 } }
I20260929 00:56:50.109967  6230 raft_consensus.cc:374] T 53a169b2a47042aea4425a664ce747f9 P c81fc9538aa24f519c348fae922c9743 [term 0 FOLLOWER]: Consensus starting up: Expiring failure detector timer to make a prompt election more likely
I20260929 00:56:50.110059  6230 raft_consensus.cc:729] T 53a169b2a47042aea4425a664ce747f9 P c81fc9538aa24f519c348fae922c9743 [term 0 FOLLOWER]: Becoming Follower/Learner. State: Replica: c81fc9538aa24f519c348fae922c9743, State: Initialized, Role: FOLLOWER
I20260929 00:56:50.110651  6230 consensus_queue.cc:260] T 53a169b2a47042aea4425a664ce747f9 P c81fc9538aa24f519c348fae922c9743 [NON_LEADER]: Queue going to NON_LEADER mode. State: All replicated index: 0, Majority replicated index: 0, Committed index: 0, Last appended: 0.0, Last appended by leader: 0, Current term: 0, Majority size: -1, State: 0, Mode: NON_LEADER, active raft config: opid_index: -1 OBSOLETE_local: true peers { permanent_uuid: "c81fc9538aa24f519c348fae922c9743" member_type: VOTER last_known_addr { host: "127.5.11.193" port: 39787 } }
I20260929 00:56:50.110872  6230 raft_consensus.cc:388] T 53a169b2a47042aea4425a664ce747f9 P c81fc9538aa24f519c348fae922c9743 [term 0 FOLLOWER]: Only one voter in the Raft config. Triggering election immediately
I20260929 00:56:50.111001  6230 raft_consensus.cc:482] T 53a169b2a47042aea4425a664ce747f9 P c81fc9538aa24f519c348fae922c9743 [term 0 FOLLOWER]: Starting leader election (initial election of a single-replica configuration)
I20260929 00:56:50.111153  6230 raft_consensus.cc:3037] T 53a169b2a47042aea4425a664ce747f9 P c81fc9538aa24f519c348fae922c9743 [term 0 FOLLOWER]: Advancing to term 1
I20260929 00:56:50.113360  6230 raft_consensus.cc:504] T 53a169b2a47042aea4425a664ce747f9 P c81fc9538aa24f519c348fae922c9743 [term 1 FOLLOWER]: Starting leader election with config: opid_index: -1 OBSOLETE_local: true peers { permanent_uuid: "c81fc9538aa24f519c348fae922c9743" member_type: VOTER last_known_addr { host: "127.5.11.193" port: 39787 } }
I20260929 00:56:50.113840  6230 leader_election.cc:302] T 53a169b2a47042aea4425a664ce747f9 P c81fc9538aa24f519c348fae922c9743 [CANDIDATE]: Term 1 election: Election decided. Result: candidate won. Election summary: received 1 responses out of 1 voters: 1 yes votes; 0 no votes. yes voters: c81fc9538aa24f519c348fae922c9743; no voters: 
I20260929 00:56:50.114434  6230 leader_election.cc:288] T 53a169b2a47042aea4425a664ce747f9 P c81fc9538aa24f519c348fae922c9743 [CANDIDATE]: Term 1 election: Requested vote from peers 
I20260929 00:56:50.114601  6232 raft_consensus.cc:2781] T 53a169b2a47042aea4425a664ce747f9 P c81fc9538aa24f519c348fae922c9743 [term 1 FOLLOWER]: Leader election won for term 1
I20260929 00:56:50.115191  6232 raft_consensus.cc:686] T 53a169b2a47042aea4425a664ce747f9 P c81fc9538aa24f519c348fae922c9743 [term 1 LEADER]: Becoming Leader. State: Replica: c81fc9538aa24f519c348fae922c9743, State: Running, Role: LEADER
I20260929 00:56:50.115808  6232 consensus_queue.cc:237] T 53a169b2a47042aea4425a664ce747f9 P c81fc9538aa24f519c348fae922c9743 [LEADER]: Queue going to LEADER mode. State: All replicated index: 0, Majority replicated index: 0, Committed index: 0, Last appended: 0.0, Last appended by leader: 0, Current term: 1, Majority size: 1, State: 0, Mode: LEADER, active raft config: opid_index: -1 OBSOLETE_local: true peers { permanent_uuid: "c81fc9538aa24f519c348fae922c9743" member_type: VOTER last_known_addr { host: "127.5.11.193" port: 39787 } }
I20260929 00:56:50.116245  6230 ts_tablet_manager.cc:1428] T 53a169b2a47042aea4425a664ce747f9 P c81fc9538aa24f519c348fae922c9743: Time spent starting tablet: real 0.014s	user 0.010s	sys 0.004s
I20260929 00:56:50.121376  5975 catalog_manager.cc:5495] T 53a169b2a47042aea4425a664ce747f9 P c81fc9538aa24f519c348fae922c9743 reported cstate change: term changed from 0 to 1, leader changed from <none> to c81fc9538aa24f519c348fae922c9743 (127.5.11.193). New cstate: current_term: 1 leader_uuid: "c81fc9538aa24f519c348fae922c9743" committed_config { opid_index: -1 OBSOLETE_local: true peers { permanent_uuid: "c81fc9538aa24f519c348fae922c9743" member_type: VOTER last_known_addr { host: "127.5.11.193" port: 39787 } health_report { overall_health: HEALTHY } } }
I20260929 00:56:50.311100  5975 master_service.cc:963] request to refresh authz privileges cache from {username='test-admin', principal='test-admin@KRBTEST.COM'} at 127.0.0.1:38648
Sep 29 00:56:50 dist-test-slave-w3ts krb5kdc[5599](info): TGS_REQ (2 etypes {17 16}) 127.0.0.1: ISSUE: authtime 1790643408, etypes {rep=17 tkt=17 ses=17}, kudu/127.5.11.254@KRBTEST.COM for HTTP/127.5.11.212@KRBTEST.COM
Sep 29 00:56:50 dist-test-slave-w3ts krb5kdc[5599](info): TGS_REQ (2 etypes {17 16}) 127.0.0.1: ISSUE: authtime 1790643408, etypes {rep=17 tkt=17 ses=17}, kudu/127.5.11.254@KRBTEST.COM for HTTP/127.5.11.212@KRBTEST.COM
I20260929 00:56:50.576646  5975 master_service.cc:963] request to refresh authz privileges cache from {username='test-admin', principal='test-admin@KRBTEST.COM'} at 127.0.0.1:38648
Sep 29 00:56:50 dist-test-slave-w3ts krb5kdc[5599](info): TGS_REQ (2 etypes {17 16}) 127.0.0.1: ISSUE: authtime 1790643408, etypes {rep=17 tkt=17 ses=17}, kudu/127.5.11.254@KRBTEST.COM for HTTP/127.5.11.212@KRBTEST.COM
Sep 29 00:56:50 dist-test-slave-w3ts krb5kdc[5599](info): TGS_REQ (2 etypes {17 16}) 127.0.0.1: ISSUE: authtime 1790643408, etypes {rep=17 tkt=17 ses=17}, kudu/127.5.11.254@KRBTEST.COM for HTTP/127.5.11.212@KRBTEST.COM
Sep 29 00:56:51 dist-test-slave-w3ts krb5kdc[5599](info): TGS_REQ (2 etypes {17 16}) 127.0.0.1: ISSUE: authtime 1790643410, etypes {rep=17 tkt=17 ses=17}, user0@KRBTEST.COM for kudu/127.5.11.254@KRBTEST.COM
W20260929 00:56:51.594564  6103 tablet_service.cc:557] rejecting Scan request from {username='user0'} at 127.0.0.1:33822: authz token doesn't authorize column ID 11
W20260929 00:56:52.056646  6103 tablet_service.cc:557] rejecting Scan request from {username='user0'} at 127.0.0.1:33826: authz token doesn't authorize column ID 11
W20260929 00:56:52.550515  6103 tablet_service.cc:557] rejecting Scan request from {username='user0'} at 127.0.0.1:33836: authz token doesn't authorize column ID 11
W20260929 00:56:53.015802  6103 tablet_service.cc:557] rejecting Scan request from {username='user0'} at 127.0.0.1:33852: authz token doesn't authorize column ID 12
W20260929 00:56:53.488291  6103 tablet_service.cc:557] rejecting Scan request from {username='user0'} at 127.0.0.1:33856: authz token doesn't authorize column ID 12
W20260929 00:56:53.980685  6103 tablet_service.cc:557] rejecting Scan request from {username='user0'} at 127.0.0.1:33868: authz token doesn't authorize column ID 12
W20260929 00:56:54.472478  6103 tablet_service.cc:557] rejecting Scan request from {username='user0'} at 127.0.0.1:33884: authz token doesn't authorize column ID 12
W20260929 00:56:54.937444  6103 tablet_service.cc:557] rejecting Scan request from {username='user0'} at 127.0.0.1:33898: authz token doesn't authorize column ID 12
W20260929 00:56:55.416700  6103 tablet_service.cc:557] rejecting Scan request from {username='user0'} at 127.0.0.1:33908: authz token doesn't authorize column ID 12
W20260929 00:56:55.881189  6103 tablet_service.cc:557] rejecting Scan request from {username='user0'} at 127.0.0.1:33918: authz token doesn't authorize column ID 12
I20260929 00:56:55.959863  5167 external_mini_cluster.cc:1636] Attempting to check leaks for /tmp/dist-test-taskeXDuD2/build/asan/bin/kudu pid 6055
Sep 29 00:56:55 dist-test-slave-w3ts krb5kdc[5599](info): TGS_REQ (2 etypes {17 16}) 127.0.0.1: ISSUE: authtime 1790643410, etypes {rep=17 tkt=17 ses=17}, user0@KRBTEST.COM for kudu/127.5.11.193@KRBTEST.COM
W20260929 00:56:55.975528  6183 server_base.cc:1116] Unauthorized access attempt to method kudu.server.GenericService.CheckLeaks from {username='user0', principal='user0@KRBTEST.COM'} at 127.0.0.1:33934
W20260929 00:56:55.976264  5167 external_mini_cluster.cc:1652] Unable to check leaks on /tmp/dist-test-taskeXDuD2/build/asan/bin/kudu pid 6055: Remote error: Not authorized: unauthorized access to method: CheckLeaks
I20260929 00:56:55.976540  5167 external_mini_cluster.cc:1595] Killing /tmp/dist-test-taskeXDuD2/build/asan/bin/kudu with pid 6055
I20260929 00:56:55.992810  5167 external_mini_cluster.cc:1636] Attempting to check leaks for /tmp/dist-test-taskeXDuD2/build/asan/bin/kudu pid 5943
I20260929 00:56:55.993952  6005 generic_service.cc:196] Checking for leaks (request via RPC)
I20260929 00:56:56.106309  5167 external_mini_cluster.cc:1595] Killing /tmp/dist-test-taskeXDuD2/build/asan/bin/kudu with pid 5943
I20260929 00:56:56.126109  5167 mini_ranger.cc:66] Stopping Ranger...
I20260929 00:56:56.461608  5167 mini_ranger.cc:68] Stopped Ranger
2026-09-29 00:56:56.461 UTC [5629] LOG:  received smart shutdown request
2026-09-29 00:56:56.464 UTC [5629] LOG:  background worker "logical replication launcher" (PID 5638) exited with exit code 1
2026-09-29 00:56:56.465 UTC [5633] LOG:  shutting down
2026-09-29 00:56:56.733 UTC [5629] LOG:  database system is shut down
2026-09-29T00:56:56Z chronyd exiting
[       OK ] AuthzProviders/TSAuthzITest.TableScanCLI/Ranger (43595 ms)
[----------] 2 tests from AuthzProviders/TSAuthzITest (176450 ms total)

[----------] 1 test from AuthzProviders/TSAuthzTxnOpsITest
[ RUN      ] AuthzProviders/TSAuthzTxnOpsITest.BasicOperationsForAuthorizedUsers/Ranger
Loading random data
Initializing database '/tmp/dist-test-taskeXDuD2/test-tmp/ts_authz-itest.0.AuthzProviders_TSAuthzTxnOpsITest.BasicOperationsForAuthorizedUsers_Ranger.1790643240301354-5167-0/krb5kdc/principal' for realm 'KRBTEST.COM',
master key name 'K/M@KRBTEST.COM'
Sep 29 00:56:56 dist-test-slave-w3ts krb5kdc[6403](info): setting up network...
krb5kdc: setsockopt(10,IPV6_V6ONLY,1) worked
Sep 29 00:56:56 dist-test-slave-w3ts krb5kdc[6403](info): set up 2 sockets
Sep 29 00:56:56 dist-test-slave-w3ts krb5kdc[6403](info): commencing operation
krb5kdc: starting...
W20260929 00:56:57.797129  5167 mini_kdc.cc:121] Time spent starting KDC: real 0.970s	user 0.001s	sys 0.015s
WARNING: no policy specified for test-admin@KRBTEST.COM; defaulting to no policy
Authenticating as principal slave/admin@KRBTEST.COM with password.
Principal "test-admin@KRBTEST.COM" created.
WARNING: no policy specified for test-user@KRBTEST.COM; defaulting to no policy
Authenticating as principal slave/admin@KRBTEST.COM with password.
Principal "test-user@KRBTEST.COM" created.
WARNING: no policy specified for joe-interloper@KRBTEST.COM; defaulting to no policy
Authenticating as principal slave/admin@KRBTEST.COM with password.
Principal "joe-interloper@KRBTEST.COM" created.
Authenticating as principal slave/admin@KRBTEST.COM with password.
Entry for principal test-user with kvno 1, encryption type aes256-cts-hmac-sha1-96 added to keytab WRFILE:/tmp/dist-test-taskeXDuD2/test-tmp/ts_authz-itest.0.AuthzProviders_TSAuthzTxnOpsITest.BasicOperationsForAuthorizedUsers_Ranger.1790643240301354-5167-0/krb5kdc/test-user.keytab.
Entry for principal test-user with kvno 1, encryption type aes128-cts-hmac-sha1-96 added to keytab WRFILE:/tmp/dist-test-taskeXDuD2/test-tmp/ts_authz-itest.0.AuthzProviders_TSAuthzTxnOpsITest.BasicOperationsForAuthorizedUsers_Ranger.1790643240301354-5167-0/krb5kdc/test-user.keytab.
Sep 29 00:56:57 dist-test-slave-w3ts krb5kdc[6403](info): AS_REQ (2 etypes {17 16}) 127.0.0.1: ISSUE: authtime 1790643417, etypes {rep=17 tkt=17 ses=17}, test-admin@KRBTEST.COM for krbtgt/KRBTEST.COM@KRBTEST.COM
Password for test-admin@KRBTEST.COM: 
2026-09-29T00:56:57Z chronyd version 3.5 starting (+CMDMON +NTP +REFCLOCK +RTC -PRIVDROP -SCFILTER -SIGND +ASYNCDNS -SECHASH -IPV6 +DEBUG)
2026-09-29T00:56:57Z Disabled control of system clock
WARNING: no policy specified for rangeradmin/127.5.11.212@KRBTEST.COM; defaulting to no policy
Authenticating as principal test-admin/admin@KRBTEST.COM with password.
Principal "rangeradmin/127.5.11.212@KRBTEST.COM" created.
Authenticating as principal test-admin/admin@KRBTEST.COM with password.
Entry for principal rangeradmin/127.5.11.212@KRBTEST.COM with kvno 2, encryption type aes256-cts-hmac-sha1-96 added to keytab WRFILE:/tmp/dist-test-taskeXDuD2/test-tmp/ts_authz-itest.0.AuthzProviders_TSAuthzTxnOpsITest.BasicOperationsForAuthorizedUsers_Ranger.1790643240301354-5167-0/krb5kdc/rangeradmin_127.5.11.212@KRBTEST.COM.keytab.
Entry for principal rangeradmin/127.5.11.212@KRBTEST.COM with kvno 2, encryption type aes128-cts-hmac-sha1-96 added to keytab WRFILE:/tmp/dist-test-taskeXDuD2/test-tmp/ts_authz-itest.0.AuthzProviders_TSAuthzTxnOpsITest.BasicOperationsForAuthorizedUsers_Ranger.1790643240301354-5167-0/krb5kdc/rangeradmin_127.5.11.212@KRBTEST.COM.keytab.
WARNING: no policy specified for rangerlookup/127.5.11.212@KRBTEST.COM; defaulting to no policy
Authenticating as principal test-admin/admin@KRBTEST.COM with password.
Principal "rangerlookup/127.5.11.212@KRBTEST.COM" created.
Authenticating as principal test-admin/admin@KRBTEST.COM with password.
Entry for principal rangerlookup/127.5.11.212@KRBTEST.COM with kvno 2, encryption type aes256-cts-hmac-sha1-96 added to keytab WRFILE:/tmp/dist-test-taskeXDuD2/test-tmp/ts_authz-itest.0.AuthzProviders_TSAuthzTxnOpsITest.BasicOperationsForAuthorizedUsers_Ranger.1790643240301354-5167-0/krb5kdc/rangerlookup_127.5.11.212@KRBTEST.COM.keytab.
Entry for principal rangerlookup/127.5.11.212@KRBTEST.COM with kvno 2, encryption type aes128-cts-hmac-sha1-96 added to keytab WRFILE:/tmp/dist-test-taskeXDuD2/test-tmp/ts_authz-itest.0.AuthzProviders_TSAuthzTxnOpsITest.BasicOperationsForAuthorizedUsers_Ranger.1790643240301354-5167-0/krb5kdc/rangerlookup_127.5.11.212@KRBTEST.COM.keytab.
WARNING: no policy specified for HTTP/127.5.11.212@KRBTEST.COM; defaulting to no policy
Authenticating as principal test-admin/admin@KRBTEST.COM with password.
Principal "HTTP/127.5.11.212@KRBTEST.COM" created.
Authenticating as principal test-admin/admin@KRBTEST.COM with password.
Entry for principal HTTP/127.5.11.212@KRBTEST.COM with kvno 2, encryption type aes256-cts-hmac-sha1-96 added to keytab WRFILE:/tmp/dist-test-taskeXDuD2/test-tmp/ts_authz-itest.0.AuthzProviders_TSAuthzTxnOpsITest.BasicOperationsForAuthorizedUsers_Ranger.1790643240301354-5167-0/krb5kdc/HTTP_127.5.11.212@KRBTEST.COM.keytab.
Entry for principal HTTP/127.5.11.212@KRBTEST.COM with kvno 2, encryption type aes128-cts-hmac-sha1-96 added to keytab WRFILE:/tmp/dist-test-taskeXDuD2/test-tmp/ts_authz-itest.0.AuthzProviders_TSAuthzTxnOpsITest.BasicOperationsForAuthorizedUsers_Ranger.1790643240301354-5167-0/krb5kdc/HTTP_127.5.11.212@KRBTEST.COM.keytab.
I20260929 00:56:58.036077  5167 mini_postgres.cc:62] Running initdb...
The files belonging to this database system will be owned by user "slave".
This user must also own the server process.

The database cluster will be initialized with locale "C".
The default database encoding has accordingly been set to "SQL_ASCII".
The default text search configuration will be set to "english".

Data page checksums are disabled.

creating directory /tmp/dist-test-taskeXDuD2/test-tmp/ts_authz-itest.0.AuthzProviders_TSAuthzTxnOpsITest.BasicOperationsForAuthorizedUsers_Ranger.1790643240301354-5167-0/minicluster-data/postgres ... ok
creating subdirectories ... ok
selecting dynamic shared memory implementation ... posix
selecting default max_connections ... 100
selecting default shared_buffers ... 128MB
selecting default time zone ... Etc/UTC
creating configuration files ... ok
running bootstrap script ... ok
performing post-bootstrap initialization ... ok
syncing data to disk ... ok

initdb: warning: enabling "trust" authentication for local connections
You can change this by editing pg_hba.conf or using the option -A, or
--auth-local and --auth-host, the next time you run initdb.

Success. You can now start the database server using:

    /tmp/dist-test-taskeXDuD2/build/asan/bin/postgres/pg_ctl -D /tmp/dist-test-taskeXDuD2/test-tmp/ts_authz-itest.0.AuthzProviders_TSAuthzTxnOpsITest.BasicOperationsForAuthorizedUsers_Ranger.1790643240301354-5167-0/minicluster-data/postgres -l logfile start

2026-09-29 00:57:00.465 UTC [6433] LOG:  starting PostgreSQL 12.2 on x86_64-pc-linux-gnu, compiled by cc (GCC) 8.3.1 20190311 (Red Hat 8.3.1-3), 64-bit
2026-09-29 00:57:00.465 UTC [6433] LOG:  listening on IPv4 address "127.5.11.212", port 42617
2026-09-29 00:57:00.469 UTC [6433] LOG:  listening on Unix socket "/tmp/.s.PGSQL.42617"
2026-09-29 00:57:00.489 UTC [6436] LOG:  database system was shut down at 2026-09-29 00:56:59 UTC
2026-09-29 00:57:00.493 UTC [6433] LOG:  database system is ready to accept connections
I20260929 00:57:01.372808  5167 mini_postgres.cc:96] Postgres bound to 42617
2026-09-29 00:57:01.384 UTC [6444] FATAL:  database "slave" does not exist
127.5.11.212:42617 - accepting connections
I20260929 00:57:01.384871  5167 mini_ranger.cc:161] Starting Ranger...
I20260929 00:57:01.405501  5167 mini_ranger.cc:84] Created miniranger Postgres user
I20260929 00:57:01.882292  5167 mini_ranger.cc:87] Created ranger Postgres database
I20260929 00:57:01.882406  5167 mini_ranger.cc:178] Starting Ranger out of /tmp/dist-test-taskeXDuD2/test-tmp/ts_authz-itest.0.AuthzProviders_TSAuthzTxnOpsITest.BasicOperationsForAuthorizedUsers_Ranger.1790643240301354-5167-0/minicluster-data/ranger-admin
2026-09-29 00:57:02,154  [I] DB FLAVOR :POSTGRES
2026-09-29 00:57:02,155  [I] --------- Verifying Ranger DB connection ---------
2026-09-29 00:57:02,155  [I] Checking connection..
2026-09-29 00:57:02,155  [JISQL] /usr/lib/jvm/java-1.8.0-openjdk-amd64/bin/java  -cp /tmp/dist-test-taskeXDuD2/build/asan/bin/postgresql.jar:/tmp/dist-test-taskeXDuD2/thirdparty/src/ranger-2.1.0-admin/jisql/lib/* org.apache.util.sql.Jisql -driver postgresql -cstring jdbc:postgresql://127.5.11.212:42617/ranger -u miniranger -p '********' -noheader -trim -c \;  -query "select 1;"
2026-09-29 00:57:02,414  [I] Checking connection passed.
2026-09-29 00:57:02,415  [I] --------- Verifying version history table ---------
2026-09-29 00:57:02,415  [JISQL] /usr/lib/jvm/java-1.8.0-openjdk-amd64/bin/java  -cp /tmp/dist-test-taskeXDuD2/build/asan/bin/postgresql.jar:/tmp/dist-test-taskeXDuD2/thirdparty/src/ranger-2.1.0-admin/jisql/lib/* org.apache.util.sql.Jisql -driver postgresql -cstring jdbc:postgresql://127.5.11.212:42617/ranger -u miniranger -p '********' -noheader -trim -c \;  -query "select * from (select table_name from information_schema.tables where table_catalog='ranger' and table_name = 'x_db_version_h') as temp;"
2026-09-29 00:57:02,671  [I] Table x_db_version_h does not exist in database ranger
2026-09-29 00:57:02,672  [JISQL] /usr/lib/jvm/java-1.8.0-openjdk-amd64/bin/java  -cp /tmp/dist-test-taskeXDuD2/build/asan/bin/postgresql.jar:/tmp/dist-test-taskeXDuD2/thirdparty/src/ranger-2.1.0-admin/jisql/lib/* org.apache.util.sql.Jisql -driver postgresql -cstring jdbc:postgresql://127.5.11.212:42617/ranger -u miniranger -p '********' -noheader -trim -c \;  -query "select * from (select table_name from information_schema.tables where table_catalog='ranger' and table_name = 'x_db_version_h') as temp;"
2026-09-29 00:57:02,923  [I] Table x_db_version_h does not exist in database ranger
2026-09-29 00:57:02,924  [I] Importing x_db_version_h table schema to database ranger from file: create_dbversion_catalog.sql
2026-09-29 00:57:02,924  [JISQL] /usr/lib/jvm/java-1.8.0-openjdk-amd64/bin/java  -cp /tmp/dist-test-taskeXDuD2/build/asan/bin/postgresql.jar:/tmp/dist-test-taskeXDuD2/thirdparty/src/ranger-2.1.0-admin/jisql/lib/* org.apache.util.sql.Jisql -driver postgresql -cstring jdbc:postgresql://127.5.11.212:42617/ranger -u miniranger -p '********' -noheader -trim -c \; -input /tmp/dist-test-taskeXDuD2/thirdparty/src/ranger-2.1.0-admin/db/postgres/create_dbversion_catalog.sql 
2026-09-29 00:57:03.165 UTC [6508] WARNING:  there is no transaction in progress
2026-09-29 00:57:03,171  [I] create_dbversion_catalog.sql file imported successfully
2026-09-29 00:57:03,172  [JISQL] /usr/lib/jvm/java-1.8.0-openjdk-amd64/bin/java  -cp /tmp/dist-test-taskeXDuD2/build/asan/bin/postgresql.jar:/tmp/dist-test-taskeXDuD2/thirdparty/src/ranger-2.1.0-admin/jisql/lib/* org.apache.util.sql.Jisql -driver postgresql -cstring jdbc:postgresql://127.5.11.212:42617/ranger -u miniranger -p '********' -noheader -trim -c \;  -query "select * from (select table_name from information_schema.tables where table_catalog='ranger' and table_name = 'x_db_version_h') as temp;"
2026-09-29 00:57:03,419  [I] Table x_db_version_h already exists in database 'ranger'
2026-09-29 00:57:03,419  [I] --------- Importing Ranger Core DB Schema ---------
2026-09-29 00:57:03,420  [JISQL] /usr/lib/jvm/java-1.8.0-openjdk-amd64/bin/java  -cp /tmp/dist-test-taskeXDuD2/build/asan/bin/postgresql.jar:/tmp/dist-test-taskeXDuD2/thirdparty/src/ranger-2.1.0-admin/jisql/lib/* org.apache.util.sql.Jisql -driver postgresql -cstring jdbc:postgresql://127.5.11.212:42617/ranger -u miniranger -p '********' -noheader -trim -c \;  -query "select version from x_db_version_h where version = 'CORE_DB_SCHEMA' and active = 'Y';"
2026-09-29 00:57:03,666  [JISQL] /usr/lib/jvm/java-1.8.0-openjdk-amd64/bin/java  -cp /tmp/dist-test-taskeXDuD2/build/asan/bin/postgresql.jar:/tmp/dist-test-taskeXDuD2/thirdparty/src/ranger-2.1.0-admin/jisql/lib/* org.apache.util.sql.Jisql -driver postgresql -cstring jdbc:postgresql://127.5.11.212:42617/ranger -u miniranger -p '********' -noheader -trim -c \;  -query "select version from x_db_version_h where version = 'CORE_DB_SCHEMA' and active = 'N';"
2026-09-29 00:57:03,920  [JISQL] /usr/lib/jvm/java-1.8.0-openjdk-amd64/bin/java  -cp /tmp/dist-test-taskeXDuD2/build/asan/bin/postgresql.jar:/tmp/dist-test-taskeXDuD2/thirdparty/src/ranger-2.1.0-admin/jisql/lib/* org.apache.util.sql.Jisql -driver postgresql -cstring jdbc:postgresql://127.5.11.212:42617/ranger -u miniranger -p '********' -noheader -trim -c \;  -query "insert into x_db_version_h (version, inst_at, inst_by, updated_at, updated_by,active) values ('CORE_DB_SCHEMA', current_timestamp, 'Ranger 2.1.0', current_timestamp, 'dist-test-slave-w3ts.c.gcp-upstream.internal','N') ;"
2026-09-29 00:57:04,163  [JISQL] /usr/lib/jvm/java-1.8.0-openjdk-amd64/bin/java  -cp /tmp/dist-test-taskeXDuD2/build/asan/bin/postgresql.jar:/tmp/dist-test-taskeXDuD2/thirdparty/src/ranger-2.1.0-admin/jisql/lib/* org.apache.util.sql.Jisql -driver postgresql -cstring jdbc:postgresql://127.5.11.212:42617/ranger -u miniranger -p '********' -noheader -trim -c \;  -query "select * from (select table_name from information_schema.tables where table_catalog='ranger' and table_name = 'x_portal_user') as temp;"
2026-09-29 00:57:04,405  [I] Table x_portal_user does not exist in database ranger
2026-09-29 00:57:04,406  [JISQL] /usr/lib/jvm/java-1.8.0-openjdk-amd64/bin/java  -cp /tmp/dist-test-taskeXDuD2/build/asan/bin/postgresql.jar:/tmp/dist-test-taskeXDuD2/thirdparty/src/ranger-2.1.0-admin/jisql/lib/* org.apache.util.sql.Jisql -driver postgresql -cstring jdbc:postgresql://127.5.11.212:42617/ranger -u miniranger -p '********' -noheader -trim -c \;  -query "select * from (select table_name from information_schema.tables where table_catalog='ranger' and table_name = 'x_policy_ref_group') as temp;"
2026-09-29 00:57:04,644  [I] Table x_policy_ref_group does not exist in database ranger
2026-09-29 00:57:04,644  [JISQL] /usr/lib/jvm/java-1.8.0-openjdk-amd64/bin/java  -cp /tmp/dist-test-taskeXDuD2/build/asan/bin/postgresql.jar:/tmp/dist-test-taskeXDuD2/thirdparty/src/ranger-2.1.0-admin/jisql/lib/* org.apache.util.sql.Jisql -driver postgresql -cstring jdbc:postgresql://127.5.11.212:42617/ranger -u miniranger -p '********' -noheader -trim -c \;  -query "select version from x_db_version_h where version = 'DB_PATCHES' and active = 'Y';"
2026-09-29 00:57:04,885  [JISQL] /usr/lib/jvm/java-1.8.0-openjdk-amd64/bin/java  -cp /tmp/dist-test-taskeXDuD2/build/asan/bin/postgresql.jar:/tmp/dist-test-taskeXDuD2/thirdparty/src/ranger-2.1.0-admin/jisql/lib/* org.apache.util.sql.Jisql -driver postgresql -cstring jdbc:postgresql://127.5.11.212:42617/ranger -u miniranger -p '********' -noheader -trim -c \;  -query "select version from x_db_version_h where version = 'JAVA_PATCHES' and active = 'Y';"
2026-09-29 00:57:05,130  [I] Importing DB schema to database ranger from file: ranger_core_db_postgres.sql
2026-09-29 00:57:05,130  [JISQL] /usr/lib/jvm/java-1.8.0-openjdk-amd64/bin/java  -cp /tmp/dist-test-taskeXDuD2/build/asan/bin/postgresql.jar:/tmp/dist-test-taskeXDuD2/thirdparty/src/ranger-2.1.0-admin/jisql/lib/* org.apache.util.sql.Jisql -driver postgresql -cstring jdbc:postgresql://127.5.11.212:42617/ranger -u miniranger -p '********' -noheader -trim -c \; -input /tmp/dist-test-taskeXDuD2/thirdparty/src/ranger-2.1.0-admin/db/postgres/optimized/current/ranger_core_db_postgres.sql 
2026-09-29 00:57:06.090 UTC [6616] WARNING:  there is no transaction in progress
2026-09-29 00:57:06.107 UTC [6616] WARNING:  there is no transaction in progress
2026-09-29 00:57:06.124 UTC [6616] WARNING:  there is no transaction in progress
2026-09-29 00:57:06.140 UTC [6616] WARNING:  there is no transaction in progress
2026-09-29 00:57:06.156 UTC [6616] WARNING:  there is no transaction in progress
2026-09-29 00:57:06.177 UTC [6616] WARNING:  there is no transaction in progress
2026-09-29 00:57:06.240 UTC [6616] WARNING:  there is no transaction in progress
2026-09-29 00:57:06.247 UTC [6616] WARNING:  there is no transaction in progress
2026-09-29 00:57:06.262 UTC [6616] WARNING:  there is no transaction in progress
2026-09-29 00:57:06.272 UTC [6616] WARNING:  there is no transaction in progress
2026-09-29 00:57:06.283 UTC [6616] WARNING:  there is no transaction in progress
2026-09-29 00:57:06.299 UTC [6616] WARNING:  there is no transaction in progress
2026-09-29 00:57:06.309 UTC [6616] WARNING:  there is no transaction in progress
2026-09-29 00:57:06.316 UTC [6616] WARNING:  there is no transaction in progress
2026-09-29 00:57:06.322 UTC [6616] WARNING:  there is no transaction in progress
2026-09-29 00:57:06.330 UTC [6616] WARNING:  there is no transaction in progress
2026-09-29 00:57:06,980  [I] ranger_core_db_postgres.sql file imported successfully
2026-09-29 00:57:06,980  [JISQL] /usr/lib/jvm/java-1.8.0-openjdk-amd64/bin/java  -cp /tmp/dist-test-taskeXDuD2/build/asan/bin/postgresql.jar:/tmp/dist-test-taskeXDuD2/thirdparty/src/ranger-2.1.0-admin/jisql/lib/* org.apache.util.sql.Jisql -driver postgresql -cstring jdbc:postgresql://127.5.11.212:42617/ranger -u miniranger -p '********' -noheader -trim -c \;  -query "update x_db_version_h set inst_by='Ranger 2.1.0' where active='Y' and updated_by='localhost';"
2026-09-29 00:57:07,214  [I] Patches status entries updated from base ranger version to current installed ranger version:Ranger 2.1.0
2026-09-29 00:57:07,215  [JISQL] /usr/lib/jvm/java-1.8.0-openjdk-amd64/bin/java  -cp /tmp/dist-test-taskeXDuD2/build/asan/bin/postgresql.jar:/tmp/dist-test-taskeXDuD2/thirdparty/src/ranger-2.1.0-admin/jisql/lib/* org.apache.util.sql.Jisql -driver postgresql -cstring jdbc:postgresql://127.5.11.212:42617/ranger -u miniranger -p '********' -noheader -trim -c \;  -query "select * from (select table_name from information_schema.tables where table_catalog='ranger' and table_name = 'x_portal_user') as temp;"
2026-09-29 00:57:07,447  [I] Table x_portal_user already exists in database 'ranger'
2026-09-29 00:57:07,447  [JISQL] /usr/lib/jvm/java-1.8.0-openjdk-amd64/bin/java  -cp /tmp/dist-test-taskeXDuD2/build/asan/bin/postgresql.jar:/tmp/dist-test-taskeXDuD2/thirdparty/src/ranger-2.1.0-admin/jisql/lib/* org.apache.util.sql.Jisql -driver postgresql -cstring jdbc:postgresql://127.5.11.212:42617/ranger -u miniranger -p '********' -noheader -trim -c \;  -query "select * from (select table_name from information_schema.tables where table_catalog='ranger' and table_name = 'x_policy_ref_group') as temp;"
2026-09-29 00:57:07,685  [I] Table x_policy_ref_group already exists in database 'ranger'
2026-09-29 00:57:07,686  [JISQL] /usr/lib/jvm/java-1.8.0-openjdk-amd64/bin/java  -cp /tmp/dist-test-taskeXDuD2/build/asan/bin/postgresql.jar:/tmp/dist-test-taskeXDuD2/thirdparty/src/ranger-2.1.0-admin/jisql/lib/* org.apache.util.sql.Jisql -driver postgresql -cstring jdbc:postgresql://127.5.11.212:42617/ranger -u miniranger -p '********' -noheader -trim -c \;  -query "select version from x_db_version_h where version = 'DB_PATCHES' and active = 'Y';"
2026-09-29 00:57:07,931  [JISQL] /usr/lib/jvm/java-1.8.0-openjdk-amd64/bin/java  -cp /tmp/dist-test-taskeXDuD2/build/asan/bin/postgresql.jar:/tmp/dist-test-taskeXDuD2/thirdparty/src/ranger-2.1.0-admin/jisql/lib/* org.apache.util.sql.Jisql -driver postgresql -cstring jdbc:postgresql://127.5.11.212:42617/ranger -u miniranger -p '********' -noheader -trim -c \;  -query "select version from x_db_version_h where version = 'JAVA_PATCHES' and active = 'Y';"
2026-09-29 00:57:08,168  [JISQL] /usr/lib/jvm/java-1.8.0-openjdk-amd64/bin/java  -cp /tmp/dist-test-taskeXDuD2/build/asan/bin/postgresql.jar:/tmp/dist-test-taskeXDuD2/thirdparty/src/ranger-2.1.0-admin/jisql/lib/* org.apache.util.sql.Jisql -driver postgresql -cstring jdbc:postgresql://127.5.11.212:42617/ranger -u miniranger -p '********' -noheader -trim -c \;  -query "update x_db_version_h set active='Y' where version='CORE_DB_SCHEMA' and active='N' and updated_by='dist-test-slave-w3ts.c.gcp-upstream.internal';"
2026-09-29 00:57:08,409  [I] CORE_DB_SCHEMA import status has been updated
2026-09-29 00:57:08,409  [JISQL] /usr/lib/jvm/java-1.8.0-openjdk-amd64/bin/java  -cp /tmp/dist-test-taskeXDuD2/build/asan/bin/postgresql.jar:/tmp/dist-test-taskeXDuD2/thirdparty/src/ranger-2.1.0-admin/jisql/lib/* org.apache.util.sql.Jisql -driver postgresql -cstring jdbc:postgresql://127.5.11.212:42617/ranger -u miniranger -p '********' -noheader -trim -c \;  -query "select version from x_db_version_h where version = 'DB_PATCHES' and inst_by = 'Ranger 2.1.0' and active = 'Y';"
2026-09-29 00:57:08,660  [I] DB_PATCHES have already been applied
I20260929 00:57:08.665918  5167 mini_ranger.cc:191] Using Ranger class path: /tmp/dist-test-taskeXDuD2/test-tmp/ts_authz-itest.0.AuthzProviders_TSAuthzTxnOpsITest.BasicOperationsForAuthorizedUsers_Ranger.1790643240301354-5167-0/minicluster-data/ranger-admin:/tmp/dist-test-taskeXDuD2/thirdparty/src/ranger-2.1.0-admin/ews/lib/*:/usr/lib/jvm/java-1.8.0-openjdk-amd64/lib/*:/tmp/dist-test-taskeXDuD2/thirdparty/src/hadoop-3.2.0/*:/tmp/dist-test-taskeXDuD2/build/asan/bin/postgresql.jar:/tmp/dist-test-taskeXDuD2/thirdparty/src/ranger-2.1.0-admin/ews/webapp
I20260929 00:57:08.666014  5167 mini_ranger.cc:193] Using host: 127.5.11.212
I20260929 00:57:08.675326  5167 mini_ranger.cc:227] Ranger admin URL: http://127.5.11.212:40093
Sep 29, 2026 12:57:08 AM org.apache.ranger.server.tomcat.EmbeddedServer getKeyManagers
WARNING: Config 'ranger.keystore.file' or 'ranger.service.https.attrib.keystore.file' is not found or contains blank value
Sep 29, 2026 12:57:08 AM org.apache.ranger.server.tomcat.EmbeddedServer getTrustManagers
WARNING: Config 'ranger.truststore.file' is not found or contains blank value!
Sep 29, 2026 12:57:09 AM org.apache.ranger.server.tomcat.EmbeddedServer start
INFO: Deriving webapp folder from catalina.base property. folder=/tmp/dist-test-taskeXDuD2/test-tmp/ts_authz-itest.0.AuthzProviders_TSAuthzTxnOpsITest.BasicOperationsForAuthorizedUsers_Ranger.1790643240301354-5167-0/minicluster-data/ranger-admin/ews/webapp
Sep 29, 2026 12:57:09 AM org.apache.ranger.server.tomcat.EmbeddedServer start
INFO: Webapp file =/tmp/dist-test-taskeXDuD2/test-tmp/ts_authz-itest.0.AuthzProviders_TSAuthzTxnOpsITest.BasicOperationsForAuthorizedUsers_Ranger.1790643240301354-5167-0/minicluster-data/ranger-admin/ews/webapp, webAppName = /
Sep 29, 2026 12:57:09 AM org.apache.ranger.server.tomcat.EmbeddedServer start
INFO: Adding webapp [/] = path [/tmp/dist-test-taskeXDuD2/test-tmp/ts_authz-itest.0.AuthzProviders_TSAuthzTxnOpsITest.BasicOperationsForAuthorizedUsers_Ranger.1790643240301354-5167-0/minicluster-data/ranger-admin/ews/webapp] .....
Sep 29, 2026 12:57:09 AM org.apache.ranger.server.tomcat.EmbeddedServer start
INFO: Finished init of webapp [/] = path [/tmp/dist-test-taskeXDuD2/test-tmp/ts_authz-itest.0.AuthzProviders_TSAuthzTxnOpsITest.BasicOperationsForAuthorizedUsers_Ranger.1790643240301354-5167-0/minicluster-data/ranger-admin/ews/webapp].
Sep 29, 2026 12:57:09 AM org.apache.ranger.server.tomcat.EmbeddedServer startServer
INFO: Server Name : miniranger
I20260929 00:57:09.674443  5167 mini_ranger.cc:160] Time spent starting Ranger: real 8.290s	user 0.000s	sys 0.024s
Sep 29, 2026 12:57:28 AM com.sun.jersey.api.core.PackagesResourceConfig init
INFO: Scanning for root resource and provider classes in the packages:
  org.apache.ranger.rest
  org.apache.ranger.common
  xa.rest
Sep 29, 2026 12:57:28 AM com.sun.jersey.api.core.ScanningResourceConfig logClasses
INFO: Root resource classes found:
  class org.apache.ranger.rest.XAuditREST
  class org.apache.ranger.rest.SecurityZoneREST
  class org.apache.ranger.rest.PublicAPIsv2
  class org.apache.ranger.rest.XKeyREST
  class org.apache.ranger.rest.RoleREST
  class org.apache.ranger.rest.ServiceREST
  class org.apache.ranger.rest.AssetREST
  class org.apache.ranger.rest.XUserREST
  class org.apache.ranger.rest.TagREST
  class org.apache.ranger.rest.MetricsREST
  class org.apache.ranger.rest.PublicAPIs
  class org.apache.ranger.rest.UserREST
Sep 29, 2026 12:57:28 AM com.sun.jersey.api.core.ScanningResourceConfig logClasses
INFO: Provider classes found:
  class org.apache.ranger.common.RangerJAXBContextResolver
Sep 29, 2026 12:57:28 AM com.sun.jersey.spi.spring.container.servlet.SpringServlet getContext
INFO: Using default applicationContext
Sep 29, 2026 12:57:28 AM com.sun.jersey.spi.spring.container.SpringComponentProviderFactory registerSpringBeans
INFO: Registering Spring bean, assetREST, of type org.apache.ranger.rest.AssetREST as a root resource class
Sep 29, 2026 12:57:28 AM com.sun.jersey.spi.spring.container.SpringComponentProviderFactory registerSpringBeans
INFO: Registering Spring bean, metricsREST, of type org.apache.ranger.rest.MetricsREST as a root resource class
Sep 29, 2026 12:57:28 AM com.sun.jersey.spi.spring.container.SpringComponentProviderFactory registerSpringBeans
INFO: Registering Spring bean, publicAPIs, of type org.apache.ranger.rest.PublicAPIs as a root resource class
Sep 29, 2026 12:57:28 AM com.sun.jersey.spi.spring.container.SpringComponentProviderFactory registerSpringBeans
INFO: Registering Spring bean, publicAPIsv2, of type org.apache.ranger.rest.PublicAPIsv2 as a root resource class
Sep 29, 2026 12:57:28 AM com.sun.jersey.spi.spring.container.SpringComponentProviderFactory registerSpringBeans
INFO: Registering Spring bean, roleREST, of type org.apache.ranger.rest.RoleREST as a root resource class
Sep 29, 2026 12:57:28 AM com.sun.jersey.spi.spring.container.SpringComponentProviderFactory registerSpringBeans
INFO: Registering Spring bean, securityZoneREST, of type org.apache.ranger.rest.SecurityZoneREST as a root resource class
Sep 29, 2026 12:57:28 AM com.sun.jersey.spi.spring.container.SpringComponentProviderFactory registerSpringBeans
INFO: Registering Spring bean, serviceREST, of type org.apache.ranger.rest.ServiceREST as a root resource class
Sep 29, 2026 12:57:28 AM com.sun.jersey.spi.spring.container.SpringComponentProviderFactory registerSpringBeans
INFO: Registering Spring bean, tagREST, of type org.apache.ranger.rest.TagREST as a root resource class
Sep 29, 2026 12:57:28 AM com.sun.jersey.spi.spring.container.SpringComponentProviderFactory registerSpringBeans
INFO: Registering Spring bean, userREST, of type org.apache.ranger.rest.UserREST as a root resource class
Sep 29, 2026 12:57:28 AM com.sun.jersey.spi.spring.container.SpringComponentProviderFactory registerSpringBeans
INFO: Registering Spring bean, XAuditREST, of type org.apache.ranger.rest.XAuditREST as a root resource class
Sep 29, 2026 12:57:28 AM com.sun.jersey.spi.spring.container.SpringComponentProviderFactory registerSpringBeans
INFO: Registering Spring bean, XKeyREST, of type org.apache.ranger.rest.XKeyREST as a root resource class
Sep 29, 2026 12:57:28 AM com.sun.jersey.spi.spring.container.SpringComponentProviderFactory registerSpringBeans
INFO: Registering Spring bean, XUserREST, of type org.apache.ranger.rest.XUserREST as a root resource class
Sep 29, 2026 12:57:28 AM com.sun.jersey.server.impl.application.WebApplicationImpl _initiate
INFO: Initiating Jersey application, version 'Jersey: 1.19.3 10/24/2016 03:58 PM'
Sep 29, 2026 12:57:29 AM com.sun.jersey.spi.inject.Errors processErrorMessages
WARNING: The following warnings have been detected with resource and/or provider classes:
  WARNING: A HTTP GET method, public void org.apache.ranger.rest.ServiceREST.getPoliciesInExcel(javax.servlet.http.HttpServletRequest,javax.servlet.http.HttpServletResponse), MUST return a non-void type.
  WARNING: A HTTP GET method, public void org.apache.ranger.rest.ServiceREST.getPoliciesInJson(javax.servlet.http.HttpServletRequest,javax.servlet.http.HttpServletResponse,java.lang.Boolean), MUST return a non-void type.
  WARNING: A HTTP GET method, public void org.apache.ranger.rest.ServiceREST.getPoliciesInCsv(javax.servlet.http.HttpServletRequest,javax.servlet.http.HttpServletResponse) throws java.io.IOException, MUST return a non-void type.
I20260929 00:57:30.415391  5167 mini_ranger.cc:261] Created Kudu service
WARNING: no policy specified for kudu/127.5.11.254@KRBTEST.COM; defaulting to no policy
Authenticating as principal test-admin/admin@KRBTEST.COM with password.
Principal "kudu/127.5.11.254@KRBTEST.COM" created.
Authenticating as principal test-admin/admin@KRBTEST.COM with password.
Entry for principal kudu/127.5.11.254 with kvno 2, encryption type aes256-cts-hmac-sha1-96 added to keytab WRFILE:/tmp/dist-test-taskeXDuD2/test-tmp/ts_authz-itest.0.AuthzProviders_TSAuthzTxnOpsITest.BasicOperationsForAuthorizedUsers_Ranger.1790643240301354-5167-0/krb5kdc/kudu_127.5.11.254.keytab.
Entry for principal kudu/127.5.11.254 with kvno 2, encryption type aes128-cts-hmac-sha1-96 added to keytab WRFILE:/tmp/dist-test-taskeXDuD2/test-tmp/ts_authz-itest.0.AuthzProviders_TSAuthzTxnOpsITest.BasicOperationsForAuthorizedUsers_Ranger.1790643240301354-5167-0/krb5kdc/kudu_127.5.11.254.keytab.
I20260929 00:57:30.461625  5167 external_mini_cluster.cc:1326] Running /tmp/dist-test-taskeXDuD2/build/asan/bin/kudu
/tmp/dist-test-taskeXDuD2/build/asan/bin/kudu
--fs_wal_dir=/tmp/dist-test-taskeXDuD2/test-tmp/ts_authz-itest.0.AuthzProviders_TSAuthzTxnOpsITest.BasicOperationsForAuthorizedUsers_Ranger.1790643240301354-5167-0/minicluster-data/master-0/wal
--fs_data_dirs=/tmp/dist-test-taskeXDuD2/test-tmp/ts_authz-itest.0.AuthzProviders_TSAuthzTxnOpsITest.BasicOperationsForAuthorizedUsers_Ranger.1790643240301354-5167-0/minicluster-data/master-0/data
--block_manager=log
--webserver_interface=localhost
--never_fsync
--enable_minidumps=false
--redact=none
--metrics_log_interval_ms=1000
--log_dir=/tmp/dist-test-taskeXDuD2/test-tmp/ts_authz-itest.0.AuthzProviders_TSAuthzTxnOpsITest.BasicOperationsForAuthorizedUsers_Ranger.1790643240301354-5167-0/minicluster-data/master-0/logs
--server_dump_info_path=/tmp/dist-test-taskeXDuD2/test-tmp/ts_authz-itest.0.AuthzProviders_TSAuthzTxnOpsITest.BasicOperationsForAuthorizedUsers_Ranger.1790643240301354-5167-0/minicluster-data/master-0/data/info.pb
--server_dump_info_format=pb
--rpc_server_allow_ephemeral_ports
--unlock_experimental_flags
--unlock_unsafe_flags
--logtostderr
--logbuflevel=-1
--ipki_server_key_size=768
--openssl_security_level_override=0
master
run
--ipki_ca_key_size=768
--tsk_num_rsa_bits=512
--rpc_bind_addresses=127.5.11.254:33329
--webserver_interface=127.5.11.254
--webserver_port=0
--keytab_file=/tmp/dist-test-taskeXDuD2/test-tmp/ts_authz-itest.0.AuthzProviders_TSAuthzTxnOpsITest.BasicOperationsForAuthorizedUsers_Ranger.1790643240301354-5167-0/krb5kdc/kudu_127.5.11.254.keytab
--principal=kudu/127.5.11.254
--rpc_authentication=required
--superuser_acl=test-admin
--user_acl=test-user
--builtin_ntp_servers=127.5.11.212:42231
--builtin_ntp_poll_interval_ms=100
--ntp_initial_sync_wait_secs=10
--time_source=builtin
--rpc_reuseport=true
--master_addresses=127.5.11.254:33329
--ranger_config_path=/tmp/dist-test-taskeXDuD2/test-tmp/ts_authz-itest.0.AuthzProviders_TSAuthzTxnOpsITest.BasicOperationsForAuthorizedUsers_Ranger.1790643240301354-5167-0/minicluster-data/ranger-client
--trusted_user_acl=test-admin
--authz_token_validity_seconds=1
--user_acl=kudu,user0,user1,user2
--txn_manager_enabled
--txn_manager_status_table_num_replicas=1 with env {KRB5CCNAME=/tmp/dist-test-taskeXDuD2/test-tmp/ts_authz-itest.0.AuthzProviders_TSAuthzTxnOpsITest.BasicOperationsForAuthorizedUsers_Ranger.1790643240301354-5167-0/krb5kdc/krb5cc,KRB5_CONFIG=/tmp/dist-test-taskeXDuD2/test-tmp/ts_authz-itest.0.AuthzProviders_TSAuthzTxnOpsITest.BasicOperationsForAuthorizedUsers_Ranger.1790643240301354-5167-0/krb5kdc/krb5.conf,KRB5_KDC_PROFILE=/tmp/dist-test-taskeXDuD2/test-tmp/ts_authz-itest.0.AuthzProviders_TSAuthzTxnOpsITest.BasicOperationsForAuthorizedUsers_Ranger.1790643240301354-5167-0/krb5kdc/kdc.conf,KUDU_ENABLE_KRB5_REALM_FIX=yes}
W20260929 00:57:30.784883  6747 flags.cc:425] Enabled unsafe flag: --openssl_security_level_override=0
W20260929 00:57:30.785189  6747 flags.cc:425] Enabled unsafe flag: --rpc_server_allow_ephemeral_ports=true
W20260929 00:57:30.785311  6747 flags.cc:425] Enabled unsafe flag: --never_fsync=true
W20260929 00:57:30.792625  6747 flags.cc:425] Enabled experimental flag: --authz_token_validity_seconds=1
W20260929 00:57:30.792737  6747 flags.cc:425] Enabled experimental flag: --ipki_ca_key_size=768
W20260929 00:57:30.792778  6747 flags.cc:425] Enabled experimental flag: --txn_manager_enabled=true
W20260929 00:57:30.792831  6747 flags.cc:425] Enabled experimental flag: --txn_manager_status_table_num_replicas=1
W20260929 00:57:30.792886  6747 flags.cc:425] Enabled experimental flag: --ipki_server_key_size=768
W20260929 00:57:30.792945  6747 flags.cc:425] Enabled experimental flag: --tsk_num_rsa_bits=512
W20260929 00:57:30.792987  6747 flags.cc:425] Enabled experimental flag: --rpc_reuseport=true
I20260929 00:57:30.803556  6747 master_runner.cc:386] Master server non-default flags:
--builtin_ntp_poll_interval_ms=100
--builtin_ntp_servers=127.5.11.212:42231
--ntp_initial_sync_wait_secs=10
--time_source=builtin
--fs_data_dirs=/tmp/dist-test-taskeXDuD2/test-tmp/ts_authz-itest.0.AuthzProviders_TSAuthzTxnOpsITest.BasicOperationsForAuthorizedUsers_Ranger.1790643240301354-5167-0/minicluster-data/master-0/data
--fs_wal_dir=/tmp/dist-test-taskeXDuD2/test-tmp/ts_authz-itest.0.AuthzProviders_TSAuthzTxnOpsITest.BasicOperationsForAuthorizedUsers_Ranger.1790643240301354-5167-0/minicluster-data/master-0/wal
--trusted_user_acl=<redacted>
--authz_token_validity_seconds=1
--ipki_ca_key_size=768
--master_addresses=127.5.11.254:33329
--txn_manager_enabled=true
--txn_manager_status_table_num_replicas=1
--ranger_config_path=/tmp/dist-test-taskeXDuD2/test-tmp/ts_authz-itest.0.AuthzProviders_TSAuthzTxnOpsITest.BasicOperationsForAuthorizedUsers_Ranger.1790643240301354-5167-0/minicluster-data/ranger-client
--keytab_file=/tmp/dist-test-taskeXDuD2/test-tmp/ts_authz-itest.0.AuthzProviders_TSAuthzTxnOpsITest.BasicOperationsForAuthorizedUsers_Ranger.1790643240301354-5167-0/krb5kdc/kudu_127.5.11.254.keytab
--principal=kudu/127.5.11.254
--ipki_server_key_size=768
--openssl_security_level_override=0
--tsk_num_rsa_bits=512
--rpc_bind_addresses=127.5.11.254:33329
--rpc_reuseport=true
--rpc_server_allow_ephemeral_ports=true
--rpc_authentication=required
--superuser_acl=<redacted>
--user_acl=<redacted>
--metrics_log_interval_ms=1000
--server_dump_info_format=pb
--server_dump_info_path=/tmp/dist-test-taskeXDuD2/test-tmp/ts_authz-itest.0.AuthzProviders_TSAuthzTxnOpsITest.BasicOperationsForAuthorizedUsers_Ranger.1790643240301354-5167-0/minicluster-data/master-0/data/info.pb
--webserver_interface=127.5.11.254
--webserver_port=0
--never_fsync=true
--redact=none
--unlock_experimental_flags=true
--unlock_unsafe_flags=true
--enable_minidumps=false
--log_dir=/tmp/dist-test-taskeXDuD2/test-tmp/ts_authz-itest.0.AuthzProviders_TSAuthzTxnOpsITest.BasicOperationsForAuthorizedUsers_Ranger.1790643240301354-5167-0/minicluster-data/master-0/logs
--logbuflevel=-1
--logtostderr=true

Master server version:
kudu 1.18.0-SNAPSHOT
revision c2d25d5f57d102d9ad9869eaf208d035a22e18aa
build type FASTDEBUG
built by systest at 28 Sep 2026 23:53:35 UTC on ccycloud.quasar-vwuirl.root.comops.site
build id 4678654
ASAN enabled
I20260929 00:57:30.804917  6747 env_posix.cc:2256] Not raising this process' open files per process limit of 1048576; it is already as high as it can go
I20260929 00:57:30.806290  6747 file_cache.cc:493] Constructed file cache file cache with capacity 419430
W20260929 00:57:30.819273  6753 instance_detector.cc:116] could not retrieve Azure instance metadata: Network error: curl error: HTTP response code said error: The requested URL returned error: 404
W20260929 00:57:30.819315  6752 instance_detector.cc:116] could not retrieve AWS instance metadata: Network error: curl error: HTTP response code said error: The requested URL returned error: 404
W20260929 00:57:30.819479  6755 instance_detector.cc:116] could not retrieve OpenStack instance metadata: Network error: curl error: HTTP response code said error: The requested URL returned error: 404
I20260929 00:57:30.819351  6747 server_base.cc:1034] running on GCE node
I20260929 00:57:30.820422  6747 hybrid_clock.cc:584] initializing the hybrid clock with 'builtin' time source
I20260929 00:57:30.821957  6747 hybrid_clock.cc:630] waiting up to --ntp_initial_sync_wait_secs=10 seconds for the clock to synchronize
I20260929 00:57:30.823215  6747 hybrid_clock.cc:648] HybridClock initialized: now 1790643450823165 us; error 34 us; skew 500 ppm
I20260929 00:57:30.823593  6747 server_base.cc:834] Flag tcmalloc_max_total_thread_cache_bytes is not working since tcmalloc is not enabled.
Sep 29 00:57:30 dist-test-slave-w3ts krb5kdc[6403](info): AS_REQ (2 etypes {17 16}) 127.0.0.1: ISSUE: authtime 1790643450, etypes {rep=17 tkt=17 ses=17}, kudu/127.5.11.254@KRBTEST.COM for krbtgt/KRBTEST.COM@KRBTEST.COM
I20260929 00:57:30.837064  6747 init.cc:377] Logged in from keytab as kudu/127.5.11.254@KRBTEST.COM (short username kudu)
I20260929 00:57:30.838819  6747 webserver.cc:460] Webserver started at http://127.5.11.254:41563/ using document root <none> and password file <none>
I20260929 00:57:30.839600  6747 fs_manager.cc:359] Metadata directory not provided
I20260929 00:57:30.839697  6747 fs_manager.cc:365] Using write-ahead log directory (fs_wal_dir) as metadata directory
I20260929 00:57:30.839960  6747 server_base.cc:882] This appears to be a new deployment of Kudu; creating new FS layout
I20260929 00:57:30.842650  6747 fs_manager.cc:1063] Generated new instance metadata in path /tmp/dist-test-taskeXDuD2/test-tmp/ts_authz-itest.0.AuthzProviders_TSAuthzTxnOpsITest.BasicOperationsForAuthorizedUsers_Ranger.1790643240301354-5167-0/minicluster-data/master-0/data/instance:
uuid: "e728f10152ac436fbcb3b21cfce29ebf"
format_stamp: "Formatted at 2026-09-29 00:57:30 on dist-test-slave-w3ts"
I20260929 00:57:30.843362  6747 fs_manager.cc:1063] Generated new instance metadata in path /tmp/dist-test-taskeXDuD2/test-tmp/ts_authz-itest.0.AuthzProviders_TSAuthzTxnOpsITest.BasicOperationsForAuthorizedUsers_Ranger.1790643240301354-5167-0/minicluster-data/master-0/wal/instance:
uuid: "e728f10152ac436fbcb3b21cfce29ebf"
format_stamp: "Formatted at 2026-09-29 00:57:30 on dist-test-slave-w3ts"
I20260929 00:57:30.848601  6747 fs_manager.cc:691] Time spent creating directory manager: real 0.005s	user 0.006s	sys 0.000s
I20260929 00:57:30.852310  6762 log_block_manager.cc:3774] Time spent loading block containers with low live blocks: real 0.000s	user 0.000s	sys 0.000s
I20260929 00:57:30.853871  6747 fs_manager.cc:725] Time spent opening block manager: real 0.003s	user 0.001s	sys 0.002s
I20260929 00:57:30.854044  6747 fs_manager.cc:642] Opened local filesystem: /tmp/dist-test-taskeXDuD2/test-tmp/ts_authz-itest.0.AuthzProviders_TSAuthzTxnOpsITest.BasicOperationsForAuthorizedUsers_Ranger.1790643240301354-5167-0/minicluster-data/master-0/data,/tmp/dist-test-taskeXDuD2/test-tmp/ts_authz-itest.0.AuthzProviders_TSAuthzTxnOpsITest.BasicOperationsForAuthorizedUsers_Ranger.1790643240301354-5167-0/minicluster-data/master-0/wal
uuid: "e728f10152ac436fbcb3b21cfce29ebf"
format_stamp: "Formatted at 2026-09-29 00:57:30 on dist-test-slave-w3ts"
I20260929 00:57:30.854231  6747 fs_report.cc:383] FS layout report
--------------------
wal directory: /tmp/dist-test-taskeXDuD2/test-tmp/ts_authz-itest.0.AuthzProviders_TSAuthzTxnOpsITest.BasicOperationsForAuthorizedUsers_Ranger.1790643240301354-5167-0/minicluster-data/master-0/wal
metadata directory: /tmp/dist-test-taskeXDuD2/test-tmp/ts_authz-itest.0.AuthzProviders_TSAuthzTxnOpsITest.BasicOperationsForAuthorizedUsers_Ranger.1790643240301354-5167-0/minicluster-data/master-0/wal
1 data directories: /tmp/dist-test-taskeXDuD2/test-tmp/ts_authz-itest.0.AuthzProviders_TSAuthzTxnOpsITest.BasicOperationsForAuthorizedUsers_Ranger.1790643240301354-5167-0/minicluster-data/master-0/data/data
Total live blocks: 0
Total live bytes: 0
Total live bytes (after alignment): 0
Total number of LBM containers: 0 (0 full)
Did not check for missing blocks
Did not check for orphaned blocks
Total full LBM containers with extra space: 0 (0 repaired)
Total full LBM container extra space in bytes: 0 (0 repaired)
Total incomplete LBM containers: 0 (0 repaired)
Total LBM partial records: 0 (0 repaired)
Total corrupted LBM metadata records in RocksDB: 0 (0 repaired)
I20260929 00:57:30.899834  6747 rpc_server.cc:225] running with OpenSSL 1.0.2k-fips  26 Jan 2017
I20260929 00:57:30.904466  6747 env_posix.cc:2256] Not raising this process' running threads per effective uid limit of 18446744073709551615; it is already as high as it can go
I20260929 00:57:30.904750  6747 kserver.cc:163] Server-wide thread pool size limit: 3276
I20260929 00:57:30.925114  6747 rpc_server.cc:307] RPC server started. Bound to: 127.5.11.254:33329
I20260929 00:57:30.925133  6823 acceptor_pool.cc:254] collecting diagnostics on the listening RPC socket 127.5.11.254:33329 every 8 connection(s)
I20260929 00:57:30.926551  6747 server_base.cc:1166] Dumped server information to /tmp/dist-test-taskeXDuD2/test-tmp/ts_authz-itest.0.AuthzProviders_TSAuthzTxnOpsITest.BasicOperationsForAuthorizedUsers_Ranger.1790643240301354-5167-0/minicluster-data/master-0/data/info.pb
I20260929 00:57:30.930660  6824 data_dirs.cc:395] Could only allocate 1 dirs of requested 3 for tablet 00000000000000000000000000000000. 1 dirs total, 0 dirs full, 0 dirs failed
I20260929 00:57:30.931299  5167 external_mini_cluster.cc:1388] Started /tmp/dist-test-taskeXDuD2/build/asan/bin/kudu as pid 6747
I20260929 00:57:30.931447  5167 external_mini_cluster.cc:1402] Reading /tmp/dist-test-taskeXDuD2/test-tmp/ts_authz-itest.0.AuthzProviders_TSAuthzTxnOpsITest.BasicOperationsForAuthorizedUsers_Ranger.1790643240301354-5167-0/minicluster-data/master-0/wal/instance
I20260929 00:57:30.944998  6824 tablet_bootstrap.cc:492] T 00000000000000000000000000000000 P e728f10152ac436fbcb3b21cfce29ebf: Bootstrap starting.
Sep 29 00:57:30 dist-test-slave-w3ts krb5kdc[6403](info): TGS_REQ (2 etypes {17 16}) 127.0.0.1: ISSUE: authtime 1790643417, etypes {rep=17 tkt=17 ses=17}, test-admin@KRBTEST.COM for kudu/127.5.11.254@KRBTEST.COM
I20260929 00:57:30.948786  6824 tablet_bootstrap.cc:654] T 00000000000000000000000000000000 P e728f10152ac436fbcb3b21cfce29ebf: Neither blocks nor log segments found. Creating new log.
I20260929 00:57:30.950053  6824 log.cc:824] T 00000000000000000000000000000000 P e728f10152ac436fbcb3b21cfce29ebf: Log is configured to *not* fsync() on all Append() calls
I20260929 00:57:30.953142  6824 tablet_bootstrap.cc:492] T 00000000000000000000000000000000 P e728f10152ac436fbcb3b21cfce29ebf: No bootstrap required, opened a new log
I20260929 00:57:30.962608  6824 raft_consensus.cc:348] T 00000000000000000000000000000000 P e728f10152ac436fbcb3b21cfce29ebf [term 0 FOLLOWER]: Replica starting. Triggering 0 pending ops. Active config: opid_index: -1 OBSOLETE_local: true peers { permanent_uuid: "e728f10152ac436fbcb3b21cfce29ebf" member_type: VOTER last_known_addr { host: "127.5.11.254" port: 33329 } }
I20260929 00:57:30.962978  6824 raft_consensus.cc:374] T 00000000000000000000000000000000 P e728f10152ac436fbcb3b21cfce29ebf [term 0 FOLLOWER]: Consensus starting up: Expiring failure detector timer to make a prompt election more likely
I20260929 00:57:30.963059  6824 raft_consensus.cc:729] T 00000000000000000000000000000000 P e728f10152ac436fbcb3b21cfce29ebf [term 0 FOLLOWER]: Becoming Follower/Learner. State: Replica: e728f10152ac436fbcb3b21cfce29ebf, State: Initialized, Role: FOLLOWER
I20260929 00:57:30.963572  6824 consensus_queue.cc:260] T 00000000000000000000000000000000 P e728f10152ac436fbcb3b21cfce29ebf [NON_LEADER]: Queue going to NON_LEADER mode. State: All replicated index: 0, Majority replicated index: 0, Committed index: 0, Last appended: 0.0, Last appended by leader: 0, Current term: 0, Majority size: -1, State: 0, Mode: NON_LEADER, active raft config: opid_index: -1 OBSOLETE_local: true peers { permanent_uuid: "e728f10152ac436fbcb3b21cfce29ebf" member_type: VOTER last_known_addr { host: "127.5.11.254" port: 33329 } }
I20260929 00:57:30.963778  6824 raft_consensus.cc:388] T 00000000000000000000000000000000 P e728f10152ac436fbcb3b21cfce29ebf [term 0 FOLLOWER]: Only one voter in the Raft config. Triggering election immediately
I20260929 00:57:30.963871  6824 raft_consensus.cc:482] T 00000000000000000000000000000000 P e728f10152ac436fbcb3b21cfce29ebf [term 0 FOLLOWER]: Starting leader election (initial election of a single-replica configuration)
I20260929 00:57:30.964002  6824 raft_consensus.cc:3037] T 00000000000000000000000000000000 P e728f10152ac436fbcb3b21cfce29ebf [term 0 FOLLOWER]: Advancing to term 1
I20260929 00:57:30.966234  6824 raft_consensus.cc:504] T 00000000000000000000000000000000 P e728f10152ac436fbcb3b21cfce29ebf [term 1 FOLLOWER]: Starting leader election with config: opid_index: -1 OBSOLETE_local: true peers { permanent_uuid: "e728f10152ac436fbcb3b21cfce29ebf" member_type: VOTER last_known_addr { host: "127.5.11.254" port: 33329 } }
I20260929 00:57:30.966717  6824 leader_election.cc:302] T 00000000000000000000000000000000 P e728f10152ac436fbcb3b21cfce29ebf [CANDIDATE]: Term 1 election: Election decided. Result: candidate won. Election summary: received 1 responses out of 1 voters: 1 yes votes; 0 no votes. yes voters: e728f10152ac436fbcb3b21cfce29ebf; no voters: 
I20260929 00:57:30.967257  6824 leader_election.cc:288] T 00000000000000000000000000000000 P e728f10152ac436fbcb3b21cfce29ebf [CANDIDATE]: Term 1 election: Requested vote from peers 
I20260929 00:57:30.967396  6829 raft_consensus.cc:2781] T 00000000000000000000000000000000 P e728f10152ac436fbcb3b21cfce29ebf [term 1 FOLLOWER]: Leader election won for term 1
I20260929 00:57:30.968101  6829 raft_consensus.cc:686] T 00000000000000000000000000000000 P e728f10152ac436fbcb3b21cfce29ebf [term 1 LEADER]: Becoming Leader. State: Replica: e728f10152ac436fbcb3b21cfce29ebf, State: Running, Role: LEADER
I20260929 00:57:30.968614  6829 consensus_queue.cc:237] T 00000000000000000000000000000000 P e728f10152ac436fbcb3b21cfce29ebf [LEADER]: Queue going to LEADER mode. State: All replicated index: 0, Majority replicated index: 0, Committed index: 0, Last appended: 0.0, Last appended by leader: 0, Current term: 1, Majority size: 1, State: 0, Mode: LEADER, active raft config: opid_index: -1 OBSOLETE_local: true peers { permanent_uuid: "e728f10152ac436fbcb3b21cfce29ebf" member_type: VOTER last_known_addr { host: "127.5.11.254" port: 33329 } }
I20260929 00:57:30.969342  6824 sys_catalog.cc:564] T 00000000000000000000000000000000 P e728f10152ac436fbcb3b21cfce29ebf [sys.catalog]: configured and running, proceeding with master startup.
I20260929 00:57:30.971470  6830 sys_catalog.cc:455] T 00000000000000000000000000000000 P e728f10152ac436fbcb3b21cfce29ebf [sys.catalog]: SysCatalogTable state changed. Reason: RaftConsensus started. Latest consensus state: current_term: 1 leader_uuid: "e728f10152ac436fbcb3b21cfce29ebf" committed_config { opid_index: -1 OBSOLETE_local: true peers { permanent_uuid: "e728f10152ac436fbcb3b21cfce29ebf" member_type: VOTER last_known_addr { host: "127.5.11.254" port: 33329 } } }
I20260929 00:57:30.971900  6830 sys_catalog.cc:458] T 00000000000000000000000000000000 P e728f10152ac436fbcb3b21cfce29ebf [sys.catalog]: This master's current role is: LEADER
I20260929 00:57:30.971498  6831 sys_catalog.cc:455] T 00000000000000000000000000000000 P e728f10152ac436fbcb3b21cfce29ebf [sys.catalog]: SysCatalogTable state changed. Reason: New leader e728f10152ac436fbcb3b21cfce29ebf. Latest consensus state: current_term: 1 leader_uuid: "e728f10152ac436fbcb3b21cfce29ebf" committed_config { opid_index: -1 OBSOLETE_local: true peers { permanent_uuid: "e728f10152ac436fbcb3b21cfce29ebf" member_type: VOTER last_known_addr { host: "127.5.11.254" port: 33329 } } }
I20260929 00:57:30.972229  6831 sys_catalog.cc:458] T 00000000000000000000000000000000 P e728f10152ac436fbcb3b21cfce29ebf [sys.catalog]: This master's current role is: LEADER
I20260929 00:57:30.979121  6834 catalog_manager.cc:1475] Loading table and tablet metadata into memory...
I20260929 00:57:30.983978  6834 catalog_manager.cc:1484] Initializing Kudu cluster ID...
I20260929 00:57:30.984776  6824 ranger_client.cc:318] Using new properties file: /tmp/dist-test-taskeXDuD2/test-tmp/ts_authz-itest.0.AuthzProviders_TSAuthzTxnOpsITest.BasicOperationsForAuthorizedUsers_Ranger.1790643240301354-5167-0/minicluster-data/master-0/logs/kudu-ranger-subprocess-log4j2.properties
I20260929 00:57:31.006024  6834 catalog_manager.cc:1347] Generated new cluster ID: b9bc789474bd43e1b205c81b698cbfdc
I20260929 00:57:31.006171  6834 catalog_manager.cc:1495] Initializing Kudu internal certificate authority...
I20260929 00:57:31.021752  6834 catalog_manager.cc:1370] Generated new certificate authority record
I20260929 00:57:31.023155  6834 catalog_manager.cc:1504] Loading token signing keys...
I20260929 00:57:31.038638  6834 catalog_manager.cc:5868] T 00000000000000000000000000000000 P e728f10152ac436fbcb3b21cfce29ebf: Generated new TSK 0
I20260929 00:57:31.039907  6834 catalog_manager.cc:1514] Initializing in-progress tserver states...
WARNING: no policy specified for kudu/127.5.11.193@KRBTEST.COM; defaulting to no policy
Authenticating as principal test-admin/admin@KRBTEST.COM with password.
Principal "kudu/127.5.11.193@KRBTEST.COM" created.
Authenticating as principal test-admin/admin@KRBTEST.COM with password.
Entry for principal kudu/127.5.11.193 with kvno 2, encryption type aes256-cts-hmac-sha1-96 added to keytab WRFILE:/tmp/dist-test-taskeXDuD2/test-tmp/ts_authz-itest.0.AuthzProviders_TSAuthzTxnOpsITest.BasicOperationsForAuthorizedUsers_Ranger.1790643240301354-5167-0/krb5kdc/kudu_127.5.11.193.keytab.
Entry for principal kudu/127.5.11.193 with kvno 2, encryption type aes128-cts-hmac-sha1-96 added to keytab WRFILE:/tmp/dist-test-taskeXDuD2/test-tmp/ts_authz-itest.0.AuthzProviders_TSAuthzTxnOpsITest.BasicOperationsForAuthorizedUsers_Ranger.1790643240301354-5167-0/krb5kdc/kudu_127.5.11.193.keytab.
I20260929 00:57:31.774305  5167 external_mini_cluster.cc:1326] Running /tmp/dist-test-taskeXDuD2/build/asan/bin/kudu
/tmp/dist-test-taskeXDuD2/build/asan/bin/kudu
--fs_wal_dir=/tmp/dist-test-taskeXDuD2/test-tmp/ts_authz-itest.0.AuthzProviders_TSAuthzTxnOpsITest.BasicOperationsForAuthorizedUsers_Ranger.1790643240301354-5167-0/minicluster-data/ts-0/wal
--fs_data_dirs=/tmp/dist-test-taskeXDuD2/test-tmp/ts_authz-itest.0.AuthzProviders_TSAuthzTxnOpsITest.BasicOperationsForAuthorizedUsers_Ranger.1790643240301354-5167-0/minicluster-data/ts-0/data
--block_manager=log
--webserver_interface=localhost
--never_fsync
--enable_minidumps=false
--redact=none
--metrics_log_interval_ms=1000
--log_dir=/tmp/dist-test-taskeXDuD2/test-tmp/ts_authz-itest.0.AuthzProviders_TSAuthzTxnOpsITest.BasicOperationsForAuthorizedUsers_Ranger.1790643240301354-5167-0/minicluster-data/ts-0/logs
--server_dump_info_path=/tmp/dist-test-taskeXDuD2/test-tmp/ts_authz-itest.0.AuthzProviders_TSAuthzTxnOpsITest.BasicOperationsForAuthorizedUsers_Ranger.1790643240301354-5167-0/minicluster-data/ts-0/data/info.pb
--server_dump_info_format=pb
--rpc_server_allow_ephemeral_ports
--unlock_experimental_flags
--unlock_unsafe_flags
--logtostderr
--logbuflevel=-1
--ipki_server_key_size=768
--openssl_security_level_override=0
tserver
run
--rpc_bind_addresses=127.5.11.193:0
--local_ip_for_outbound_sockets=127.5.11.193
--webserver_interface=127.5.11.193
--webserver_port=0
--tserver_master_addrs=127.5.11.254:33329
--keytab_file=/tmp/dist-test-taskeXDuD2/test-tmp/ts_authz-itest.0.AuthzProviders_TSAuthzTxnOpsITest.BasicOperationsForAuthorizedUsers_Ranger.1790643240301354-5167-0/krb5kdc/kudu_127.5.11.193.keytab
--principal=kudu/127.5.11.193
--rpc_authentication=required
--superuser_acl=test-admin
--user_acl=test-user
--builtin_ntp_servers=127.5.11.212:42231
--builtin_ntp_poll_interval_ms=100
--ntp_initial_sync_wait_secs=10
--time_source=builtin
--user_acl=user0,user1,user2
--tserver_enforce_access_control=true
--enable_txn_system_client_init with env {KRB5CCNAME=/tmp/dist-test-taskeXDuD2/test-tmp/ts_authz-itest.0.AuthzProviders_TSAuthzTxnOpsITest.BasicOperationsForAuthorizedUsers_Ranger.1790643240301354-5167-0/krb5kdc/krb5cc,KRB5_CONFIG=/tmp/dist-test-taskeXDuD2/test-tmp/ts_authz-itest.0.AuthzProviders_TSAuthzTxnOpsITest.BasicOperationsForAuthorizedUsers_Ranger.1790643240301354-5167-0/krb5kdc/krb5.conf,KRB5_KDC_PROFILE=/tmp/dist-test-taskeXDuD2/test-tmp/ts_authz-itest.0.AuthzProviders_TSAuthzTxnOpsITest.BasicOperationsForAuthorizedUsers_Ranger.1790643240301354-5167-0/krb5kdc/kdc.conf,KUDU_ENABLE_KRB5_REALM_FIX=yes}
Sep 29 00:57:32 dist-test-slave-w3ts krb5kdc[6403](info): AS_REQ (1 etypes {17}) 127.0.0.1: ISSUE: authtime 1790643452, etypes {rep=17 tkt=17 ses=17}, kudu/127.5.11.254@KRBTEST.COM for krbtgt/KRBTEST.COM@KRBTEST.COM
W20260929 00:57:32.220765  6869 flags.cc:425] Enabled unsafe flag: --openssl_security_level_override=0
W20260929 00:57:32.221177  6869 flags.cc:425] Enabled unsafe flag: --rpc_server_allow_ephemeral_ports=true
W20260929 00:57:32.221424  6869 flags.cc:425] Enabled unsafe flag: --never_fsync=true
W20260929 00:57:32.233301  6869 flags.cc:425] Enabled experimental flag: --ipki_server_key_size=768
W20260929 00:57:32.233587  6869 flags.cc:425] Enabled experimental flag: --enable_txn_system_client_init=true
W20260929 00:57:32.233740  6869 flags.cc:425] Enabled experimental flag: --local_ip_for_outbound_sockets=127.5.11.193
I20260929 00:57:32.249512  6869 tablet_server_runner.cc:78] Tablet server non-default flags:
--builtin_ntp_poll_interval_ms=100
--builtin_ntp_servers=127.5.11.212:42231
--ntp_initial_sync_wait_secs=10
--time_source=builtin
--fs_data_dirs=/tmp/dist-test-taskeXDuD2/test-tmp/ts_authz-itest.0.AuthzProviders_TSAuthzTxnOpsITest.BasicOperationsForAuthorizedUsers_Ranger.1790643240301354-5167-0/minicluster-data/ts-0/data
--fs_wal_dir=/tmp/dist-test-taskeXDuD2/test-tmp/ts_authz-itest.0.AuthzProviders_TSAuthzTxnOpsITest.BasicOperationsForAuthorizedUsers_Ranger.1790643240301354-5167-0/minicluster-data/ts-0/wal
--keytab_file=/tmp/dist-test-taskeXDuD2/test-tmp/ts_authz-itest.0.AuthzProviders_TSAuthzTxnOpsITest.BasicOperationsForAuthorizedUsers_Ranger.1790643240301354-5167-0/krb5kdc/kudu_127.5.11.193.keytab
--principal=kudu/127.5.11.193
--ipki_server_key_size=768
--openssl_security_level_override=0
--rpc_bind_addresses=127.5.11.193:0
--rpc_server_allow_ephemeral_ports=true
--rpc_authentication=required
--superuser_acl=<redacted>
--user_acl=<redacted>
--metrics_log_interval_ms=1000
--server_dump_info_format=pb
--server_dump_info_path=/tmp/dist-test-taskeXDuD2/test-tmp/ts_authz-itest.0.AuthzProviders_TSAuthzTxnOpsITest.BasicOperationsForAuthorizedUsers_Ranger.1790643240301354-5167-0/minicluster-data/ts-0/data/info.pb
--webserver_interface=127.5.11.193
--webserver_port=0
--enable_txn_system_client_init=true
--tserver_master_addrs=127.5.11.254:33329
--tserver_enforce_access_control=true
--never_fsync=true
--redact=none
--unlock_experimental_flags=true
--unlock_unsafe_flags=true
--enable_minidumps=false
--local_ip_for_outbound_sockets=127.5.11.193
--log_dir=/tmp/dist-test-taskeXDuD2/test-tmp/ts_authz-itest.0.AuthzProviders_TSAuthzTxnOpsITest.BasicOperationsForAuthorizedUsers_Ranger.1790643240301354-5167-0/minicluster-data/ts-0/logs
--logbuflevel=-1
--logtostderr=true

Tablet server version:
kudu 1.18.0-SNAPSHOT
revision c2d25d5f57d102d9ad9869eaf208d035a22e18aa
build type FASTDEBUG
built by systest at 28 Sep 2026 23:53:35 UTC on ccycloud.quasar-vwuirl.root.comops.site
build id 4678654
ASAN enabled
I20260929 00:57:32.251253  6869 env_posix.cc:2256] Not raising this process' open files per process limit of 1048576; it is already as high as it can go
I20260929 00:57:32.252987  6869 file_cache.cc:493] Constructed file cache file cache with capacity 419430
W20260929 00:57:32.269392  6879 instance_detector.cc:116] could not retrieve AWS instance metadata: Network error: curl error: HTTP response code said error: The requested URL returned error: 404
W20260929 00:57:32.270828  6880 instance_detector.cc:116] could not retrieve Azure instance metadata: Network error: curl error: HTTP response code said error: The requested URL returned error: 404
I20260929 00:57:32.279719  6869 server_base.cc:1034] running on GCE node
W20260929 00:57:32.280081  6882 instance_detector.cc:116] could not retrieve OpenStack instance metadata: Network error: curl error: HTTP response code said error: The requested URL returned error: 404
I20260929 00:57:32.281991  6869 hybrid_clock.cc:584] initializing the hybrid clock with 'builtin' time source
I20260929 00:57:32.284819  6869 hybrid_clock.cc:630] waiting up to --ntp_initial_sync_wait_secs=10 seconds for the clock to synchronize
I20260929 00:57:32.286146  6869 hybrid_clock.cc:648] HybridClock initialized: now 1790643452286043 us; error 110 us; skew 500 ppm
I20260929 00:57:32.286600  6869 server_base.cc:834] Flag tcmalloc_max_total_thread_cache_bytes is not working since tcmalloc is not enabled.
Sep 29 00:57:32 dist-test-slave-w3ts krb5kdc[6403](info): AS_REQ (2 etypes {17 16}) 127.0.0.1: ISSUE: authtime 1790643452, etypes {rep=17 tkt=17 ses=17}, kudu/127.5.11.193@KRBTEST.COM for krbtgt/KRBTEST.COM@KRBTEST.COM
I20260929 00:57:32.290800  6869 init.cc:377] Logged in from keytab as kudu/127.5.11.193@KRBTEST.COM (short username kudu)
I20260929 00:57:32.300518  6869 webserver.cc:460] Webserver started at http://127.5.11.193:37775/ using document root <none> and password file <none>
I20260929 00:57:32.301600  6869 fs_manager.cc:359] Metadata directory not provided
I20260929 00:57:32.301776  6869 fs_manager.cc:365] Using write-ahead log directory (fs_wal_dir) as metadata directory
I20260929 00:57:32.302158  6869 server_base.cc:882] This appears to be a new deployment of Kudu; creating new FS layout
I20260929 00:57:32.305895  6869 fs_manager.cc:1063] Generated new instance metadata in path /tmp/dist-test-taskeXDuD2/test-tmp/ts_authz-itest.0.AuthzProviders_TSAuthzTxnOpsITest.BasicOperationsForAuthorizedUsers_Ranger.1790643240301354-5167-0/minicluster-data/ts-0/data/instance:
uuid: "92f15a354f3844d2a6ab3eae052bdb98"
format_stamp: "Formatted at 2026-09-29 00:57:32 on dist-test-slave-w3ts"
I20260929 00:57:32.306989  6869 fs_manager.cc:1063] Generated new instance metadata in path /tmp/dist-test-taskeXDuD2/test-tmp/ts_authz-itest.0.AuthzProviders_TSAuthzTxnOpsITest.BasicOperationsForAuthorizedUsers_Ranger.1790643240301354-5167-0/minicluster-data/ts-0/wal/instance:
uuid: "92f15a354f3844d2a6ab3eae052bdb98"
format_stamp: "Formatted at 2026-09-29 00:57:32 on dist-test-slave-w3ts"
I20260929 00:57:32.314283  6869 fs_manager.cc:691] Time spent creating directory manager: real 0.007s	user 0.006s	sys 0.001s
I20260929 00:57:32.318075  6889 log_block_manager.cc:3774] Time spent loading block containers with low live blocks: real 0.000s	user 0.000s	sys 0.000s
I20260929 00:57:32.319715  6869 fs_manager.cc:725] Time spent opening block manager: real 0.003s	user 0.004s	sys 0.000s
I20260929 00:57:32.319880  6869 fs_manager.cc:642] Opened local filesystem: /tmp/dist-test-taskeXDuD2/test-tmp/ts_authz-itest.0.AuthzProviders_TSAuthzTxnOpsITest.BasicOperationsForAuthorizedUsers_Ranger.1790643240301354-5167-0/minicluster-data/ts-0/data,/tmp/dist-test-taskeXDuD2/test-tmp/ts_authz-itest.0.AuthzProviders_TSAuthzTxnOpsITest.BasicOperationsForAuthorizedUsers_Ranger.1790643240301354-5167-0/minicluster-data/ts-0/wal
uuid: "92f15a354f3844d2a6ab3eae052bdb98"
format_stamp: "Formatted at 2026-09-29 00:57:32 on dist-test-slave-w3ts"
I20260929 00:57:32.320112  6869 fs_report.cc:383] FS layout report
--------------------
wal directory: /tmp/dist-test-taskeXDuD2/test-tmp/ts_authz-itest.0.AuthzProviders_TSAuthzTxnOpsITest.BasicOperationsForAuthorizedUsers_Ranger.1790643240301354-5167-0/minicluster-data/ts-0/wal
metadata directory: /tmp/dist-test-taskeXDuD2/test-tmp/ts_authz-itest.0.AuthzProviders_TSAuthzTxnOpsITest.BasicOperationsForAuthorizedUsers_Ranger.1790643240301354-5167-0/minicluster-data/ts-0/wal
1 data directories: /tmp/dist-test-taskeXDuD2/test-tmp/ts_authz-itest.0.AuthzProviders_TSAuthzTxnOpsITest.BasicOperationsForAuthorizedUsers_Ranger.1790643240301354-5167-0/minicluster-data/ts-0/data/data
Total live blocks: 0
Total live bytes: 0
Total live bytes (after alignment): 0
Total number of LBM containers: 0 (0 full)
Did not check for missing blocks
Did not check for orphaned blocks
Total full LBM containers with extra space: 0 (0 repaired)
Total full LBM container extra space in bytes: 0 (0 repaired)
Total incomplete LBM containers: 0 (0 repaired)
Total LBM partial records: 0 (0 repaired)
Total corrupted LBM metadata records in RocksDB: 0 (0 repaired)
I20260929 00:57:32.368597  6869 rpc_server.cc:225] running with OpenSSL 1.0.2k-fips  26 Jan 2017
I20260929 00:57:32.373140  6869 env_posix.cc:2256] Not raising this process' running threads per effective uid limit of 18446744073709551615; it is already as high as it can go
I20260929 00:57:32.373564  6869 kserver.cc:163] Server-wide thread pool size limit: 3276
I20260929 00:57:32.389046  6869 ts_tablet_manager.cc:579] Loaded tablet metadata (0 total tablets, 0 live tablets)
I20260929 00:57:32.389189  6869 ts_tablet_manager.cc:525] Time spent load tablet metadata: real 0.000s	user 0.000s	sys 0.000s
I20260929 00:57:32.389315  6869 ts_tablet_manager.cc:610] Registered 0 tablets
I20260929 00:57:32.389395  6869 ts_tablet_manager.cc:589] Time spent register tablets: real 0.000s	user 0.000s	sys 0.000s
Sep 29 00:57:32 dist-test-slave-w3ts krb5kdc[6403](info): TGS_REQ (2 etypes {17 16}) 127.0.0.1: ISSUE: authtime 1790643452, etypes {rep=17 tkt=17 ses=17}, kudu/127.5.11.193@KRBTEST.COM for kudu/127.5.11.254@KRBTEST.COM
Sep 29 00:57:32 dist-test-slave-w3ts krb5kdc[6403](info): TGS_REQ (2 etypes {17 16}) 127.0.0.1: ISSUE: authtime 1790643452, etypes {rep=17 tkt=17 ses=17}, kudu/127.5.11.254@KRBTEST.COM for HTTP/127.5.11.212@KRBTEST.COM
I20260929 00:57:32.631978  6869 rpc_server.cc:307] RPC server started. Bound to: 127.5.11.193:37843
I20260929 00:57:32.631999  7009 acceptor_pool.cc:254] collecting diagnostics on the listening RPC socket 127.5.11.193:37843 every 8 connection(s)
I20260929 00:57:32.633802  6869 server_base.cc:1166] Dumped server information to /tmp/dist-test-taskeXDuD2/test-tmp/ts_authz-itest.0.AuthzProviders_TSAuthzTxnOpsITest.BasicOperationsForAuthorizedUsers_Ranger.1790643240301354-5167-0/minicluster-data/ts-0/data/info.pb
I20260929 00:57:32.635766  5167 external_mini_cluster.cc:1388] Started /tmp/dist-test-taskeXDuD2/build/asan/bin/kudu as pid 6869
I20260929 00:57:32.635939  5167 external_mini_cluster.cc:1402] Reading /tmp/dist-test-taskeXDuD2/test-tmp/ts_authz-itest.0.AuthzProviders_TSAuthzTxnOpsITest.BasicOperationsForAuthorizedUsers_Ranger.1790643240301354-5167-0/minicluster-data/ts-0/wal/instance
I20260929 00:57:32.637135  7010 heartbeater.cc:347] Connected to a master server at 127.5.11.254:33329
I20260929 00:57:32.637490  7010 heartbeater.cc:464] Registering TS with master...
I20260929 00:57:32.638450  7010 heartbeater.cc:511] Master 127.5.11.254:33329 requested a full tablet report, sending...
I20260929 00:57:32.641018  6779 ts_manager.cc:194] Registered new tserver with Master: 92f15a354f3844d2a6ab3eae052bdb98 (127.5.11.193:37843)
I20260929 00:57:32.642980  6779 master_service.cc:496] Signed X509 certificate for tserver {username='kudu', principal='kudu/127.5.11.193@KRBTEST.COM'} at 127.5.11.193:32875
WARNING: no policy specified for kudu/127.5.11.194@KRBTEST.COM; defaulting to no policy
Authenticating as principal test-admin/admin@KRBTEST.COM with password.
Principal "kudu/127.5.11.194@KRBTEST.COM" created.
Authenticating as principal test-admin/admin@KRBTEST.COM with password.
Entry for principal kudu/127.5.11.194 with kvno 2, encryption type aes256-cts-hmac-sha1-96 added to keytab WRFILE:/tmp/dist-test-taskeXDuD2/test-tmp/ts_authz-itest.0.AuthzProviders_TSAuthzTxnOpsITest.BasicOperationsForAuthorizedUsers_Ranger.1790643240301354-5167-0/krb5kdc/kudu_127.5.11.194.keytab.
Entry for principal kudu/127.5.11.194 with kvno 2, encryption type aes128-cts-hmac-sha1-96 added to keytab WRFILE:/tmp/dist-test-taskeXDuD2/test-tmp/ts_authz-itest.0.AuthzProviders_TSAuthzTxnOpsITest.BasicOperationsForAuthorizedUsers_Ranger.1790643240301354-5167-0/krb5kdc/kudu_127.5.11.194.keytab.
I20260929 00:57:32.694046  5167 external_mini_cluster.cc:1326] Running /tmp/dist-test-taskeXDuD2/build/asan/bin/kudu
/tmp/dist-test-taskeXDuD2/build/asan/bin/kudu
--fs_wal_dir=/tmp/dist-test-taskeXDuD2/test-tmp/ts_authz-itest.0.AuthzProviders_TSAuthzTxnOpsITest.BasicOperationsForAuthorizedUsers_Ranger.1790643240301354-5167-0/minicluster-data/ts-1/wal
--fs_data_dirs=/tmp/dist-test-taskeXDuD2/test-tmp/ts_authz-itest.0.AuthzProviders_TSAuthzTxnOpsITest.BasicOperationsForAuthorizedUsers_Ranger.1790643240301354-5167-0/minicluster-data/ts-1/data
--block_manager=log
--webserver_interface=localhost
--never_fsync
--enable_minidumps=false
--redact=none
--metrics_log_interval_ms=1000
--log_dir=/tmp/dist-test-taskeXDuD2/test-tmp/ts_authz-itest.0.AuthzProviders_TSAuthzTxnOpsITest.BasicOperationsForAuthorizedUsers_Ranger.1790643240301354-5167-0/minicluster-data/ts-1/logs
--server_dump_info_path=/tmp/dist-test-taskeXDuD2/test-tmp/ts_authz-itest.0.AuthzProviders_TSAuthzTxnOpsITest.BasicOperationsForAuthorizedUsers_Ranger.1790643240301354-5167-0/minicluster-data/ts-1/data/info.pb
--server_dump_info_format=pb
--rpc_server_allow_ephemeral_ports
--unlock_experimental_flags
--unlock_unsafe_flags
--logtostderr
--logbuflevel=-1
--ipki_server_key_size=768
--openssl_security_level_override=0
tserver
run
--rpc_bind_addresses=127.5.11.194:0
--local_ip_for_outbound_sockets=127.5.11.194
--webserver_interface=127.5.11.194
--webserver_port=0
--tserver_master_addrs=127.5.11.254:33329
--keytab_file=/tmp/dist-test-taskeXDuD2/test-tmp/ts_authz-itest.0.AuthzProviders_TSAuthzTxnOpsITest.BasicOperationsForAuthorizedUsers_Ranger.1790643240301354-5167-0/krb5kdc/kudu_127.5.11.194.keytab
--principal=kudu/127.5.11.194
--rpc_authentication=required
--superuser_acl=test-admin
--user_acl=test-user
--builtin_ntp_servers=127.5.11.212:42231
--builtin_ntp_poll_interval_ms=100
--ntp_initial_sync_wait_secs=10
--time_source=builtin
--user_acl=user0,user1,user2
--tserver_enforce_access_control=true
--enable_txn_system_client_init with env {KRB5CCNAME=/tmp/dist-test-taskeXDuD2/test-tmp/ts_authz-itest.0.AuthzProviders_TSAuthzTxnOpsITest.BasicOperationsForAuthorizedUsers_Ranger.1790643240301354-5167-0/krb5kdc/krb5cc,KRB5_CONFIG=/tmp/dist-test-taskeXDuD2/test-tmp/ts_authz-itest.0.AuthzProviders_TSAuthzTxnOpsITest.BasicOperationsForAuthorizedUsers_Ranger.1790643240301354-5167-0/krb5kdc/krb5.conf,KRB5_KDC_PROFILE=/tmp/dist-test-taskeXDuD2/test-tmp/ts_authz-itest.0.AuthzProviders_TSAuthzTxnOpsITest.BasicOperationsForAuthorizedUsers_Ranger.1790643240301354-5167-0/krb5kdc/kdc.conf,KUDU_ENABLE_KRB5_REALM_FIX=yes}
W20260929 00:57:33.176960  7014 flags.cc:425] Enabled unsafe flag: --openssl_security_level_override=0
W20260929 00:57:33.177279  7014 flags.cc:425] Enabled unsafe flag: --rpc_server_allow_ephemeral_ports=true
W20260929 00:57:33.177439  7014 flags.cc:425] Enabled unsafe flag: --never_fsync=true
W20260929 00:57:33.184684  7014 flags.cc:425] Enabled experimental flag: --ipki_server_key_size=768
W20260929 00:57:33.184854  7014 flags.cc:425] Enabled experimental flag: --enable_txn_system_client_init=true
W20260929 00:57:33.184962  7014 flags.cc:425] Enabled experimental flag: --local_ip_for_outbound_sockets=127.5.11.194
I20260929 00:57:33.194953  7014 tablet_server_runner.cc:78] Tablet server non-default flags:
--builtin_ntp_poll_interval_ms=100
--builtin_ntp_servers=127.5.11.212:42231
--ntp_initial_sync_wait_secs=10
--time_source=builtin
--fs_data_dirs=/tmp/dist-test-taskeXDuD2/test-tmp/ts_authz-itest.0.AuthzProviders_TSAuthzTxnOpsITest.BasicOperationsForAuthorizedUsers_Ranger.1790643240301354-5167-0/minicluster-data/ts-1/data
--fs_wal_dir=/tmp/dist-test-taskeXDuD2/test-tmp/ts_authz-itest.0.AuthzProviders_TSAuthzTxnOpsITest.BasicOperationsForAuthorizedUsers_Ranger.1790643240301354-5167-0/minicluster-data/ts-1/wal
--keytab_file=/tmp/dist-test-taskeXDuD2/test-tmp/ts_authz-itest.0.AuthzProviders_TSAuthzTxnOpsITest.BasicOperationsForAuthorizedUsers_Ranger.1790643240301354-5167-0/krb5kdc/kudu_127.5.11.194.keytab
--principal=kudu/127.5.11.194
--ipki_server_key_size=768
--openssl_security_level_override=0
--rpc_bind_addresses=127.5.11.194:0
--rpc_server_allow_ephemeral_ports=true
--rpc_authentication=required
--superuser_acl=<redacted>
--user_acl=<redacted>
--metrics_log_interval_ms=1000
--server_dump_info_format=pb
--server_dump_info_path=/tmp/dist-test-taskeXDuD2/test-tmp/ts_authz-itest.0.AuthzProviders_TSAuthzTxnOpsITest.BasicOperationsForAuthorizedUsers_Ranger.1790643240301354-5167-0/minicluster-data/ts-1/data/info.pb
--webserver_interface=127.5.11.194
--webserver_port=0
--enable_txn_system_client_init=true
--tserver_master_addrs=127.5.11.254:33329
--tserver_enforce_access_control=true
--never_fsync=true
--redact=none
--unlock_experimental_flags=true
--unlock_unsafe_flags=true
--enable_minidumps=false
--local_ip_for_outbound_sockets=127.5.11.194
--log_dir=/tmp/dist-test-taskeXDuD2/test-tmp/ts_authz-itest.0.AuthzProviders_TSAuthzTxnOpsITest.BasicOperationsForAuthorizedUsers_Ranger.1790643240301354-5167-0/minicluster-data/ts-1/logs
--logbuflevel=-1
--logtostderr=true

Tablet server version:
kudu 1.18.0-SNAPSHOT
revision c2d25d5f57d102d9ad9869eaf208d035a22e18aa
build type FASTDEBUG
built by systest at 28 Sep 2026 23:53:35 UTC on ccycloud.quasar-vwuirl.root.comops.site
build id 4678654
ASAN enabled
I20260929 00:57:33.196254  7014 env_posix.cc:2256] Not raising this process' open files per process limit of 1048576; it is already as high as it can go
I20260929 00:57:33.197614  7014 file_cache.cc:493] Constructed file cache file cache with capacity 419430
W20260929 00:57:33.213111  7020 instance_detector.cc:116] could not retrieve AWS instance metadata: Network error: curl error: HTTP response code said error: The requested URL returned error: 404
W20260929 00:57:33.213765  7021 instance_detector.cc:116] could not retrieve Azure instance metadata: Network error: curl error: HTTP response code said error: The requested URL returned error: 404
W20260929 00:57:33.215448  7023 instance_detector.cc:116] could not retrieve OpenStack instance metadata: Network error: curl error: HTTP response code said error: The requested URL returned error: 404
I20260929 00:57:33.216848  7014 server_base.cc:1034] running on GCE node
I20260929 00:57:33.217628  7014 hybrid_clock.cc:584] initializing the hybrid clock with 'builtin' time source
I20260929 00:57:33.218799  7014 hybrid_clock.cc:630] waiting up to --ntp_initial_sync_wait_secs=10 seconds for the clock to synchronize
I20260929 00:57:33.220082  7014 hybrid_clock.cc:648] HybridClock initialized: now 1790643453220014 us; error 47 us; skew 500 ppm
I20260929 00:57:33.220456  7014 server_base.cc:834] Flag tcmalloc_max_total_thread_cache_bytes is not working since tcmalloc is not enabled.
Sep 29 00:57:33 dist-test-slave-w3ts krb5kdc[6403](info): AS_REQ (2 etypes {17 16}) 127.0.0.1: ISSUE: authtime 1790643453, etypes {rep=17 tkt=17 ses=17}, kudu/127.5.11.194@KRBTEST.COM for krbtgt/KRBTEST.COM@KRBTEST.COM
I20260929 00:57:33.224550  7014 init.cc:377] Logged in from keytab as kudu/127.5.11.194@KRBTEST.COM (short username kudu)
I20260929 00:57:33.234906  7014 webserver.cc:460] Webserver started at http://127.5.11.194:35179/ using document root <none> and password file <none>
I20260929 00:57:33.235879  7014 fs_manager.cc:359] Metadata directory not provided
I20260929 00:57:33.236018  7014 fs_manager.cc:365] Using write-ahead log directory (fs_wal_dir) as metadata directory
I20260929 00:57:33.236369  7014 server_base.cc:882] This appears to be a new deployment of Kudu; creating new FS layout
I20260929 00:57:33.240212  7014 fs_manager.cc:1063] Generated new instance metadata in path /tmp/dist-test-taskeXDuD2/test-tmp/ts_authz-itest.0.AuthzProviders_TSAuthzTxnOpsITest.BasicOperationsForAuthorizedUsers_Ranger.1790643240301354-5167-0/minicluster-data/ts-1/data/instance:
uuid: "52f41ef7b3e54ff999cd6d5063407f59"
format_stamp: "Formatted at 2026-09-29 00:57:33 on dist-test-slave-w3ts"
I20260929 00:57:33.241279  7014 fs_manager.cc:1063] Generated new instance metadata in path /tmp/dist-test-taskeXDuD2/test-tmp/ts_authz-itest.0.AuthzProviders_TSAuthzTxnOpsITest.BasicOperationsForAuthorizedUsers_Ranger.1790643240301354-5167-0/minicluster-data/ts-1/wal/instance:
uuid: "52f41ef7b3e54ff999cd6d5063407f59"
format_stamp: "Formatted at 2026-09-29 00:57:33 on dist-test-slave-w3ts"
I20260929 00:57:33.248397  7014 fs_manager.cc:691] Time spent creating directory manager: real 0.007s	user 0.001s	sys 0.004s
I20260929 00:57:33.253089  7030 log_block_manager.cc:3774] Time spent loading block containers with low live blocks: real 0.000s	user 0.000s	sys 0.000s
I20260929 00:57:33.255089  7014 fs_manager.cc:725] Time spent opening block manager: real 0.004s	user 0.003s	sys 0.000s
I20260929 00:57:33.255359  7014 fs_manager.cc:642] Opened local filesystem: /tmp/dist-test-taskeXDuD2/test-tmp/ts_authz-itest.0.AuthzProviders_TSAuthzTxnOpsITest.BasicOperationsForAuthorizedUsers_Ranger.1790643240301354-5167-0/minicluster-data/ts-1/data,/tmp/dist-test-taskeXDuD2/test-tmp/ts_authz-itest.0.AuthzProviders_TSAuthzTxnOpsITest.BasicOperationsForAuthorizedUsers_Ranger.1790643240301354-5167-0/minicluster-data/ts-1/wal
uuid: "52f41ef7b3e54ff999cd6d5063407f59"
format_stamp: "Formatted at 2026-09-29 00:57:33 on dist-test-slave-w3ts"
I20260929 00:57:33.255637  7014 fs_report.cc:383] FS layout report
--------------------
wal directory: /tmp/dist-test-taskeXDuD2/test-tmp/ts_authz-itest.0.AuthzProviders_TSAuthzTxnOpsITest.BasicOperationsForAuthorizedUsers_Ranger.1790643240301354-5167-0/minicluster-data/ts-1/wal
metadata directory: /tmp/dist-test-taskeXDuD2/test-tmp/ts_authz-itest.0.AuthzProviders_TSAuthzTxnOpsITest.BasicOperationsForAuthorizedUsers_Ranger.1790643240301354-5167-0/minicluster-data/ts-1/wal
1 data directories: /tmp/dist-test-taskeXDuD2/test-tmp/ts_authz-itest.0.AuthzProviders_TSAuthzTxnOpsITest.BasicOperationsForAuthorizedUsers_Ranger.1790643240301354-5167-0/minicluster-data/ts-1/data/data
Total live blocks: 0
Total live bytes: 0
Total live bytes (after alignment): 0
Total number of LBM containers: 0 (0 full)
Did not check for missing blocks
Did not check for orphaned blocks
Total full LBM containers with extra space: 0 (0 repaired)
Total full LBM container extra space in bytes: 0 (0 repaired)
Total incomplete LBM containers: 0 (0 repaired)
Total LBM partial records: 0 (0 repaired)
Total corrupted LBM metadata records in RocksDB: 0 (0 repaired)
I20260929 00:57:33.291772  7014 rpc_server.cc:225] running with OpenSSL 1.0.2k-fips  26 Jan 2017
I20260929 00:57:33.301903  7014 env_posix.cc:2256] Not raising this process' running threads per effective uid limit of 18446744073709551615; it is already as high as it can go
I20260929 00:57:33.302286  7014 kserver.cc:163] Server-wide thread pool size limit: 3276
Sep 29 00:57:33 dist-test-slave-w3ts krb5kdc[6403](info): TGS_REQ (2 etypes {17 16}) 127.0.0.1: ISSUE: authtime 1790643452, etypes {rep=17 tkt=17 ses=17}, kudu/127.5.11.254@KRBTEST.COM for HTTP/127.5.11.212@KRBTEST.COM
I20260929 00:57:33.317554  7014 ts_tablet_manager.cc:579] Loaded tablet metadata (0 total tablets, 0 live tablets)
I20260929 00:57:33.317745  7014 ts_tablet_manager.cc:525] Time spent load tablet metadata: real 0.000s	user 0.000s	sys 0.000s
I20260929 00:57:33.317909  7014 ts_tablet_manager.cc:610] Registered 0 tablets
I20260929 00:57:33.318063  7014 ts_tablet_manager.cc:589] Time spent register tablets: real 0.000s	user 0.000s	sys 0.000s
Sep 29 00:57:33 dist-test-slave-w3ts krb5kdc[6403](info): TGS_REQ (2 etypes {17 16}) 127.0.0.1: ISSUE: authtime 1790643453, etypes {rep=17 tkt=17 ses=17}, kudu/127.5.11.194@KRBTEST.COM for kudu/127.5.11.254@KRBTEST.COM
I20260929 00:57:33.468346  7014 rpc_server.cc:307] RPC server started. Bound to: 127.5.11.194:45933
I20260929 00:57:33.468389  7152 acceptor_pool.cc:254] collecting diagnostics on the listening RPC socket 127.5.11.194:45933 every 8 connection(s)
I20260929 00:57:33.470212  7014 server_base.cc:1166] Dumped server information to /tmp/dist-test-taskeXDuD2/test-tmp/ts_authz-itest.0.AuthzProviders_TSAuthzTxnOpsITest.BasicOperationsForAuthorizedUsers_Ranger.1790643240301354-5167-0/minicluster-data/ts-1/data/info.pb
I20260929 00:57:33.478272  5167 external_mini_cluster.cc:1388] Started /tmp/dist-test-taskeXDuD2/build/asan/bin/kudu as pid 7014
I20260929 00:57:33.478448  5167 external_mini_cluster.cc:1402] Reading /tmp/dist-test-taskeXDuD2/test-tmp/ts_authz-itest.0.AuthzProviders_TSAuthzTxnOpsITest.BasicOperationsForAuthorizedUsers_Ranger.1790643240301354-5167-0/minicluster-data/ts-1/wal/instance
I20260929 00:57:33.501374  7153 heartbeater.cc:347] Connected to a master server at 127.5.11.254:33329
I20260929 00:57:33.505411  7153 heartbeater.cc:464] Registering TS with master...
I20260929 00:57:33.506446  7153 heartbeater.cc:511] Master 127.5.11.254:33329 requested a full tablet report, sending...
I20260929 00:57:33.508319  6779 ts_manager.cc:194] Registered new tserver with Master: 52f41ef7b3e54ff999cd6d5063407f59 (127.5.11.194:45933)
I20260929 00:57:33.509616  6779 master_service.cc:496] Signed X509 certificate for tserver {username='kudu', principal='kudu/127.5.11.194@KRBTEST.COM'} at 127.5.11.194:36335
WARNING: no policy specified for kudu/127.5.11.195@KRBTEST.COM; defaulting to no policy
Authenticating as principal test-admin/admin@KRBTEST.COM with password.
Principal "kudu/127.5.11.195@KRBTEST.COM" created.
Authenticating as principal test-admin/admin@KRBTEST.COM with password.
Entry for principal kudu/127.5.11.195 with kvno 2, encryption type aes256-cts-hmac-sha1-96 added to keytab WRFILE:/tmp/dist-test-taskeXDuD2/test-tmp/ts_authz-itest.0.AuthzProviders_TSAuthzTxnOpsITest.BasicOperationsForAuthorizedUsers_Ranger.1790643240301354-5167-0/krb5kdc/kudu_127.5.11.195.keytab.
Entry for principal kudu/127.5.11.195 with kvno 2, encryption type aes128-cts-hmac-sha1-96 added to keytab WRFILE:/tmp/dist-test-taskeXDuD2/test-tmp/ts_authz-itest.0.AuthzProviders_TSAuthzTxnOpsITest.BasicOperationsForAuthorizedUsers_Ranger.1790643240301354-5167-0/krb5kdc/kudu_127.5.11.195.keytab.
I20260929 00:57:33.553789  5167 external_mini_cluster.cc:1326] Running /tmp/dist-test-taskeXDuD2/build/asan/bin/kudu
/tmp/dist-test-taskeXDuD2/build/asan/bin/kudu
--fs_wal_dir=/tmp/dist-test-taskeXDuD2/test-tmp/ts_authz-itest.0.AuthzProviders_TSAuthzTxnOpsITest.BasicOperationsForAuthorizedUsers_Ranger.1790643240301354-5167-0/minicluster-data/ts-2/wal
--fs_data_dirs=/tmp/dist-test-taskeXDuD2/test-tmp/ts_authz-itest.0.AuthzProviders_TSAuthzTxnOpsITest.BasicOperationsForAuthorizedUsers_Ranger.1790643240301354-5167-0/minicluster-data/ts-2/data
--block_manager=log
--webserver_interface=localhost
--never_fsync
--enable_minidumps=false
--redact=none
--metrics_log_interval_ms=1000
--log_dir=/tmp/dist-test-taskeXDuD2/test-tmp/ts_authz-itest.0.AuthzProviders_TSAuthzTxnOpsITest.BasicOperationsForAuthorizedUsers_Ranger.1790643240301354-5167-0/minicluster-data/ts-2/logs
--server_dump_info_path=/tmp/dist-test-taskeXDuD2/test-tmp/ts_authz-itest.0.AuthzProviders_TSAuthzTxnOpsITest.BasicOperationsForAuthorizedUsers_Ranger.1790643240301354-5167-0/minicluster-data/ts-2/data/info.pb
--server_dump_info_format=pb
--rpc_server_allow_ephemeral_ports
--unlock_experimental_flags
--unlock_unsafe_flags
--logtostderr
--logbuflevel=-1
--ipki_server_key_size=768
--openssl_security_level_override=0
tserver
run
--rpc_bind_addresses=127.5.11.195:0
--local_ip_for_outbound_sockets=127.5.11.195
--webserver_interface=127.5.11.195
--webserver_port=0
--tserver_master_addrs=127.5.11.254:33329
--keytab_file=/tmp/dist-test-taskeXDuD2/test-tmp/ts_authz-itest.0.AuthzProviders_TSAuthzTxnOpsITest.BasicOperationsForAuthorizedUsers_Ranger.1790643240301354-5167-0/krb5kdc/kudu_127.5.11.195.keytab
--principal=kudu/127.5.11.195
--rpc_authentication=required
--superuser_acl=test-admin
--user_acl=test-user
--builtin_ntp_servers=127.5.11.212:42231
--builtin_ntp_poll_interval_ms=100
--ntp_initial_sync_wait_secs=10
--time_source=builtin
--user_acl=user0,user1,user2
--tserver_enforce_access_control=true
--enable_txn_system_client_init with env {KRB5CCNAME=/tmp/dist-test-taskeXDuD2/test-tmp/ts_authz-itest.0.AuthzProviders_TSAuthzTxnOpsITest.BasicOperationsForAuthorizedUsers_Ranger.1790643240301354-5167-0/krb5kdc/krb5cc,KRB5_CONFIG=/tmp/dist-test-taskeXDuD2/test-tmp/ts_authz-itest.0.AuthzProviders_TSAuthzTxnOpsITest.BasicOperationsForAuthorizedUsers_Ranger.1790643240301354-5167-0/krb5kdc/krb5.conf,KRB5_KDC_PROFILE=/tmp/dist-test-taskeXDuD2/test-tmp/ts_authz-itest.0.AuthzProviders_TSAuthzTxnOpsITest.BasicOperationsForAuthorizedUsers_Ranger.1790643240301354-5167-0/krb5kdc/kdc.conf,KUDU_ENABLE_KRB5_REALM_FIX=yes}
I20260929 00:57:33.646642  7010 heartbeater.cc:503] Master 127.5.11.254:33329 was elected leader, sending a full tablet report...
W20260929 00:57:33.940470  7157 flags.cc:425] Enabled unsafe flag: --openssl_security_level_override=0
W20260929 00:57:33.940809  7157 flags.cc:425] Enabled unsafe flag: --rpc_server_allow_ephemeral_ports=true
W20260929 00:57:33.940953  7157 flags.cc:425] Enabled unsafe flag: --never_fsync=true
W20260929 00:57:33.948352  7157 flags.cc:425] Enabled experimental flag: --ipki_server_key_size=768
W20260929 00:57:33.948530  7157 flags.cc:425] Enabled experimental flag: --enable_txn_system_client_init=true
W20260929 00:57:33.948632  7157 flags.cc:425] Enabled experimental flag: --local_ip_for_outbound_sockets=127.5.11.195
I20260929 00:57:33.958308  7157 tablet_server_runner.cc:78] Tablet server non-default flags:
--builtin_ntp_poll_interval_ms=100
--builtin_ntp_servers=127.5.11.212:42231
--ntp_initial_sync_wait_secs=10
--time_source=builtin
--fs_data_dirs=/tmp/dist-test-taskeXDuD2/test-tmp/ts_authz-itest.0.AuthzProviders_TSAuthzTxnOpsITest.BasicOperationsForAuthorizedUsers_Ranger.1790643240301354-5167-0/minicluster-data/ts-2/data
--fs_wal_dir=/tmp/dist-test-taskeXDuD2/test-tmp/ts_authz-itest.0.AuthzProviders_TSAuthzTxnOpsITest.BasicOperationsForAuthorizedUsers_Ranger.1790643240301354-5167-0/minicluster-data/ts-2/wal
--keytab_file=/tmp/dist-test-taskeXDuD2/test-tmp/ts_authz-itest.0.AuthzProviders_TSAuthzTxnOpsITest.BasicOperationsForAuthorizedUsers_Ranger.1790643240301354-5167-0/krb5kdc/kudu_127.5.11.195.keytab
--principal=kudu/127.5.11.195
--ipki_server_key_size=768
--openssl_security_level_override=0
--rpc_bind_addresses=127.5.11.195:0
--rpc_server_allow_ephemeral_ports=true
--rpc_authentication=required
--superuser_acl=<redacted>
--user_acl=<redacted>
--metrics_log_interval_ms=1000
--server_dump_info_format=pb
--server_dump_info_path=/tmp/dist-test-taskeXDuD2/test-tmp/ts_authz-itest.0.AuthzProviders_TSAuthzTxnOpsITest.BasicOperationsForAuthorizedUsers_Ranger.1790643240301354-5167-0/minicluster-data/ts-2/data/info.pb
--webserver_interface=127.5.11.195
--webserver_port=0
--enable_txn_system_client_init=true
--tserver_master_addrs=127.5.11.254:33329
--tserver_enforce_access_control=true
--never_fsync=true
--redact=none
--unlock_experimental_flags=true
--unlock_unsafe_flags=true
--enable_minidumps=false
--local_ip_for_outbound_sockets=127.5.11.195
--log_dir=/tmp/dist-test-taskeXDuD2/test-tmp/ts_authz-itest.0.AuthzProviders_TSAuthzTxnOpsITest.BasicOperationsForAuthorizedUsers_Ranger.1790643240301354-5167-0/minicluster-data/ts-2/logs
--logbuflevel=-1
--logtostderr=true

Tablet server version:
kudu 1.18.0-SNAPSHOT
revision c2d25d5f57d102d9ad9869eaf208d035a22e18aa
build type FASTDEBUG
built by systest at 28 Sep 2026 23:53:35 UTC on ccycloud.quasar-vwuirl.root.comops.site
build id 4678654
ASAN enabled
I20260929 00:57:33.959637  7157 env_posix.cc:2256] Not raising this process' open files per process limit of 1048576; it is already as high as it can go
I20260929 00:57:33.960872  7157 file_cache.cc:493] Constructed file cache file cache with capacity 419430
W20260929 00:57:33.974939  7169 instance_detector.cc:116] could not retrieve AWS instance metadata: Network error: curl error: HTTP response code said error: The requested URL returned error: 404
W20260929 00:57:33.975075  7170 instance_detector.cc:116] could not retrieve Azure instance metadata: Network error: curl error: HTTP response code said error: The requested URL returned error: 404
W20260929 00:57:33.975522  7172 instance_detector.cc:116] could not retrieve OpenStack instance metadata: Network error: curl error: HTTP response code said error: The requested URL returned error: 404
I20260929 00:57:33.975826  7157 server_base.cc:1034] running on GCE node
I20260929 00:57:33.976365  7157 hybrid_clock.cc:584] initializing the hybrid clock with 'builtin' time source
I20260929 00:57:33.977334  7157 hybrid_clock.cc:630] waiting up to --ntp_initial_sync_wait_secs=10 seconds for the clock to synchronize
I20260929 00:57:33.978546  7157 hybrid_clock.cc:648] HybridClock initialized: now 1790643453978485 us; error 51 us; skew 500 ppm
I20260929 00:57:33.978845  7157 server_base.cc:834] Flag tcmalloc_max_total_thread_cache_bytes is not working since tcmalloc is not enabled.
Sep 29 00:57:33 dist-test-slave-w3ts krb5kdc[6403](info): AS_REQ (2 etypes {17 16}) 127.0.0.1: ISSUE: authtime 1790643453, etypes {rep=17 tkt=17 ses=17}, kudu/127.5.11.195@KRBTEST.COM for krbtgt/KRBTEST.COM@KRBTEST.COM
I20260929 00:57:33.981915  7157 init.cc:377] Logged in from keytab as kudu/127.5.11.195@KRBTEST.COM (short username kudu)
I20260929 00:57:33.983266  7157 webserver.cc:460] Webserver started at http://127.5.11.195:32947/ using document root <none> and password file <none>
I20260929 00:57:33.983920  7157 fs_manager.cc:359] Metadata directory not provided
I20260929 00:57:33.984016  7157 fs_manager.cc:365] Using write-ahead log directory (fs_wal_dir) as metadata directory
I20260929 00:57:33.984257  7157 server_base.cc:882] This appears to be a new deployment of Kudu; creating new FS layout
I20260929 00:57:33.986850  7157 fs_manager.cc:1063] Generated new instance metadata in path /tmp/dist-test-taskeXDuD2/test-tmp/ts_authz-itest.0.AuthzProviders_TSAuthzTxnOpsITest.BasicOperationsForAuthorizedUsers_Ranger.1790643240301354-5167-0/minicluster-data/ts-2/data/instance:
uuid: "a3f47e7d09294851b85fa401e2813008"
format_stamp: "Formatted at 2026-09-29 00:57:33 on dist-test-slave-w3ts"
I20260929 00:57:33.987553  7157 fs_manager.cc:1063] Generated new instance metadata in path /tmp/dist-test-taskeXDuD2/test-tmp/ts_authz-itest.0.AuthzProviders_TSAuthzTxnOpsITest.BasicOperationsForAuthorizedUsers_Ranger.1790643240301354-5167-0/minicluster-data/ts-2/wal/instance:
uuid: "a3f47e7d09294851b85fa401e2813008"
format_stamp: "Formatted at 2026-09-29 00:57:33 on dist-test-slave-w3ts"
I20260929 00:57:33.992843  7157 fs_manager.cc:691] Time spent creating directory manager: real 0.005s	user 0.002s	sys 0.004s
I20260929 00:57:33.996397  7179 log_block_manager.cc:3774] Time spent loading block containers with low live blocks: real 0.000s	user 0.000s	sys 0.000s
I20260929 00:57:33.997867  7157 fs_manager.cc:725] Time spent opening block manager: real 0.003s	user 0.003s	sys 0.000s
I20260929 00:57:33.998004  7157 fs_manager.cc:642] Opened local filesystem: /tmp/dist-test-taskeXDuD2/test-tmp/ts_authz-itest.0.AuthzProviders_TSAuthzTxnOpsITest.BasicOperationsForAuthorizedUsers_Ranger.1790643240301354-5167-0/minicluster-data/ts-2/data,/tmp/dist-test-taskeXDuD2/test-tmp/ts_authz-itest.0.AuthzProviders_TSAuthzTxnOpsITest.BasicOperationsForAuthorizedUsers_Ranger.1790643240301354-5167-0/minicluster-data/ts-2/wal
uuid: "a3f47e7d09294851b85fa401e2813008"
format_stamp: "Formatted at 2026-09-29 00:57:33 on dist-test-slave-w3ts"
I20260929 00:57:33.998227  7157 fs_report.cc:383] FS layout report
--------------------
wal directory: /tmp/dist-test-taskeXDuD2/test-tmp/ts_authz-itest.0.AuthzProviders_TSAuthzTxnOpsITest.BasicOperationsForAuthorizedUsers_Ranger.1790643240301354-5167-0/minicluster-data/ts-2/wal
metadata directory: /tmp/dist-test-taskeXDuD2/test-tmp/ts_authz-itest.0.AuthzProviders_TSAuthzTxnOpsITest.BasicOperationsForAuthorizedUsers_Ranger.1790643240301354-5167-0/minicluster-data/ts-2/wal
1 data directories: /tmp/dist-test-taskeXDuD2/test-tmp/ts_authz-itest.0.AuthzProviders_TSAuthzTxnOpsITest.BasicOperationsForAuthorizedUsers_Ranger.1790643240301354-5167-0/minicluster-data/ts-2/data/data
Total live blocks: 0
Total live bytes: 0
Total live bytes (after alignment): 0
Total number of LBM containers: 0 (0 full)
Did not check for missing blocks
Did not check for orphaned blocks
Total full LBM containers with extra space: 0 (0 repaired)
Total full LBM container extra space in bytes: 0 (0 repaired)
Total incomplete LBM containers: 0 (0 repaired)
Total LBM partial records: 0 (0 repaired)
Total corrupted LBM metadata records in RocksDB: 0 (0 repaired)
I20260929 00:57:34.019555  7157 rpc_server.cc:225] running with OpenSSL 1.0.2k-fips  26 Jan 2017
I20260929 00:57:34.023734  7157 env_posix.cc:2256] Not raising this process' running threads per effective uid limit of 18446744073709551615; it is already as high as it can go
I20260929 00:57:34.024063  7157 kserver.cc:163] Server-wide thread pool size limit: 3276
I20260929 00:57:34.027374  7157 ts_tablet_manager.cc:579] Loaded tablet metadata (0 total tablets, 0 live tablets)
I20260929 00:57:34.027509  7157 ts_tablet_manager.cc:525] Time spent load tablet metadata: real 0.000s	user 0.000s	sys 0.000s
I20260929 00:57:34.027639  7157 ts_tablet_manager.cc:610] Registered 0 tablets
I20260929 00:57:34.027729  7157 ts_tablet_manager.cc:589] Time spent register tablets: real 0.000s	user 0.000s	sys 0.000s
Sep 29 00:57:34 dist-test-slave-w3ts krb5kdc[6403](info): TGS_REQ (2 etypes {17 16}) 127.0.0.1: ISSUE: authtime 1790643453, etypes {rep=17 tkt=17 ses=17}, kudu/127.5.11.195@KRBTEST.COM for kudu/127.5.11.254@KRBTEST.COM
I20260929 00:57:34.068646  7157 rpc_server.cc:307] RPC server started. Bound to: 127.5.11.195:44015
I20260929 00:57:34.068749  7299 acceptor_pool.cc:254] collecting diagnostics on the listening RPC socket 127.5.11.195:44015 every 8 connection(s)
I20260929 00:57:34.070236  7157 server_base.cc:1166] Dumped server information to /tmp/dist-test-taskeXDuD2/test-tmp/ts_authz-itest.0.AuthzProviders_TSAuthzTxnOpsITest.BasicOperationsForAuthorizedUsers_Ranger.1790643240301354-5167-0/minicluster-data/ts-2/data/info.pb
I20260929 00:57:34.072326  7300 heartbeater.cc:347] Connected to a master server at 127.5.11.254:33329
I20260929 00:57:34.072548  7300 heartbeater.cc:464] Registering TS with master...
I20260929 00:57:34.073311  7300 heartbeater.cc:511] Master 127.5.11.254:33329 requested a full tablet report, sending...
I20260929 00:57:34.074605  6779 ts_manager.cc:194] Registered new tserver with Master: a3f47e7d09294851b85fa401e2813008 (127.5.11.195:44015)
I20260929 00:57:34.075629  6779 master_service.cc:496] Signed X509 certificate for tserver {username='kudu', principal='kudu/127.5.11.195@KRBTEST.COM'} at 127.5.11.195:42121
I20260929 00:57:34.077411  5167 external_mini_cluster.cc:1388] Started /tmp/dist-test-taskeXDuD2/build/asan/bin/kudu as pid 7157
I20260929 00:57:34.077607  5167 external_mini_cluster.cc:1402] Reading /tmp/dist-test-taskeXDuD2/test-tmp/ts_authz-itest.0.AuthzProviders_TSAuthzTxnOpsITest.BasicOperationsForAuthorizedUsers_Ranger.1790643240301354-5167-0/minicluster-data/ts-2/wal/instance
I20260929 00:57:34.080837  5167 external_mini_cluster.cc:930] 3 TS(s) registered with all masters
WARNING: no policy specified for kudu@KRBTEST.COM; defaulting to no policy
Authenticating as principal test-admin/admin@KRBTEST.COM with password.
Principal "kudu@KRBTEST.COM" created.
Sep 29 00:57:34 dist-test-slave-w3ts krb5kdc[6403](info): AS_REQ (2 etypes {17 16}) 127.0.0.1: ISSUE: authtime 1790643454, etypes {rep=17 tkt=17 ses=17}, kudu@KRBTEST.COM for krbtgt/KRBTEST.COM@KRBTEST.COM
Password for kudu@KRBTEST.COM: 
I20260929 00:57:34.473737  6779 master_service.cc:963] request to refresh authz privileges cache from {username='test-admin', principal='test-admin@KRBTEST.COM'} at 127.0.0.1:53664
I20260929 00:57:34.513166  7153 heartbeater.cc:503] Master 127.5.11.254:33329 was elected leader, sending a full tablet report...
Sep 29 00:57:34 dist-test-slave-w3ts krb5kdc[6403](info): TGS_REQ (2 etypes {17 16}) 127.0.0.1: ISSUE: authtime 1790643452, etypes {rep=17 tkt=17 ses=17}, kudu/127.5.11.254@KRBTEST.COM for HTTP/127.5.11.212@KRBTEST.COM
Sep 29 00:57:34 dist-test-slave-w3ts krb5kdc[6403](info): TGS_REQ (2 etypes {17 16}) 127.0.0.1: ISSUE: authtime 1790643452, etypes {rep=17 tkt=17 ses=17}, kudu/127.5.11.254@KRBTEST.COM for HTTP/127.5.11.212@KRBTEST.COM
WARNING: no policy specified for test-admin@KRBTEST.COM; defaulting to no policy
add_principal: Principal or policy already exists while creating "test-admin@KRBTEST.COM".
Authenticating as principal kudu/admin@KRBTEST.COM with password.
Sep 29 00:57:34 dist-test-slave-w3ts krb5kdc[6403](info): AS_REQ (2 etypes {17 16}) 127.0.0.1: ISSUE: authtime 1790643454, etypes {rep=17 tkt=17 ses=17}, test-admin@KRBTEST.COM for krbtgt/KRBTEST.COM@KRBTEST.COM
Password for test-admin@KRBTEST.COM: 
Sep 29 00:57:34 dist-test-slave-w3ts krb5kdc[6403](info): TGS_REQ (2 etypes {17 16}) 127.0.0.1: ISSUE: authtime 1790643454, etypes {rep=17 tkt=17 ses=17}, test-admin@KRBTEST.COM for kudu/127.5.11.254@KRBTEST.COM
WARNING: no policy specified for user0@KRBTEST.COM; defaulting to no policy
Authenticating as principal test-admin/admin@KRBTEST.COM with password.
Principal "user0@KRBTEST.COM" created.
Sep 29 00:57:34 dist-test-slave-w3ts krb5kdc[6403](info): AS_REQ (2 etypes {17 16}) 127.0.0.1: ISSUE: authtime 1790643454, etypes {rep=17 tkt=17 ses=17}, user0@KRBTEST.COM for krbtgt/KRBTEST.COM@KRBTEST.COM
Password for user0@KRBTEST.COM: 
Sep 29 00:57:34 dist-test-slave-w3ts krb5kdc[6403](info): TGS_REQ (2 etypes {17 16}) 127.0.0.1: ISSUE: authtime 1790643454, etypes {rep=17 tkt=17 ses=17}, user0@KRBTEST.COM for kudu/127.5.11.254@KRBTEST.COM
I20260929 00:57:34.914801  5167 test_util.cc:268] Using random seed: -1425231668
I20260929 00:57:34.916669  6779 catalog_manager.cc:1908] Servicing CreateTable request from {username='test-admin', principal='test-admin@KRBTEST.COM'} at 127.0.0.1:53682:
name: "db.table_commit"
schema {
  columns {
    name: "col0"
    type: INT32
    is_key: true
    is_nullable: false
    encoding: AUTO_ENCODING
    compression: DEFAULT_COMPRESSION
    cfile_block_size: 0
    immutable: false
  }
  columns {
    name: "col1"
    type: INT32
    is_key: false
    is_nullable: true
    encoding: AUTO_ENCODING
    compression: DEFAULT_COMPRESSION
    cfile_block_size: 0
    immutable: false
  }
  columns {
    name: "col2"
    type: INT32
    is_key: false
    is_nullable: true
    encoding: AUTO_ENCODING
    compression: DEFAULT_COMPRESSION
    cfile_block_size: 0
    immutable: false
  }
}
num_replicas: 1
split_rows_range_bounds {
}
partition_schema {
  range_schema {
    columns {
      name: "col0"
    }
  }
}
owner: "user0"
I20260929 00:57:34.947888  7088 tablet_service.cc:1467] Processing CreateTablet for tablet 831d2ed8dd2946f88217335ce8897b0a (DEFAULT_TABLE table=db.table_commit [id=51f55057c9da451b916e578cc861b92a]), partition=RANGE (col0) PARTITION UNBOUNDED
I20260929 00:57:34.949251  7088 data_dirs.cc:395] Could only allocate 1 dirs of requested 3 for tablet 831d2ed8dd2946f88217335ce8897b0a. 1 dirs total, 0 dirs full, 0 dirs failed
I20260929 00:57:34.958951  7335 tablet_bootstrap.cc:492] T 831d2ed8dd2946f88217335ce8897b0a P 52f41ef7b3e54ff999cd6d5063407f59: Bootstrap starting.
I20260929 00:57:34.962026  7335 tablet_bootstrap.cc:654] T 831d2ed8dd2946f88217335ce8897b0a P 52f41ef7b3e54ff999cd6d5063407f59: Neither blocks nor log segments found. Creating new log.
I20260929 00:57:34.962949  7335 log.cc:824] T 831d2ed8dd2946f88217335ce8897b0a P 52f41ef7b3e54ff999cd6d5063407f59: Log is configured to *not* fsync() on all Append() calls
I20260929 00:57:34.965085  7335 tablet_bootstrap.cc:492] T 831d2ed8dd2946f88217335ce8897b0a P 52f41ef7b3e54ff999cd6d5063407f59: No bootstrap required, opened a new log
I20260929 00:57:34.965333  7335 ts_tablet_manager.cc:1397] T 831d2ed8dd2946f88217335ce8897b0a P 52f41ef7b3e54ff999cd6d5063407f59: Time spent bootstrapping tablet: real 0.007s	user 0.006s	sys 0.000s
I20260929 00:57:34.972043  7335 raft_consensus.cc:348] T 831d2ed8dd2946f88217335ce8897b0a P 52f41ef7b3e54ff999cd6d5063407f59 [term 0 FOLLOWER]: Replica starting. Triggering 0 pending ops. Active config: opid_index: -1 OBSOLETE_local: true peers { permanent_uuid: "52f41ef7b3e54ff999cd6d5063407f59" member_type: VOTER last_known_addr { host: "127.5.11.194" port: 45933 } }
I20260929 00:57:34.972335  7335 raft_consensus.cc:374] T 831d2ed8dd2946f88217335ce8897b0a P 52f41ef7b3e54ff999cd6d5063407f59 [term 0 FOLLOWER]: Consensus starting up: Expiring failure detector timer to make a prompt election more likely
I20260929 00:57:34.972422  7335 raft_consensus.cc:729] T 831d2ed8dd2946f88217335ce8897b0a P 52f41ef7b3e54ff999cd6d5063407f59 [term 0 FOLLOWER]: Becoming Follower/Learner. State: Replica: 52f41ef7b3e54ff999cd6d5063407f59, State: Initialized, Role: FOLLOWER
I20260929 00:57:34.972924  7335 consensus_queue.cc:260] T 831d2ed8dd2946f88217335ce8897b0a P 52f41ef7b3e54ff999cd6d5063407f59 [NON_LEADER]: Queue going to NON_LEADER mode. State: All replicated index: 0, Majority replicated index: 0, Committed index: 0, Last appended: 0.0, Last appended by leader: 0, Current term: 0, Majority size: -1, State: 0, Mode: NON_LEADER, active raft config: opid_index: -1 OBSOLETE_local: true peers { permanent_uuid: "52f41ef7b3e54ff999cd6d5063407f59" member_type: VOTER last_known_addr { host: "127.5.11.194" port: 45933 } }
I20260929 00:57:34.973111  7335 raft_consensus.cc:388] T 831d2ed8dd2946f88217335ce8897b0a P 52f41ef7b3e54ff999cd6d5063407f59 [term 0 FOLLOWER]: Only one voter in the Raft config. Triggering election immediately
I20260929 00:57:34.973249  7335 raft_consensus.cc:482] T 831d2ed8dd2946f88217335ce8897b0a P 52f41ef7b3e54ff999cd6d5063407f59 [term 0 FOLLOWER]: Starting leader election (initial election of a single-replica configuration)
I20260929 00:57:34.973420  7335 raft_consensus.cc:3037] T 831d2ed8dd2946f88217335ce8897b0a P 52f41ef7b3e54ff999cd6d5063407f59 [term 0 FOLLOWER]: Advancing to term 1
I20260929 00:57:34.975221  7335 raft_consensus.cc:504] T 831d2ed8dd2946f88217335ce8897b0a P 52f41ef7b3e54ff999cd6d5063407f59 [term 1 FOLLOWER]: Starting leader election with config: opid_index: -1 OBSOLETE_local: true peers { permanent_uuid: "52f41ef7b3e54ff999cd6d5063407f59" member_type: VOTER last_known_addr { host: "127.5.11.194" port: 45933 } }
I20260929 00:57:34.975683  7335 leader_election.cc:302] T 831d2ed8dd2946f88217335ce8897b0a P 52f41ef7b3e54ff999cd6d5063407f59 [CANDIDATE]: Term 1 election: Election decided. Result: candidate won. Election summary: received 1 responses out of 1 voters: 1 yes votes; 0 no votes. yes voters: 52f41ef7b3e54ff999cd6d5063407f59; no voters: 
I20260929 00:57:34.976233  7335 leader_election.cc:288] T 831d2ed8dd2946f88217335ce8897b0a P 52f41ef7b3e54ff999cd6d5063407f59 [CANDIDATE]: Term 1 election: Requested vote from peers 
I20260929 00:57:34.976358  7337 raft_consensus.cc:2781] T 831d2ed8dd2946f88217335ce8897b0a P 52f41ef7b3e54ff999cd6d5063407f59 [term 1 FOLLOWER]: Leader election won for term 1
I20260929 00:57:34.977005  7337 raft_consensus.cc:686] T 831d2ed8dd2946f88217335ce8897b0a P 52f41ef7b3e54ff999cd6d5063407f59 [term 1 LEADER]: Becoming Leader. State: Replica: 52f41ef7b3e54ff999cd6d5063407f59, State: Running, Role: LEADER
I20260929 00:57:34.977540  7337 consensus_queue.cc:237] T 831d2ed8dd2946f88217335ce8897b0a P 52f41ef7b3e54ff999cd6d5063407f59 [LEADER]: Queue going to LEADER mode. State: All replicated index: 0, Majority replicated index: 0, Committed index: 0, Last appended: 0.0, Last appended by leader: 0, Current term: 1, Majority size: 1, State: 0, Mode: LEADER, active raft config: opid_index: -1 OBSOLETE_local: true peers { permanent_uuid: "52f41ef7b3e54ff999cd6d5063407f59" member_type: VOTER last_known_addr { host: "127.5.11.194" port: 45933 } }
I20260929 00:57:34.977901  7335 ts_tablet_manager.cc:1428] T 831d2ed8dd2946f88217335ce8897b0a P 52f41ef7b3e54ff999cd6d5063407f59: Time spent starting tablet: real 0.012s	user 0.008s	sys 0.004s
I20260929 00:57:34.982443  6779 catalog_manager.cc:5495] T 831d2ed8dd2946f88217335ce8897b0a P 52f41ef7b3e54ff999cd6d5063407f59 reported cstate change: term changed from 0 to 1, leader changed from <none> to 52f41ef7b3e54ff999cd6d5063407f59 (127.5.11.194). New cstate: current_term: 1 leader_uuid: "52f41ef7b3e54ff999cd6d5063407f59" committed_config { opid_index: -1 OBSOLETE_local: true peers { permanent_uuid: "52f41ef7b3e54ff999cd6d5063407f59" member_type: VOTER last_known_addr { host: "127.5.11.194" port: 45933 } health_report { overall_health: HEALTHY } } }
I20260929 00:57:35.078011  7300 heartbeater.cc:503] Master 127.5.11.254:33329 was elected leader, sending a full tablet report...
I20260929 00:57:35.124150  6779 master_service.cc:963] request to refresh authz privileges cache from {username='test-admin', principal='test-admin@KRBTEST.COM'} at 127.0.0.1:53664
Sep 29 00:57:35 dist-test-slave-w3ts krb5kdc[6403](info): TGS_REQ (2 etypes {17 16}) 127.0.0.1: ISSUE: authtime 1790643452, etypes {rep=17 tkt=17 ses=17}, kudu/127.5.11.254@KRBTEST.COM for HTTP/127.5.11.212@KRBTEST.COM
Sep 29 00:57:35 dist-test-slave-w3ts krb5kdc[6403](info): TGS_REQ (2 etypes {17 16}) 127.0.0.1: ISSUE: authtime 1790643452, etypes {rep=17 tkt=17 ses=17}, kudu/127.5.11.254@KRBTEST.COM for HTTP/127.5.11.212@KRBTEST.COM
I20260929 00:57:35.445113  6779 master_service.cc:963] request to refresh authz privileges cache from {username='test-admin', principal='test-admin@KRBTEST.COM'} at 127.0.0.1:53664
Sep 29 00:57:35 dist-test-slave-w3ts krb5kdc[6403](info): TGS_REQ (2 etypes {17 16}) 127.0.0.1: ISSUE: authtime 1790643452, etypes {rep=17 tkt=17 ses=17}, kudu/127.5.11.254@KRBTEST.COM for HTTP/127.5.11.212@KRBTEST.COM
Sep 29 00:57:35 dist-test-slave-w3ts krb5kdc[6403](info): TGS_REQ (2 etypes {17 16}) 127.0.0.1: ISSUE: authtime 1790643452, etypes {rep=17 tkt=17 ses=17}, kudu/127.5.11.254@KRBTEST.COM for HTTP/127.5.11.212@KRBTEST.COM
Sep 29 00:57:35 dist-test-slave-w3ts krb5kdc[6403](info): TGS_REQ (2 etypes {17 16}) 127.0.0.1: ISSUE: authtime 1790643450, etypes {rep=17 tkt=17 ses=17}, kudu/127.5.11.254@KRBTEST.COM for kudu/127.5.11.254@KRBTEST.COM
I20260929 00:57:35.630201  6779 catalog_manager.cc:1908] Servicing CreateTable request from {username='kudu', principal='kudu/127.5.11.254@KRBTEST.COM'} at 127.0.0.1:53690:
name: "kudu_system.kudu_transactions"
schema {
  columns {
    name: "txn_id"
    type: INT64
    is_key: true
    is_nullable: false
    encoding: AUTO_ENCODING
    compression: DEFAULT_COMPRESSION
    cfile_block_size: 0
    immutable: false
  }
  columns {
    name: "entry_type"
    type: INT8
    is_key: true
    is_nullable: false
    encoding: AUTO_ENCODING
    compression: DEFAULT_COMPRESSION
    cfile_block_size: 0
    immutable: false
  }
  columns {
    name: "identifier"
    type: STRING
    is_key: true
    is_nullable: false
    encoding: AUTO_ENCODING
    compression: DEFAULT_COMPRESSION
    cfile_block_size: 0
    immutable: false
  }
  columns {
    name: "metadata"
    type: STRING
    is_key: false
    is_nullable: false
    encoding: AUTO_ENCODING
    compression: DEFAULT_COMPRESSION
    cfile_block_size: 0
    immutable: false
  }
}
num_replicas: 1
split_rows_range_bounds {
  rows: "<redacted>""\006\001\000\000\000\000\000\000\000\000\007\001@B\017\000\000\000\000\000"
  indirect_data: "<redacted>"""
}
partition_schema {
  range_schema {
    columns {
      name: "txn_id"
    }
  }
}
table_type: TXN_STATUS_TABLE
I20260929 00:57:35.650216  7230 tablet_service.cc:1467] Processing CreateTablet for tablet e34cf4e0c0d1407c876b5bc1f6154510 (TXN_STATUS_TABLE table=kudu_system.kudu_transactions [id=0223a57e54f3486587c3fc6532bb0e20]), partition=RANGE (txn_id) PARTITION 0 <= VALUES < 1000000
I20260929 00:57:35.651746  7230 data_dirs.cc:395] Could only allocate 1 dirs of requested 3 for tablet e34cf4e0c0d1407c876b5bc1f6154510. 1 dirs total, 0 dirs full, 0 dirs failed
I20260929 00:57:35.662624  7357 tablet_bootstrap.cc:492] T e34cf4e0c0d1407c876b5bc1f6154510 P a3f47e7d09294851b85fa401e2813008: Bootstrap starting.
I20260929 00:57:35.666011  7357 tablet_bootstrap.cc:654] T e34cf4e0c0d1407c876b5bc1f6154510 P a3f47e7d09294851b85fa401e2813008: Neither blocks nor log segments found. Creating new log.
I20260929 00:57:35.667259  7357 log.cc:824] T e34cf4e0c0d1407c876b5bc1f6154510 P a3f47e7d09294851b85fa401e2813008: Log is configured to *not* fsync() on all Append() calls
I20260929 00:57:35.670434  7357 tablet_bootstrap.cc:492] T e34cf4e0c0d1407c876b5bc1f6154510 P a3f47e7d09294851b85fa401e2813008: No bootstrap required, opened a new log
I20260929 00:57:35.670712  7357 ts_tablet_manager.cc:1397] T e34cf4e0c0d1407c876b5bc1f6154510 P a3f47e7d09294851b85fa401e2813008: Time spent bootstrapping tablet: real 0.008s	user 0.006s	sys 0.000s
I20260929 00:57:35.680016  7357 raft_consensus.cc:348] T e34cf4e0c0d1407c876b5bc1f6154510 P a3f47e7d09294851b85fa401e2813008 [term 0 FOLLOWER]: Replica starting. Triggering 0 pending ops. Active config: opid_index: -1 OBSOLETE_local: true peers { permanent_uuid: "a3f47e7d09294851b85fa401e2813008" member_type: VOTER last_known_addr { host: "127.5.11.195" port: 44015 } }
I20260929 00:57:35.680433  7357 raft_consensus.cc:374] T e34cf4e0c0d1407c876b5bc1f6154510 P a3f47e7d09294851b85fa401e2813008 [term 0 FOLLOWER]: Consensus starting up: Expiring failure detector timer to make a prompt election more likely
I20260929 00:57:35.680536  7357 raft_consensus.cc:729] T e34cf4e0c0d1407c876b5bc1f6154510 P a3f47e7d09294851b85fa401e2813008 [term 0 FOLLOWER]: Becoming Follower/Learner. State: Replica: a3f47e7d09294851b85fa401e2813008, State: Initialized, Role: FOLLOWER
I20260929 00:57:35.681147  7357 consensus_queue.cc:260] T e34cf4e0c0d1407c876b5bc1f6154510 P a3f47e7d09294851b85fa401e2813008 [NON_LEADER]: Queue going to NON_LEADER mode. State: All replicated index: 0, Majority replicated index: 0, Committed index: 0, Last appended: 0.0, Last appended by leader: 0, Current term: 0, Majority size: -1, State: 0, Mode: NON_LEADER, active raft config: opid_index: -1 OBSOLETE_local: true peers { permanent_uuid: "a3f47e7d09294851b85fa401e2813008" member_type: VOTER last_known_addr { host: "127.5.11.195" port: 44015 } }
I20260929 00:57:35.681439  7357 raft_consensus.cc:388] T e34cf4e0c0d1407c876b5bc1f6154510 P a3f47e7d09294851b85fa401e2813008 [term 0 FOLLOWER]: Only one voter in the Raft config. Triggering election immediately
I20260929 00:57:35.681577  7357 raft_consensus.cc:482] T e34cf4e0c0d1407c876b5bc1f6154510 P a3f47e7d09294851b85fa401e2813008 [term 0 FOLLOWER]: Starting leader election (initial election of a single-replica configuration)
I20260929 00:57:35.681744  7357 raft_consensus.cc:3037] T e34cf4e0c0d1407c876b5bc1f6154510 P a3f47e7d09294851b85fa401e2813008 [term 0 FOLLOWER]: Advancing to term 1
I20260929 00:57:35.684307  7357 raft_consensus.cc:504] T e34cf4e0c0d1407c876b5bc1f6154510 P a3f47e7d09294851b85fa401e2813008 [term 1 FOLLOWER]: Starting leader election with config: opid_index: -1 OBSOLETE_local: true peers { permanent_uuid: "a3f47e7d09294851b85fa401e2813008" member_type: VOTER last_known_addr { host: "127.5.11.195" port: 44015 } }
I20260929 00:57:35.684791  7357 leader_election.cc:302] T e34cf4e0c0d1407c876b5bc1f6154510 P a3f47e7d09294851b85fa401e2813008 [CANDIDATE]: Term 1 election: Election decided. Result: candidate won. Election summary: received 1 responses out of 1 voters: 1 yes votes; 0 no votes. yes voters: a3f47e7d09294851b85fa401e2813008; no voters: 
I20260929 00:57:35.685475  7357 leader_election.cc:288] T e34cf4e0c0d1407c876b5bc1f6154510 P a3f47e7d09294851b85fa401e2813008 [CANDIDATE]: Term 1 election: Requested vote from peers 
I20260929 00:57:35.685556  7359 raft_consensus.cc:2781] T e34cf4e0c0d1407c876b5bc1f6154510 P a3f47e7d09294851b85fa401e2813008 [term 1 FOLLOWER]: Leader election won for term 1
I20260929 00:57:35.686245  7359 raft_consensus.cc:686] T e34cf4e0c0d1407c876b5bc1f6154510 P a3f47e7d09294851b85fa401e2813008 [term 1 LEADER]: Becoming Leader. State: Replica: a3f47e7d09294851b85fa401e2813008, State: Running, Role: LEADER
I20260929 00:57:35.686851  7359 consensus_queue.cc:237] T e34cf4e0c0d1407c876b5bc1f6154510 P a3f47e7d09294851b85fa401e2813008 [LEADER]: Queue going to LEADER mode. State: All replicated index: 0, Majority replicated index: 0, Committed index: 0, Last appended: 0.0, Last appended by leader: 0, Current term: 1, Majority size: 1, State: 0, Mode: LEADER, active raft config: opid_index: -1 OBSOLETE_local: true peers { permanent_uuid: "a3f47e7d09294851b85fa401e2813008" member_type: VOTER last_known_addr { host: "127.5.11.195" port: 44015 } }
I20260929 00:57:35.687168  7357 ts_tablet_manager.cc:1428] T e34cf4e0c0d1407c876b5bc1f6154510 P a3f47e7d09294851b85fa401e2813008: Time spent starting tablet: real 0.016s	user 0.011s	sys 0.004s
I20260929 00:57:35.689513  7361 tablet_replica.cc:439] T e34cf4e0c0d1407c876b5bc1f6154510 P a3f47e7d09294851b85fa401e2813008: TxnStatusTablet state changed. Reason: New leader a3f47e7d09294851b85fa401e2813008. Latest consensus state: current_term: 1 leader_uuid: "a3f47e7d09294851b85fa401e2813008" committed_config { opid_index: -1 OBSOLETE_local: true peers { permanent_uuid: "a3f47e7d09294851b85fa401e2813008" member_type: VOTER last_known_addr { host: "127.5.11.195" port: 44015 } } }
I20260929 00:57:35.689927  7361 tablet_replica.cc:442] T e34cf4e0c0d1407c876b5bc1f6154510 P a3f47e7d09294851b85fa401e2813008: This TxnStatusTablet replica's current role is: LEADER
I20260929 00:57:35.691104  7360 tablet_replica.cc:439] T e34cf4e0c0d1407c876b5bc1f6154510 P a3f47e7d09294851b85fa401e2813008: TxnStatusTablet state changed. Reason: RaftConsensus started. Latest consensus state: current_term: 1 leader_uuid: "a3f47e7d09294851b85fa401e2813008" committed_config { opid_index: -1 OBSOLETE_local: true peers { permanent_uuid: "a3f47e7d09294851b85fa401e2813008" member_type: VOTER last_known_addr { host: "127.5.11.195" port: 44015 } } }
I20260929 00:57:35.691838  6779 catalog_manager.cc:5495] T e34cf4e0c0d1407c876b5bc1f6154510 P a3f47e7d09294851b85fa401e2813008 reported cstate change: term changed from 0 to 1, leader changed from <none> to a3f47e7d09294851b85fa401e2813008 (127.5.11.195). New cstate: current_term: 1 leader_uuid: "a3f47e7d09294851b85fa401e2813008" committed_config { opid_index: -1 OBSOLETE_local: true peers { permanent_uuid: "a3f47e7d09294851b85fa401e2813008" member_type: VOTER last_known_addr { host: "127.5.11.195" port: 44015 } health_report { overall_health: HEALTHY } } }
I20260929 00:57:35.692603  7360 tablet_replica.cc:442] T e34cf4e0c0d1407c876b5bc1f6154510 P a3f47e7d09294851b85fa401e2813008: This TxnStatusTablet replica's current role is: LEADER
I20260929 00:57:35.698863  7363 txn_status_manager.cc:873] Waiting until node catch up with all replicated operations in previous term...
I20260929 00:57:35.699138  7363 txn_status_manager.cc:929] Loading transaction status metadata into memory...
I20260929 00:57:35.839457  6779 catalog_manager.cc:1908] Servicing CreateTable request from {username='test-admin', principal='test-admin@KRBTEST.COM'} at 127.0.0.1:53682:
name: "db.table_rollback"
schema {
  columns {
    name: "col0"
    type: INT32
    is_key: true
    is_nullable: false
    encoding: AUTO_ENCODING
    compression: DEFAULT_COMPRESSION
    cfile_block_size: 0
    immutable: false
  }
  columns {
    name: "col1"
    type: INT32
    is_key: false
    is_nullable: true
    encoding: AUTO_ENCODING
    compression: DEFAULT_COMPRESSION
    cfile_block_size: 0
    immutable: false
  }
  columns {
    name: "col2"
    type: INT32
    is_key: false
    is_nullable: true
    encoding: AUTO_ENCODING
    compression: DEFAULT_COMPRESSION
    cfile_block_size: 0
    immutable: false
  }
}
num_replicas: 1
split_rows_range_bounds {
}
partition_schema {
  range_schema {
    columns {
      name: "col0"
    }
  }
}
owner: "user0"
I20260929 00:57:35.861315  6945 tablet_service.cc:1467] Processing CreateTablet for tablet 289b75e605d04d2cbf38de2ada164f36 (DEFAULT_TABLE table=db.table_rollback [id=1919eaa51e1b4156abefeb0a9098f43a]), partition=RANGE (col0) PARTITION UNBOUNDED
I20260929 00:57:35.863479  6945 data_dirs.cc:395] Could only allocate 1 dirs of requested 3 for tablet 289b75e605d04d2cbf38de2ada164f36. 1 dirs total, 0 dirs full, 0 dirs failed
I20260929 00:57:35.881688  7382 tablet_bootstrap.cc:492] T 289b75e605d04d2cbf38de2ada164f36 P 92f15a354f3844d2a6ab3eae052bdb98: Bootstrap starting.
I20260929 00:57:35.887153  7382 tablet_bootstrap.cc:654] T 289b75e605d04d2cbf38de2ada164f36 P 92f15a354f3844d2a6ab3eae052bdb98: Neither blocks nor log segments found. Creating new log.
I20260929 00:57:35.888756  7382 log.cc:824] T 289b75e605d04d2cbf38de2ada164f36 P 92f15a354f3844d2a6ab3eae052bdb98: Log is configured to *not* fsync() on all Append() calls
I20260929 00:57:35.892392  7382 tablet_bootstrap.cc:492] T 289b75e605d04d2cbf38de2ada164f36 P 92f15a354f3844d2a6ab3eae052bdb98: No bootstrap required, opened a new log
I20260929 00:57:35.892719  7382 ts_tablet_manager.cc:1397] T 289b75e605d04d2cbf38de2ada164f36 P 92f15a354f3844d2a6ab3eae052bdb98: Time spent bootstrapping tablet: real 0.011s	user 0.007s	sys 0.000s
I20260929 00:57:35.905339  7382 raft_consensus.cc:348] T 289b75e605d04d2cbf38de2ada164f36 P 92f15a354f3844d2a6ab3eae052bdb98 [term 0 FOLLOWER]: Replica starting. Triggering 0 pending ops. Active config: opid_index: -1 OBSOLETE_local: true peers { permanent_uuid: "92f15a354f3844d2a6ab3eae052bdb98" member_type: VOTER last_known_addr { host: "127.5.11.193" port: 37843 } }
I20260929 00:57:35.905937  7382 raft_consensus.cc:374] T 289b75e605d04d2cbf38de2ada164f36 P 92f15a354f3844d2a6ab3eae052bdb98 [term 0 FOLLOWER]: Consensus starting up: Expiring failure detector timer to make a prompt election more likely
I20260929 00:57:35.906131  7382 raft_consensus.cc:729] T 289b75e605d04d2cbf38de2ada164f36 P 92f15a354f3844d2a6ab3eae052bdb98 [term 0 FOLLOWER]: Becoming Follower/Learner. State: Replica: 92f15a354f3844d2a6ab3eae052bdb98, State: Initialized, Role: FOLLOWER
I20260929 00:57:35.906901  7382 consensus_queue.cc:260] T 289b75e605d04d2cbf38de2ada164f36 P 92f15a354f3844d2a6ab3eae052bdb98 [NON_LEADER]: Queue going to NON_LEADER mode. State: All replicated index: 0, Majority replicated index: 0, Committed index: 0, Last appended: 0.0, Last appended by leader: 0, Current term: 0, Majority size: -1, State: 0, Mode: NON_LEADER, active raft config: opid_index: -1 OBSOLETE_local: true peers { permanent_uuid: "92f15a354f3844d2a6ab3eae052bdb98" member_type: VOTER last_known_addr { host: "127.5.11.193" port: 37843 } }
I20260929 00:57:35.907187  7382 raft_consensus.cc:388] T 289b75e605d04d2cbf38de2ada164f36 P 92f15a354f3844d2a6ab3eae052bdb98 [term 0 FOLLOWER]: Only one voter in the Raft config. Triggering election immediately
I20260929 00:57:35.907330  7382 raft_consensus.cc:482] T 289b75e605d04d2cbf38de2ada164f36 P 92f15a354f3844d2a6ab3eae052bdb98 [term 0 FOLLOWER]: Starting leader election (initial election of a single-replica configuration)
I20260929 00:57:35.907600  7382 raft_consensus.cc:3037] T 289b75e605d04d2cbf38de2ada164f36 P 92f15a354f3844d2a6ab3eae052bdb98 [term 0 FOLLOWER]: Advancing to term 1
I20260929 00:57:35.910539  7382 raft_consensus.cc:504] T 289b75e605d04d2cbf38de2ada164f36 P 92f15a354f3844d2a6ab3eae052bdb98 [term 1 FOLLOWER]: Starting leader election with config: opid_index: -1 OBSOLETE_local: true peers { permanent_uuid: "92f15a354f3844d2a6ab3eae052bdb98" member_type: VOTER last_known_addr { host: "127.5.11.193" port: 37843 } }
I20260929 00:57:35.911165  7382 leader_election.cc:302] T 289b75e605d04d2cbf38de2ada164f36 P 92f15a354f3844d2a6ab3eae052bdb98 [CANDIDATE]: Term 1 election: Election decided. Result: candidate won. Election summary: received 1 responses out of 1 voters: 1 yes votes; 0 no votes. yes voters: 92f15a354f3844d2a6ab3eae052bdb98; no voters: 
I20260929 00:57:35.911859  7382 leader_election.cc:288] T 289b75e605d04d2cbf38de2ada164f36 P 92f15a354f3844d2a6ab3eae052bdb98 [CANDIDATE]: Term 1 election: Requested vote from peers 
I20260929 00:57:35.912001  7384 raft_consensus.cc:2781] T 289b75e605d04d2cbf38de2ada164f36 P 92f15a354f3844d2a6ab3eae052bdb98 [term 1 FOLLOWER]: Leader election won for term 1
I20260929 00:57:35.920053  7384 raft_consensus.cc:686] T 289b75e605d04d2cbf38de2ada164f36 P 92f15a354f3844d2a6ab3eae052bdb98 [term 1 LEADER]: Becoming Leader. State: Replica: 92f15a354f3844d2a6ab3eae052bdb98, State: Running, Role: LEADER
I20260929 00:57:35.921589  7382 ts_tablet_manager.cc:1428] T 289b75e605d04d2cbf38de2ada164f36 P 92f15a354f3844d2a6ab3eae052bdb98: Time spent starting tablet: real 0.028s	user 0.020s	sys 0.004s
I20260929 00:57:35.920766  7384 consensus_queue.cc:237] T 289b75e605d04d2cbf38de2ada164f36 P 92f15a354f3844d2a6ab3eae052bdb98 [LEADER]: Queue going to LEADER mode. State: All replicated index: 0, Majority replicated index: 0, Committed index: 0, Last appended: 0.0, Last appended by leader: 0, Current term: 1, Majority size: 1, State: 0, Mode: LEADER, active raft config: opid_index: -1 OBSOLETE_local: true peers { permanent_uuid: "92f15a354f3844d2a6ab3eae052bdb98" member_type: VOTER last_known_addr { host: "127.5.11.193" port: 37843 } }
I20260929 00:57:35.930466  6779 catalog_manager.cc:5495] T 289b75e605d04d2cbf38de2ada164f36 P 92f15a354f3844d2a6ab3eae052bdb98 reported cstate change: term changed from 0 to 1, leader changed from <none> to 92f15a354f3844d2a6ab3eae052bdb98 (127.5.11.193). New cstate: current_term: 1 leader_uuid: "92f15a354f3844d2a6ab3eae052bdb98" committed_config { opid_index: -1 OBSOLETE_local: true peers { permanent_uuid: "92f15a354f3844d2a6ab3eae052bdb98" member_type: VOTER last_known_addr { host: "127.5.11.193" port: 37843 } health_report { overall_health: HEALTHY } } }
I20260929 00:57:36.108124  6779 master_service.cc:963] request to refresh authz privileges cache from {username='test-admin', principal='test-admin@KRBTEST.COM'} at 127.0.0.1:53664
Sep 29 00:57:36 dist-test-slave-w3ts krb5kdc[6403](info): TGS_REQ (2 etypes {17 16}) 127.0.0.1: ISSUE: authtime 1790643452, etypes {rep=17 tkt=17 ses=17}, kudu/127.5.11.254@KRBTEST.COM for HTTP/127.5.11.212@KRBTEST.COM
Sep 29 00:57:36 dist-test-slave-w3ts krb5kdc[6403](info): TGS_REQ (2 etypes {17 16}) 127.0.0.1: ISSUE: authtime 1790643452, etypes {rep=17 tkt=17 ses=17}, kudu/127.5.11.254@KRBTEST.COM for HTTP/127.5.11.212@KRBTEST.COM
I20260929 00:57:36.405709  6779 master_service.cc:963] request to refresh authz privileges cache from {username='test-admin', principal='test-admin@KRBTEST.COM'} at 127.0.0.1:53664
Sep 29 00:57:36 dist-test-slave-w3ts krb5kdc[6403](info): TGS_REQ (2 etypes {17 16}) 127.0.0.1: ISSUE: authtime 1790643452, etypes {rep=17 tkt=17 ses=17}, kudu/127.5.11.254@KRBTEST.COM for HTTP/127.5.11.212@KRBTEST.COM
Sep 29 00:57:36 dist-test-slave-w3ts krb5kdc[6403](info): TGS_REQ (2 etypes {17 16}) 127.0.0.1: ISSUE: authtime 1790643452, etypes {rep=17 tkt=17 ses=17}, kudu/127.5.11.254@KRBTEST.COM for HTTP/127.5.11.212@KRBTEST.COM
I20260929 00:57:36.564795  5167 external_mini_cluster.cc:1636] Attempting to check leaks for /tmp/dist-test-taskeXDuD2/build/asan/bin/kudu pid 6869
Sep 29 00:57:36 dist-test-slave-w3ts krb5kdc[6403](info): TGS_REQ (2 etypes {17 16}) 127.0.0.1: ISSUE: authtime 1790643454, etypes {rep=17 tkt=17 ses=17}, user0@KRBTEST.COM for kudu/127.5.11.193@KRBTEST.COM
W20260929 00:57:36.591581  7005 server_base.cc:1116] Unauthorized access attempt to method kudu.server.GenericService.CheckLeaks from {username='user0', principal='user0@KRBTEST.COM'} at 127.0.0.1:48510
W20260929 00:57:36.592463  5167 external_mini_cluster.cc:1652] Unable to check leaks on /tmp/dist-test-taskeXDuD2/build/asan/bin/kudu pid 6869: Remote error: Not authorized: unauthorized access to method: CheckLeaks
I20260929 00:57:36.592623  5167 external_mini_cluster.cc:1595] Killing /tmp/dist-test-taskeXDuD2/build/asan/bin/kudu with pid 6869
I20260929 00:57:36.611874  5167 external_mini_cluster.cc:1636] Attempting to check leaks for /tmp/dist-test-taskeXDuD2/build/asan/bin/kudu pid 7014
Sep 29 00:57:36 dist-test-slave-w3ts krb5kdc[6403](info): TGS_REQ (2 etypes {17 16}) 127.0.0.1: ISSUE: authtime 1790643454, etypes {rep=17 tkt=17 ses=17}, user0@KRBTEST.COM for kudu/127.5.11.194@KRBTEST.COM
W20260929 00:57:36.626789  7148 server_base.cc:1116] Unauthorized access attempt to method kudu.server.GenericService.CheckLeaks from {username='user0', principal='user0@KRBTEST.COM'} at 127.0.0.1:49968
W20260929 00:57:36.627377  5167 external_mini_cluster.cc:1652] Unable to check leaks on /tmp/dist-test-taskeXDuD2/build/asan/bin/kudu pid 7014: Remote error: Not authorized: unauthorized access to method: CheckLeaks
I20260929 00:57:36.627552  5167 external_mini_cluster.cc:1595] Killing /tmp/dist-test-taskeXDuD2/build/asan/bin/kudu with pid 7014
I20260929 00:57:36.643033  5167 external_mini_cluster.cc:1636] Attempting to check leaks for /tmp/dist-test-taskeXDuD2/build/asan/bin/kudu pid 7157
Sep 29 00:57:36 dist-test-slave-w3ts krb5kdc[6403](info): TGS_REQ (2 etypes {17 16}) 127.0.0.1: ISSUE: authtime 1790643454, etypes {rep=17 tkt=17 ses=17}, user0@KRBTEST.COM for kudu/127.5.11.195@KRBTEST.COM
W20260929 00:57:36.658281  7295 server_base.cc:1116] Unauthorized access attempt to method kudu.server.GenericService.CheckLeaks from {username='user0', principal='user0@KRBTEST.COM'} at 127.0.0.1:53048
W20260929 00:57:36.659024  5167 external_mini_cluster.cc:1652] Unable to check leaks on /tmp/dist-test-taskeXDuD2/build/asan/bin/kudu pid 7157: Remote error: Not authorized: unauthorized access to method: CheckLeaks
I20260929 00:57:36.659189  5167 external_mini_cluster.cc:1595] Killing /tmp/dist-test-taskeXDuD2/build/asan/bin/kudu with pid 7157
I20260929 00:57:36.676934  5167 external_mini_cluster.cc:1636] Attempting to check leaks for /tmp/dist-test-taskeXDuD2/build/asan/bin/kudu pid 6747
I20260929 00:57:36.678195  6819 generic_service.cc:196] Checking for leaks (request via RPC)
I20260929 00:57:36.796165  5167 external_mini_cluster.cc:1595] Killing /tmp/dist-test-taskeXDuD2/build/asan/bin/kudu with pid 6747
I20260929 00:57:36.818056  5167 mini_ranger.cc:66] Stopping Ranger...
I20260929 00:57:37.153306  5167 mini_ranger.cc:68] Stopped Ranger
2026-09-29 00:57:37.153 UTC [6433] LOG:  received smart shutdown request
2026-09-29 00:57:37.157 UTC [6433] LOG:  background worker "logical replication launcher" (PID 6442) exited with exit code 1
2026-09-29 00:57:37.157 UTC [6437] LOG:  shutting down
2026-09-29 00:57:37.616 UTC [6433] LOG:  database system is shut down
2026-09-29T00:57:37Z chronyd exiting
[       OK ] AuthzProviders/TSAuthzTxnOpsITest.BasicOperationsForAuthorizedUsers/Ranger (40885 ms)
[----------] 1 test from AuthzProviders/TSAuthzTxnOpsITest (40886 ms total)

[----------] Global test environment tear-down
[==========] 3 tests from 2 test suites ran. (217337 ms total)
[  PASSED  ] 2 tests.
[  FAILED  ] 1 test, listed below:
[  FAILED  ] AuthzProviders/TSAuthzITest.TestReadsAndWrites/Ranger, where GetParam() = 0

 1 FAILED TEST