Parameters/TestRpc.TestCallWithChainCertAndRootCA/SSL_TCP: /data0/somelongdirectorytoavoidrpathissues/src/kudu/src/kudu/rpc/rpc-test.cc:303: Failure
Failed
Bad status: Runtime error: could not verify certificate chain (error with cert: subject=CN = localhost, ST = sadfjas, C = AS, emailAddress = sdflkdsajf, O = lskdfjlsad, OU = sldfkja, issuer=C = AS, ST = ASDfkjdhf, L = lskdjf, O = saldfja, OU = skdjf, CN = localhost, emailAddress = sadjflkadsj): : certificate has expired
Google Test trace:
/data0/somelongdirectorytoavoidrpathissues/src/kudu/src/kudu/rpc/rpc-test.cc:300: Connecting to 0.0.0.0:40303
I20260929 10:43:59.602916 20604 test_util.cc:175] -----------------------------------------------
I20260929 10:43:59.603096 20604 test_util.cc:176] Had fatal failures, leaving test files at /tmp/dist-test-taskSO4BBm/test-tmp/rpc-test.1.Parameters_TestRpc.TestCallWithChainCertAndRootCA_SSL_TCP.1790678638155505-20604-0
Note: This is test shard 2 of 8.
[==========] Running 21 tests from 2 test suites.
[----------] Global test environment set-up.
[----------] 1 test from TestRpc
[ RUN ] TestRpc.TestMethodsByName
[ OK ] TestRpc.TestMethodsByName (6 ms)
[----------] 1 test from TestRpc (6 ms total)
[----------] 20 tests from Parameters/TestRpc
[ RUN ] Parameters/TestRpc.TestAcceptorPoolStartStop/SSL_TCP
WARNING: Logging before InitGoogleLogging() is written to STDERR
I20260929 10:43:58.268481 20619 acceptor_pool.cc:254] collecting diagnostics on the listening RPC socket 0.0.0.0:45805 every 8 connection(s)
I20260929 10:43:58.269847 20620 acceptor_pool.cc:254] collecting diagnostics on the listening RPC socket 0.0.0.0:45805 every 8 connection(s)
W20260929 10:43:59.270407 20604 thread.cc:536] Waited for 1000ms trying to join with acceptor (tid 20620)
I20260929 10:43:59.323215 20631 acceptor_pool.cc:254] collecting diagnostics on the listening RPC socket 0.0.0.0:34411 every 8 connection(s)
I20260929 10:43:59.324611 20632 acceptor_pool.cc:254] collecting diagnostics on the listening RPC socket 0.0.0.0:34411 every 8 connection(s)
I20260929 10:43:59.350946 20642 acceptor_pool.cc:254] collecting diagnostics on the listening RPC socket 0.0.0.0:33163 every 8 connection(s)
I20260929 10:43:59.352243 20643 acceptor_pool.cc:254] collecting diagnostics on the listening RPC socket 0.0.0.0:33163 every 8 connection(s)
I20260929 10:43:59.378691 20653 acceptor_pool.cc:254] collecting diagnostics on the listening RPC socket 0.0.0.0:46541 every 8 connection(s)
I20260929 10:43:59.379376 20654 acceptor_pool.cc:254] collecting diagnostics on the listening RPC socket 0.0.0.0:46541 every 8 connection(s)
I20260929 10:43:59.399180 20664 acceptor_pool.cc:254] collecting diagnostics on the listening RPC socket 0.0.0.0:33071 every 8 connection(s)
I20260929 10:43:59.399881 20665 acceptor_pool.cc:254] collecting diagnostics on the listening RPC socket 0.0.0.0:33071 every 8 connection(s)
[ OK ] Parameters/TestRpc.TestAcceptorPoolStartStop/SSL_TCP (1191 ms)
[ RUN ] Parameters/TestRpc.TestCall/SSL_TCP
I20260929 10:43:59.429231 20677 acceptor_pool.cc:254] collecting diagnostics on the listening RPC socket 0.0.0.0:36405 every 8 connection(s)
I20260929 10:43:59.431133 20678 acceptor_pool.cc:254] collecting diagnostics on the listening RPC socket 0.0.0.0:36405 every 8 connection(s)
I20260929 10:43:59.435741 20604 rpc-test.cc:234] Connecting to 0.0.0.0:36405
[ OK ] Parameters/TestRpc.TestCall/SSL_TCP (151 ms)
[ RUN ] Parameters/TestRpc.TestCallWithChainCertAndRootCA/SSL_TCP
I20260929 10:43:59.583794 20702 acceptor_pool.cc:254] collecting diagnostics on the listening RPC socket 0.0.0.0:40303 every 8 connection(s)
I20260929 10:43:59.584476 20703 acceptor_pool.cc:254] collecting diagnostics on the listening RPC socket 0.0.0.0:40303 every 8 connection(s)
/data0/somelongdirectorytoavoidrpathissues/src/kudu/src/kudu/rpc/rpc-test.cc:303: Failure
Failed
Bad status: Runtime error: could not verify certificate chain (error with cert: subject=CN = localhost, ST = sadfjas, C = AS, emailAddress = sdflkdsajf, O = lskdfjlsad, OU = sldfkja, issuer=C = AS, ST = ASDfkjdhf, L = lskdjf, O = saldfja, OU = skdjf, CN = localhost, emailAddress = sadjflkadsj): : certificate has expired
Google Test trace:
/data0/somelongdirectorytoavoidrpathissues/src/kudu/src/kudu/rpc/rpc-test.cc:300: Connecting to 0.0.0.0:40303
I20260929 10:43:59.602916 20604 test_util.cc:175] -----------------------------------------------
I20260929 10:43:59.603096 20604 test_util.cc:176] Had fatal failures, leaving test files at /tmp/dist-test-taskSO4BBm/test-tmp/rpc-test.1.Parameters_TestRpc.TestCallWithChainCertAndRootCA_SSL_TCP.1790678638155505-20604-0
[ FAILED ] Parameters/TestRpc.TestCallWithChainCertAndRootCA/SSL_TCP, where GetParam() = (true, false) (47 ms)
[ RUN ] Parameters/TestRpc.TestCallWithBadPasswordProtectedKey/SSL_TCP
[ OK ] Parameters/TestRpc.TestCallWithBadPasswordProtectedKey/SSL_TCP (29 ms)
[ RUN ] Parameters/TestRpc.TestInvalidMethodCall/SSL_TCP
I20260929 10:43:59.675194 20739 acceptor_pool.cc:254] collecting diagnostics on the listening RPC socket 0.0.0.0:37995 every 8 connection(s)
I20260929 10:43:59.675938 20740 acceptor_pool.cc:254] collecting diagnostics on the listening RPC socket 0.0.0.0:37995 every 8 connection(s)
I20260929 10:43:59.679152 20604 rpc-test.cc:406] Connecting to 0.0.0.0:37995
[ OK ] Parameters/TestRpc.TestInvalidMethodCall/SSL_TCP (89 ms)
[ RUN ] Parameters/TestRpc.TestHighFDs/SSL_TCP
I20260929 10:43:59.941756 20764 acceptor_pool.cc:254] collecting diagnostics on the listening RPC socket 0.0.0.0:38115 every 8 connection(s)
I20260929 10:43:59.942413 20765 acceptor_pool.cc:254] collecting diagnostics on the listening RPC socket 0.0.0.0:38115 every 8 connection(s)
[ OK ] Parameters/TestRpc.TestHighFDs/SSL_TCP (259 ms)
[ RUN ] Parameters/TestRpc.TestConnectionAlwaysKeepalive/SSL_TCP
I20260929 10:44:00.019547 20787 acceptor_pool.cc:254] collecting diagnostics on the listening RPC socket 0.0.0.0:45487 every 8 connection(s)
I20260929 10:44:00.020201 20788 acceptor_pool.cc:254] collecting diagnostics on the listening RPC socket 0.0.0.0:45487 every 8 connection(s)
I20260929 10:44:00.023051 20604 rpc-test.cc:532] Connecting to 0.0.0.0:45487
[ OK ] Parameters/TestRpc.TestConnectionAlwaysKeepalive/SSL_TCP (3070 ms)
[ RUN ] Parameters/TestRpc.TestReopenOutboundConnections/SSL_TCP
I20260929 10:44:03.069519 20810 acceptor_pool.cc:254] collecting diagnostics on the listening RPC socket 0.0.0.0:45833 every 8 connection(s)
I20260929 10:44:03.070196 20811 acceptor_pool.cc:254] collecting diagnostics on the listening RPC socket 0.0.0.0:45833 every 8 connection(s)
I20260929 10:44:03.073102 20604 rpc-test.cc:658] Connecting to 0.0.0.0:45833
[ OK ] Parameters/TestRpc.TestReopenOutboundConnections/SSL_TCP (348 ms)
[ RUN ] Parameters/TestRpc.TestConnectionNetworkPlane/SSL_TCP
I20260929 10:44:03.420359 20833 acceptor_pool.cc:254] collecting diagnostics on the listening RPC socket 0.0.0.0:45813 every 8 connection(s)
I20260929 10:44:03.421039 20834 acceptor_pool.cc:254] collecting diagnostics on the listening RPC socket 0.0.0.0:45813 every 8 connection(s)
I20260929 10:44:03.424142 20604 rpc-test.cc:772] Connecting to 0.0.0.0:45813
[ OK ] Parameters/TestRpc.TestConnectionNetworkPlane/SSL_TCP (65 ms)
[ RUN ] Parameters/TestRpc.TestTCPKeepalive/SSL_TCP
I20260929 10:44:03.487462 20858 acceptor_pool.cc:254] collecting diagnostics on the listening RPC socket 0.0.0.0:43017 every 8 connection(s)
I20260929 10:44:03.488103 20859 acceptor_pool.cc:254] collecting diagnostics on the listening RPC socket 0.0.0.0:43017 every 8 connection(s)
I20260929 10:44:03.528811 20862 rpc-test-base.h:222] got call: sleep_micros: 8000000 deferred: true
I20260929 10:44:11.532708 20862 rpcz_store.cc:275] Call kudu.rpc.GenericCalculatorService.Sleep from 127.0.0.1:35922 (request call id 0) took 8004 ms. Trace:
I20260929 10:44:11.533136 20862 rpcz_store.cc:276] 0929 10:44:03.528567 (+ 0us) service_pool.cc:170] Inserting onto call queue
0929 10:44:03.528669 (+ 102us) service_pool.cc:227] Handling call
0929 10:44:11.532547 (+8003878us) inbound_call.cc:173] Queueing success response
Metrics: {}
[ OK ] Parameters/TestRpc.TestTCPKeepalive/SSL_TCP (8078 ms)
[ RUN ] Parameters/TestRpc.TestMaxSmallSidecars/SSL_TCP
I20260929 10:44:11.565274 20884 acceptor_pool.cc:254] collecting diagnostics on the listening RPC socket 0.0.0.0:41631 every 8 connection(s)
I20260929 10:44:11.566023 20885 acceptor_pool.cc:254] collecting diagnostics on the listening RPC socket 0.0.0.0:41631 every 8 connection(s)
[ OK ] Parameters/TestRpc.TestMaxSmallSidecars/SSL_TCP (190 ms)
[ RUN ] Parameters/TestRpc.TestCallTimeout/SSL_TCP
I20260929 10:44:11.762775 20909 acceptor_pool.cc:254] collecting diagnostics on the listening RPC socket 0.0.0.0:36219 every 8 connection(s)
I20260929 10:44:11.763464 20910 acceptor_pool.cc:254] collecting diagnostics on the listening RPC socket 0.0.0.0:36219 every 8 connection(s)
I20260929 10:44:11.796452 20604 rpc-test-base.h:595] status: Timed out: connection negotiation to 0.0.0.0:36219 for RPC Sleep timed out after 0.000s (ON_OUTBOUND_QUEUE), seconds elapsed: 0.00230458
I20260929 10:44:11.803858 20913 rpc-test-base.h:222] got call: sleep_micros: 700000
I20260929 10:44:11.997605 20604 rpc-test-base.h:595] status: Timed out: Sleep RPC to 0.0.0.0:36219 timed out after 0.200s (SENT), seconds elapsed: 0.20082
I20260929 10:44:11.999027 20912 rpc-test-base.h:222] got call: sleep_micros: 2000000
W20260929 10:44:12.504427 20913 rpcz_store.cc:267] Call kudu.rpc.GenericCalculatorService.Sleep from 127.0.0.1:55620 (request call id 1) took 700 ms (client timeout 200 ms). Trace:
W20260929 10:44:12.504769 20913 rpcz_store.cc:269] 0929 10:44:11.803706 (+ 0us) service_pool.cc:170] Inserting onto call queue
0929 10:44:11.803802 (+ 96us) service_pool.cc:227] Handling call
0929 10:44:12.504365 (+700563us) inbound_call.cc:173] Queueing success response
Metrics: {}
I20260929 10:44:13.499418 20604 rpc-test-base.h:595] status: Timed out: Sleep RPC to 0.0.0.0:36219 timed out after 1.500s (SENT), seconds elapsed: 1.50151
W20260929 10:44:13.999497 20912 rpcz_store.cc:267] Call kudu.rpc.GenericCalculatorService.Sleep from 127.0.0.1:55620 (request call id 2) took 2000 ms (client timeout 1500 ms). Trace:
W20260929 10:44:13.999787 20912 rpcz_store.cc:269] 0929 10:44:11.998750 (+ 0us) service_pool.cc:170] Inserting onto call queue
0929 10:44:11.998856 (+ 106us) service_pool.cc:227] Handling call
0929 10:44:13.999440 (+2000584us) inbound_call.cc:173] Queueing success response
Metrics: {}
W20260929 10:44:14.000277 20906 connection.cc:441] server connection from 127.0.0.1:55620 torn down before Call kudu.rpc.GenericCalculatorService.Sleep from 127.0.0.1:55620 (request call id 2) could send its response
[ OK ] Parameters/TestRpc.TestCallTimeout/SSL_TCP (2267 ms)
[ RUN ] Parameters/TestRpc.TestServerShutsDown/SSL_TCP
I20260929 10:44:14.006731 20604 rpc-test.cc:1125] Connecting to 0.0.0.0:38145
W20260929 10:44:14.015487 20926 negotiation.cc:337] Failed RPC negotiation. Trace:
0929 10:44:14.013971 (+ 0us) reactor.cc:625] Submitting negotiation task for client connection to 0.0.0.0:38145 (local address 127.0.0.1:38220)
0929 10:44:14.014410 (+ 439us) negotiation.cc:107] Waiting for socket to connect
0929 10:44:14.014439 (+ 29us) client_negotiation.cc:174] Beginning negotiation
0929 10:44:14.014647 (+ 208us) client_negotiation.cc:252] Sending NEGOTIATE NegotiatePB request
0929 10:44:14.014910 (+ 263us) negotiation.cc:327] Negotiation complete: Network error: Client connection negotiation failed: client connection to 0.0.0.0:38145: BlockingWrite error: write error: Broken pipe (error 32)
Metrics: {"client-negotiator.queue_time_us":110}
[ OK ] Parameters/TestRpc.TestServerShutsDown/SSL_TCP (12 ms)
[ RUN ] Parameters/TestRpc.TimedOutOnResponseMetric/SSL_TCP
I20260929 10:44:14.042316 20943 acceptor_pool.cc:254] collecting diagnostics on the listening RPC socket 0.0.0.0:36975 every 8 connection(s)
I20260929 10:44:14.043012 20944 acceptor_pool.cc:254] collecting diagnostics on the listening RPC socket 0.0.0.0:36975 every 8 connection(s)
W20260929 10:44:14.281078 20947 rpcz_store.cc:267] Call kudu.rpc_test.CalculatorService.Sleep from 127.0.0.1:51354 (request call id 3) took 50 ms (client timeout 25 ms). Trace:
W20260929 10:44:14.281348 20947 rpcz_store.cc:269] 0929 10:44:14.230537 (+ 0us) service_pool.cc:170] Inserting onto call queue
0929 10:44:14.230627 (+ 90us) service_pool.cc:227] Handling call
0929 10:44:14.281007 (+ 50380us) inbound_call.cc:173] Queueing success response
Related trace 'test_child':
Metrics: {"test_sleep_us":50000,"child_traces":[["test_child",{"related_trace_metric":1}]]}
W20260929 10:44:14.339893 20947 rpcz_store.cc:267] Call kudu.rpc_test.CalculatorService.Sleep from 127.0.0.1:51354 (request call id 4) took 50 ms (client timeout 50 ms). Trace:
W20260929 10:44:14.340160 20947 rpcz_store.cc:269] 0929 10:44:14.289386 (+ 0us) service_pool.cc:170] Inserting onto call queue
0929 10:44:14.289487 (+ 101us) service_pool.cc:227] Handling call
0929 10:44:14.339829 (+ 50342us) inbound_call.cc:173] Queueing success response
Related trace 'test_child':
Metrics: {"test_sleep_us":50000,"child_traces":[["test_child",{"related_trace_metric":1}]]}
[ OK ] Parameters/TestRpc.TimedOutOnResponseMetric/SSL_TCP (330 ms)
[ RUN ] Parameters/TestRpc.AcceptorDispatchingTimesMetric/SSL_TCP
I20260929 10:44:14.359046 20968 acceptor_pool.cc:254] collecting diagnostics on the listening RPC socket 0.0.0.0:34469 every 8 connection(s)
I20260929 10:44:14.359643 20969 acceptor_pool.cc:254] collecting diagnostics on the listening RPC socket 0.0.0.0:34469 every 8 connection(s)
W20260929 10:44:14.364045 20964 negotiation.cc:337] Failed RPC negotiation. Trace:
0929 10:44:14.362975 (+ 0us) reactor.cc:625] Submitting negotiation task for server connection from 127.0.0.1:41200 (local address 127.0.0.1:34469)
0929 10:44:14.363402 (+ 427us) server_negotiation.cc:206] Beginning negotiation
0929 10:44:14.363419 (+ 17us) server_negotiation.cc:399] Waiting for connection header
0929 10:44:14.363624 (+ 205us) negotiation.cc:327] Negotiation complete: Network error: Server connection negotiation failed: server connection from 127.0.0.1:41200: BlockingRecv error: recv got EOF from 127.0.0.1:41200 (error 108)
Metrics: {"server-negotiator.queue_time_us":111}
[ OK ] Parameters/TestRpc.AcceptorDispatchingTimesMetric/SSL_TCP (20 ms)
[ RUN ] Parameters/TestRpc.TestRpcCallbackDestroysMessenger/SSL_TCP
[ OK ] Parameters/TestRpc.TestRpcCallbackDestroysMessenger/SSL_TCP (24 ms)
[ RUN ] Parameters/TestRpc.TestApplicationFeatureFlag/SSL_TCP
I20260929 10:44:14.410324 20993 acceptor_pool.cc:254] collecting diagnostics on the listening RPC socket 0.0.0.0:44397 every 8 connection(s)
I20260929 10:44:14.411023 20994 acceptor_pool.cc:254] collecting diagnostics on the listening RPC socket 0.0.0.0:44397 every 8 connection(s)
W20260929 10:44:14.437176 20991 messenger.cc:357] Unable to handle RPC call: Not implemented: call requires unsupported application feature flags: 99
[ OK ] Parameters/TestRpc.TestApplicationFeatureFlag/SSL_TCP (51 ms)
[ RUN ] Parameters/TestRpc.TestCancellation/SSL_TCP
I20260929 10:44:14.478410 21018 acceptor_pool.cc:254] collecting diagnostics on the listening RPC socket 0.0.0.0:38439 every 8 connection(s)
I20260929 10:44:14.479137 21019 acceptor_pool.cc:254] collecting diagnostics on the listening RPC socket 0.0.0.0:38439 every 8 connection(s)
I20260929 10:44:14.482064 20604 rpc-test.cc:1648] Connecting to 0.0.0.0:38439
I20260929 10:44:14.582491 20604 rpc-test-base.h:595] status: Aborted: Sleep RPC to 0.0.0.0:38439 is cancelled in state READY, seconds elapsed: 0.000300997
I20260929 10:44:14.710306 20604 rpc-test-base.h:595] status: Aborted: Sleep RPC to 0.0.0.0:38439 is cancelled in state SENT, seconds elapsed: 0.000801634
I20260929 10:44:14.748428 21021 rpc-test-base.h:222] got call: sleep_micros: 510000
I20260929 10:44:14.869168 20604 rpc-test-base.h:595] status: Aborted: Sleep RPC to 0.0.0.0:38439 is cancelled in state SENT, seconds elapsed: 0.000839447
I20260929 10:44:14.908252 21020 rpc-test-base.h:222] got call: sleep_micros: 510000
I20260929 10:44:15.020582 20604 rpc-test-base.h:595] status: Aborted: Sleep RPC to 0.0.0.0:38439 is cancelled in state SENT, seconds elapsed: 0.000783391
W20260929 10:44:15.056672 21022 rpcz_store.cc:267] Call kudu.rpc.GenericCalculatorService.Sleep from 127.0.0.1:54908 (request call id 11) took 14 ms (client timeout 10 ms). Trace:
W20260929 10:44:15.056968 21022 rpcz_store.cc:269] 0929 10:44:15.042031 (+ 0us) service_pool.cc:170] Inserting onto call queue
0929 10:44:15.056401 (+ 14370us) service_pool.cc:214] Skipping call since client already timed out
0929 10:44:15.056507 (+ 106us) inbound_call.cc:173] Queueing failure response
Metrics: {}
I20260929 10:44:15.057446 21022 rpc-test-base.h:222] got call: sleep_micros: 1500000
W20260929 10:44:15.258967 21021 rpcz_store.cc:267] Call kudu.rpc.GenericCalculatorService.Sleep from 127.0.0.1:54908 (request call id 3) took 510 ms (client timeout 10 ms). Trace:
W20260929 10:44:15.259271 21021 rpcz_store.cc:269] 0929 10:44:14.748239 (+ 0us) service_pool.cc:170] Inserting onto call queue
0929 10:44:14.748360 (+ 121us) service_pool.cc:227] Handling call
0929 10:44:15.258916 (+510556us) inbound_call.cc:173] Queueing success response
Metrics: {}
W20260929 10:44:15.418870 21020 rpcz_store.cc:267] Call kudu.rpc.GenericCalculatorService.Sleep from 127.0.0.1:54908 (request call id 7) took 510 ms (client timeout 10 ms). Trace:
W20260929 10:44:15.419184 21020 rpcz_store.cc:269] 0929 10:44:14.908007 (+ 0us) service_pool.cc:170] Inserting onto call queue
0929 10:44:14.908183 (+ 176us) service_pool.cc:227] Handling call
0929 10:44:15.418815 (+510632us) inbound_call.cc:173] Queueing success response
Metrics: {}
I20260929 10:44:16.022542 20604 rpc-test-base.h:595] status: Timed out: Sleep RPC to 0.0.0.0:38439 timed out after 1.000s (SENT), seconds elapsed: 1.00162
I20260929 10:44:16.023845 21020 rpc-test-base.h:222] got call: sleep_micros: 1500000
W20260929 10:44:16.557942 21022 rpcz_store.cc:267] Call kudu.rpc.GenericCalculatorService.Sleep from 127.0.0.1:54908 (request call id 12) took 1515 ms (client timeout 1000 ms). Trace:
W20260929 10:44:16.558238 21022 rpcz_store.cc:269] 0929 10:44:15.042349 (+ 0us) service_pool.cc:170] Inserting onto call queue
0929 10:44:15.057415 (+ 15066us) service_pool.cc:227] Handling call
0929 10:44:16.557885 (+1500470us) inbound_call.cc:173] Queueing success response
Metrics: {}
I20260929 10:44:17.024384 20604 rpc-test-base.h:595] status: Timed out: Sleep RPC to 0.0.0.0:38439 timed out after 1.000s (SENT), seconds elapsed: 1.00152
W20260929 10:44:17.025753 21015 messenger.cc:357] Unable to handle RPC call: Not implemented: call requires unsupported application feature flags: 99, 1
W20260929 10:44:17.027171 21015 messenger.cc:357] Unable to handle RPC call: Not implemented: call requires unsupported application feature flags: 99, 1
W20260929 10:44:17.524307 21020 rpcz_store.cc:267] Call kudu.rpc.GenericCalculatorService.Sleep from 127.0.0.1:54908 (request call id 13) took 1500 ms (client timeout 1000 ms). Trace:
W20260929 10:44:17.524617 21020 rpcz_store.cc:269] 0929 10:44:16.023686 (+ 0us) service_pool.cc:170] Inserting onto call queue
0929 10:44:16.023783 (+ 97us) service_pool.cc:227] Handling call
0929 10:44:17.524252 (+1500469us) inbound_call.cc:173] Queueing success response
Metrics: {}
W20260929 10:44:17.525127 21015 connection.cc:441] server connection from 127.0.0.1:54908 torn down before Call kudu.rpc.GenericCalculatorService.Sleep from 127.0.0.1:54908 (request call id 13) could send its response
[ OK ] Parameters/TestRpc.TestCancellation/SSL_TCP (3086 ms)
[ RUN ] Parameters/TestRpc.TestCancellationMultiThreads/SSL_TCP
I20260929 10:44:17.557667 21043 acceptor_pool.cc:254] collecting diagnostics on the listening RPC socket 0.0.0.0:43453 every 8 connection(s)
I20260929 10:44:17.558315 21044 acceptor_pool.cc:254] collecting diagnostics on the listening RPC socket 0.0.0.0:43453 every 8 connection(s)
I20260929 10:44:17.561198 20604 rpc-test.cc:1808] Connecting to 0.0.0.0:43453
I20260929 10:44:17.697520 21057 test_util.cc:268] Using random seed: -582187311
I20260929 10:44:17.698535 21058 test_util.cc:268] Using random seed: -582186291
I20260929 10:44:17.700629 21059 test_util.cc:268] Using random seed: -582184199
I20260929 10:44:17.701988 21060 test_util.cc:268] Using random seed: -582182858
I20260929 10:44:17.703483 21061 test_util.cc:268] Using random seed: -582181474
I20260929 10:44:17.704787 21062 test_util.cc:268] Using random seed: -582180161
I20260929 10:44:17.706248 21063 test_util.cc:268] Using random seed: -582178720
I20260929 10:44:17.707508 21064 test_util.cc:268] Using random seed: -582177419
I20260929 10:44:17.708853 21065 test_util.cc:268] Using random seed: -582176099
I20260929 10:44:17.710457 21066 test_util.cc:268] Using random seed: -582174487
I20260929 10:44:17.711665 21067 test_util.cc:268] Using random seed: -582173255
I20260929 10:44:17.712854 21068 test_util.cc:268] Using random seed: -582172067
I20260929 10:44:17.714082 21069 test_util.cc:268] Using random seed: -582170839
I20260929 10:44:17.715296 21070 test_util.cc:268] Using random seed: -582169625
I20260929 10:44:17.717047 21071 test_util.cc:268] Using random seed: -582167917
I20260929 10:44:17.718612 21072 test_util.cc:268] Using random seed: -582166347
I20260929 10:44:17.720363 21073 test_util.cc:268] Using random seed: -582164702
I20260929 10:44:17.721933 21074 test_util.cc:268] Using random seed: -582163033
I20260929 10:44:17.723156 21075 test_util.cc:268] Using random seed: -582161764
I20260929 10:44:17.724493 21076 test_util.cc:268] Using random seed: -582160434
I20260929 10:44:17.726043 21077 test_util.cc:268] Using random seed: -582158947
I20260929 10:44:17.727625 21078 test_util.cc:268] Using random seed: -582157365
I20260929 10:44:17.729516 21079 test_util.cc:268] Using random seed: -582155434
I20260929 10:44:17.731096 21080 test_util.cc:268] Using random seed: -582153877
I20260929 10:44:17.732596 21081 test_util.cc:268] Using random seed: -582152380
I20260929 10:44:17.734229 21082 test_util.cc:268] Using random seed: -582150735
I20260929 10:44:17.735839 21083 test_util.cc:268] Using random seed: -582149134
I20260929 10:44:17.737434 21084 test_util.cc:268] Using random seed: -582147523
I20260929 10:44:17.739404 21085 test_util.cc:268] Using random seed: -582145539
I20260929 10:44:17.740952 21086 test_util.cc:268] Using random seed: -582144047
[ OK ] Parameters/TestRpc.TestCancellationMultiThreads/SSL_TCP (16578 ms)
[ RUN ] Parameters/TestRpc.TestCallId/SSL_TCP
I20260929 10:44:34.127912 21100 acceptor_pool.cc:254] collecting diagnostics on the listening RPC socket 0.0.0.0:35781 every 8 connection(s)
I20260929 10:44:34.128654 21101 acceptor_pool.cc:254] collecting diagnostics on the listening RPC socket 0.0.0.0:35781 every 8 connection(s)
[ OK ] Parameters/TestRpc.TestCallId/SSL_TCP (77 ms)
[----------] 20 tests from Parameters/TestRpc (35974 ms total)
[----------] Global test environment tear-down
[==========] 21 tests from 2 test suites ran. (35981 ms total)
[ PASSED ] 20 tests.
[ FAILED ] 1 test, listed below:
[ FAILED ] Parameters/TestRpc.TestCallWithChainCertAndRootCA/SSL_TCP, where GetParam() = (true, false)
1 FAILED TEST