Diagnosed failure

Parameters/TestRpc.TestCallWithChainCertAndRootCA/SSL_TCP: /data0/somelongdirectorytoavoidrpathissues/src/kudu/src/kudu/rpc/rpc-test.cc:303: Failure
Failed
Bad status: Runtime error: could not verify certificate chain (error with cert: subject=CN = localhost, ST = sadfjas, C = AS, emailAddress = sdflkdsajf, O = lskdfjlsad, OU = sldfkja, issuer=C = AS, ST = ASDfkjdhf, L = lskdjf, O = saldfja, OU = skdjf, CN = localhost, emailAddress = sadjflkadsj): : certificate has expired
Google Test trace:
/data0/somelongdirectorytoavoidrpathissues/src/kudu/src/kudu/rpc/rpc-test.cc:300: Connecting to 0.0.0.0:46789
I20260928 19:27:40.230487   390 test_util.cc:175] -----------------------------------------------
I20260928 19:27:40.230705   390 test_util.cc:176] Had fatal failures, leaving test files at /tmp/dist-test-taskCUEKZe/test-tmp/rpc-test.1.Parameters_TestRpc.TestCallWithChainCertAndRootCA_SSL_TCP.1790623658569592-390-0

Full log

Note: This is test shard 2 of 8.
[==========] Running 21 tests from 2 test suites.
[----------] Global test environment set-up.
[----------] 1 test from TestRpc
[ RUN      ] TestRpc.TestMethodsByName
[       OK ] TestRpc.TestMethodsByName (6 ms)
[----------] 1 test from TestRpc (7 ms total)

[----------] 20 tests from Parameters/TestRpc
[ RUN      ] Parameters/TestRpc.TestAcceptorPoolStartStop/SSL_TCP
WARNING: Logging before InitGoogleLogging() is written to STDERR
I20260928 19:27:38.694702   405 acceptor_pool.cc:254] collecting diagnostics on the listening RPC socket 0.0.0.0:35379 every 8 connection(s)
I20260928 19:27:38.696354   406 acceptor_pool.cc:254] collecting diagnostics on the listening RPC socket 0.0.0.0:35379 every 8 connection(s)
W20260928 19:27:39.697146   390 thread.cc:536] Waited for 1000ms trying to join with acceptor (tid 406)
I20260928 19:27:39.918465   417 acceptor_pool.cc:254] collecting diagnostics on the listening RPC socket 0.0.0.0:46695 every 8 connection(s)
I20260928 19:27:39.919940   418 acceptor_pool.cc:254] collecting diagnostics on the listening RPC socket 0.0.0.0:46695 every 8 connection(s)
I20260928 19:27:39.945081   428 acceptor_pool.cc:254] collecting diagnostics on the listening RPC socket 0.0.0.0:36831 every 8 connection(s)
I20260928 19:27:39.946508   429 acceptor_pool.cc:254] collecting diagnostics on the listening RPC socket 0.0.0.0:36831 every 8 connection(s)
I20260928 19:27:39.977984   439 acceptor_pool.cc:254] collecting diagnostics on the listening RPC socket 0.0.0.0:36227 every 8 connection(s)
I20260928 19:27:39.978684   440 acceptor_pool.cc:254] collecting diagnostics on the listening RPC socket 0.0.0.0:36227 every 8 connection(s)
I20260928 19:27:40.015494   450 acceptor_pool.cc:254] collecting diagnostics on the listening RPC socket 0.0.0.0:35091 every 8 connection(s)
I20260928 19:27:40.016371   451 acceptor_pool.cc:254] collecting diagnostics on the listening RPC socket 0.0.0.0:35091 every 8 connection(s)
[       OK ] Parameters/TestRpc.TestAcceptorPoolStartStop/SSL_TCP (1388 ms)
[ RUN      ] Parameters/TestRpc.TestCall/SSL_TCP
I20260928 19:27:40.055945   463 acceptor_pool.cc:254] collecting diagnostics on the listening RPC socket 0.0.0.0:39817 every 8 connection(s)
I20260928 19:27:40.058015   464 acceptor_pool.cc:254] collecting diagnostics on the listening RPC socket 0.0.0.0:39817 every 8 connection(s)
I20260928 19:27:40.064429   390 rpc-test.cc:234] Connecting to 0.0.0.0:39817
[       OK ] Parameters/TestRpc.TestCall/SSL_TCP (162 ms)
[ RUN      ] Parameters/TestRpc.TestCallWithChainCertAndRootCA/SSL_TCP
I20260928 19:27:40.206985   488 acceptor_pool.cc:254] collecting diagnostics on the listening RPC socket 0.0.0.0:46789 every 8 connection(s)
I20260928 19:27:40.207731   489 acceptor_pool.cc:254] collecting diagnostics on the listening RPC socket 0.0.0.0:46789 every 8 connection(s)
/data0/somelongdirectorytoavoidrpathissues/src/kudu/src/kudu/rpc/rpc-test.cc:303: Failure
Failed
Bad status: Runtime error: could not verify certificate chain (error with cert: subject=CN = localhost, ST = sadfjas, C = AS, emailAddress = sdflkdsajf, O = lskdfjlsad, OU = sldfkja, issuer=C = AS, ST = ASDfkjdhf, L = lskdjf, O = saldfja, OU = skdjf, CN = localhost, emailAddress = sadjflkadsj): : certificate has expired
Google Test trace:
/data0/somelongdirectorytoavoidrpathissues/src/kudu/src/kudu/rpc/rpc-test.cc:300: Connecting to 0.0.0.0:46789
I20260928 19:27:40.230487   390 test_util.cc:175] -----------------------------------------------
I20260928 19:27:40.230705   390 test_util.cc:176] Had fatal failures, leaving test files at /tmp/dist-test-taskCUEKZe/test-tmp/rpc-test.1.Parameters_TestRpc.TestCallWithChainCertAndRootCA_SSL_TCP.1790623658569592-390-0
[  FAILED  ] Parameters/TestRpc.TestCallWithChainCertAndRootCA/SSL_TCP, where GetParam() = (true, false) (47 ms)
[ RUN      ] Parameters/TestRpc.TestCallWithBadPasswordProtectedKey/SSL_TCP
[       OK ] Parameters/TestRpc.TestCallWithBadPasswordProtectedKey/SSL_TCP (33 ms)
[ RUN      ] Parameters/TestRpc.TestInvalidMethodCall/SSL_TCP
I20260928 19:27:40.289678   525 acceptor_pool.cc:254] collecting diagnostics on the listening RPC socket 0.0.0.0:33003 every 8 connection(s)
I20260928 19:27:40.290587   526 acceptor_pool.cc:254] collecting diagnostics on the listening RPC socket 0.0.0.0:33003 every 8 connection(s)
I20260928 19:27:40.294620   390 rpc-test.cc:406] Connecting to 0.0.0.0:33003
[       OK ] Parameters/TestRpc.TestInvalidMethodCall/SSL_TCP (87 ms)
[ RUN      ] Parameters/TestRpc.TestHighFDs/SSL_TCP
I20260928 19:27:40.579860   550 acceptor_pool.cc:254] collecting diagnostics on the listening RPC socket 0.0.0.0:45999 every 8 connection(s)
I20260928 19:27:40.580456   551 acceptor_pool.cc:254] collecting diagnostics on the listening RPC socket 0.0.0.0:45999 every 8 connection(s)
[       OK ] Parameters/TestRpc.TestHighFDs/SSL_TCP (284 ms)
[ RUN      ] Parameters/TestRpc.TestConnectionAlwaysKeepalive/SSL_TCP
I20260928 19:27:40.684027   573 acceptor_pool.cc:254] collecting diagnostics on the listening RPC socket 0.0.0.0:34651 every 8 connection(s)
I20260928 19:27:40.685483   574 acceptor_pool.cc:254] collecting diagnostics on the listening RPC socket 0.0.0.0:34651 every 8 connection(s)
I20260928 19:27:40.689805   390 rpc-test.cc:532] Connecting to 0.0.0.0:34651
[       OK ] Parameters/TestRpc.TestConnectionAlwaysKeepalive/SSL_TCP (3096 ms)
[ RUN      ] Parameters/TestRpc.TestReopenOutboundConnections/SSL_TCP
I20260928 19:27:43.768793   596 acceptor_pool.cc:254] collecting diagnostics on the listening RPC socket 0.0.0.0:40059 every 8 connection(s)
I20260928 19:27:43.769558   597 acceptor_pool.cc:254] collecting diagnostics on the listening RPC socket 0.0.0.0:40059 every 8 connection(s)
I20260928 19:27:43.773070   390 rpc-test.cc:658] Connecting to 0.0.0.0:40059
[       OK ] Parameters/TestRpc.TestReopenOutboundConnections/SSL_TCP (450 ms)
[ RUN      ] Parameters/TestRpc.TestConnectionNetworkPlane/SSL_TCP
I20260928 19:27:44.213667   619 acceptor_pool.cc:254] collecting diagnostics on the listening RPC socket 0.0.0.0:40809 every 8 connection(s)
I20260928 19:27:44.214393   620 acceptor_pool.cc:254] collecting diagnostics on the listening RPC socket 0.0.0.0:40809 every 8 connection(s)
I20260928 19:27:44.217694   390 rpc-test.cc:772] Connecting to 0.0.0.0:40809
[       OK ] Parameters/TestRpc.TestConnectionNetworkPlane/SSL_TCP (96 ms)
[ RUN      ] Parameters/TestRpc.TestTCPKeepalive/SSL_TCP
I20260928 19:27:44.297046   644 acceptor_pool.cc:254] collecting diagnostics on the listening RPC socket 0.0.0.0:41479 every 8 connection(s)
I20260928 19:27:44.297833   645 acceptor_pool.cc:254] collecting diagnostics on the listening RPC socket 0.0.0.0:41479 every 8 connection(s)
I20260928 19:27:44.341148   648 rpc-test-base.h:222] got call: sleep_micros: 8000000 deferred: true
I20260928 19:27:52.345422   648 rpcz_store.cc:275] Call kudu.rpc.GenericCalculatorService.Sleep from 127.0.0.1:50734 (request call id 0) took 8004 ms. Trace:
I20260928 19:27:52.345934   648 rpcz_store.cc:276] 0928 19:27:44.340859 (+     0us) service_pool.cc:170] Inserting onto call queue
0928 19:27:44.340994 (+   135us) service_pool.cc:227] Handling call
0928 19:27:52.345262 (+8004268us) inbound_call.cc:173] Queueing success response
Metrics: {}
[       OK ] Parameters/TestRpc.TestTCPKeepalive/SSL_TCP (8081 ms)
[ RUN      ] Parameters/TestRpc.TestMaxSmallSidecars/SSL_TCP
I20260928 19:27:52.393581   670 acceptor_pool.cc:254] collecting diagnostics on the listening RPC socket 0.0.0.0:39927 every 8 connection(s)
I20260928 19:27:52.394506   671 acceptor_pool.cc:254] collecting diagnostics on the listening RPC socket 0.0.0.0:39927 every 8 connection(s)
[       OK ] Parameters/TestRpc.TestMaxSmallSidecars/SSL_TCP (222 ms)
[ RUN      ] Parameters/TestRpc.TestCallTimeout/SSL_TCP
I20260928 19:27:52.600543   695 acceptor_pool.cc:254] collecting diagnostics on the listening RPC socket 0.0.0.0:40671 every 8 connection(s)
I20260928 19:27:52.601323   696 acceptor_pool.cc:254] collecting diagnostics on the listening RPC socket 0.0.0.0:40671 every 8 connection(s)
I20260928 19:27:52.631063   390 rpc-test-base.h:595] status: Timed out: connection negotiation to 0.0.0.0:40671 for RPC Sleep timed out after 0.000s (ON_OUTBOUND_QUEUE), seconds elapsed: 0.00354159
I20260928 19:27:52.639240   699 rpc-test-base.h:222] got call: sleep_micros: 700000
I20260928 19:27:52.833086   390 rpc-test-base.h:595] status: Timed out: Sleep RPC to 0.0.0.0:40671 timed out after 0.200s (SENT), seconds elapsed: 0.201516
I20260928 19:27:52.834672   698 rpc-test-base.h:222] got call: sleep_micros: 2000000
W20260928 19:27:53.340015   699 rpcz_store.cc:267] Call kudu.rpc.GenericCalculatorService.Sleep from 127.0.0.1:57940 (request call id 1) took 701 ms (client timeout 200 ms). Trace:
W20260928 19:27:53.340426   699 rpcz_store.cc:269] 0928 19:27:52.639032 (+     0us) service_pool.cc:170] Inserting onto call queue
0928 19:27:52.639176 (+   144us) service_pool.cc:227] Handling call
0928 19:27:53.339954 (+700778us) inbound_call.cc:173] Queueing success response
Metrics: {}
I20260928 19:27:54.334705   390 rpc-test-base.h:595] status: Timed out: Sleep RPC to 0.0.0.0:40671 timed out after 1.500s (SENT), seconds elapsed: 1.50127
W20260928 19:27:54.835285   698 rpcz_store.cc:267] Call kudu.rpc.GenericCalculatorService.Sleep from 127.0.0.1:57940 (request call id 2) took 2001 ms (client timeout 1500 ms). Trace:
W20260928 19:27:54.835685   698 rpcz_store.cc:269] 0928 19:27:52.834284 (+     0us) service_pool.cc:170] Inserting onto call queue
0928 19:27:52.834515 (+   231us) service_pool.cc:227] Handling call
0928 19:27:54.835233 (+2000718us) inbound_call.cc:173] Queueing success response
Metrics: {}
W20260928 19:27:54.836256   694 connection.cc:441] server connection from 127.0.0.1:57940 torn down before Call kudu.rpc.GenericCalculatorService.Sleep from 127.0.0.1:57940 (request call id 2) could send its response
[       OK ] Parameters/TestRpc.TestCallTimeout/SSL_TCP (2260 ms)
[ RUN      ] Parameters/TestRpc.TestServerShutsDown/SSL_TCP
I20260928 19:27:54.845350   390 rpc-test.cc:1125] Connecting to 0.0.0.0:45601
W20260928 19:27:54.856238   712 negotiation.cc:337] Failed RPC negotiation. Trace:
0928 19:27:54.854451 (+     0us) reactor.cc:625] Submitting negotiation task for client connection to 0.0.0.0:45601 (local address 127.0.0.1:60696)
0928 19:27:54.855109 (+   658us) negotiation.cc:107] Waiting for socket to connect
0928 19:27:54.855149 (+    40us) client_negotiation.cc:174] Beginning negotiation
0928 19:27:54.855383 (+   234us) client_negotiation.cc:252] Sending NEGOTIATE NegotiatePB request
0928 19:27:54.855630 (+   247us) negotiation.cc:327] Negotiation complete: Network error: Client connection negotiation failed: client connection to 0.0.0.0:45601: BlockingWrite error: write error: Broken pipe (error 32)
Metrics: {"client-negotiator.queue_time_us":161}
[       OK ] Parameters/TestRpc.TestServerShutsDown/SSL_TCP (15 ms)
[ RUN      ] Parameters/TestRpc.TimedOutOnResponseMetric/SSL_TCP
I20260928 19:27:54.906440   729 acceptor_pool.cc:254] collecting diagnostics on the listening RPC socket 0.0.0.0:39583 every 8 connection(s)
I20260928 19:27:54.907346   730 acceptor_pool.cc:254] collecting diagnostics on the listening RPC socket 0.0.0.0:39583 every 8 connection(s)
W20260928 19:27:55.149953   733 rpcz_store.cc:267] Call kudu.rpc_test.CalculatorService.Sleep from 127.0.0.1:48734 (request call id 3) took 50 ms (client timeout 25 ms). Trace:
W20260928 19:27:55.150276   733 rpcz_store.cc:269] 0928 19:27:55.099163 (+     0us) service_pool.cc:170] Inserting onto call queue
0928 19:27:55.099304 (+   141us) service_pool.cc:227] Handling call
0928 19:27:55.149869 (+ 50565us) inbound_call.cc:173] Queueing success response
Related trace 'test_child':
Metrics: {"test_sleep_us":50000,"child_traces":[["test_child",{"related_trace_metric":1}]]}
W20260928 19:27:55.208902   733 rpcz_store.cc:267] Call kudu.rpc_test.CalculatorService.Sleep from 127.0.0.1:48734 (request call id 4) took 50 ms (client timeout 50 ms). Trace:
W20260928 19:27:55.209210   733 rpcz_store.cc:269] 0928 19:27:55.158297 (+     0us) service_pool.cc:170] Inserting onto call queue
0928 19:27:55.158436 (+   139us) service_pool.cc:227] Handling call
0928 19:27:55.208833 (+ 50397us) inbound_call.cc:173] Queueing success response
Related trace 'test_child':
Metrics: {"test_sleep_us":50000,"child_traces":[["test_child",{"related_trace_metric":1}]]}
[       OK ] Parameters/TestRpc.TimedOutOnResponseMetric/SSL_TCP (358 ms)
[ RUN      ] Parameters/TestRpc.AcceptorDispatchingTimesMetric/SSL_TCP
I20260928 19:27:55.231840   754 acceptor_pool.cc:254] collecting diagnostics on the listening RPC socket 0.0.0.0:36627 every 8 connection(s)
I20260928 19:27:55.232642   755 acceptor_pool.cc:254] collecting diagnostics on the listening RPC socket 0.0.0.0:36627 every 8 connection(s)
W20260928 19:27:55.238191   750 negotiation.cc:337] Failed RPC negotiation. Trace:
0928 19:27:55.236941 (+     0us) reactor.cc:625] Submitting negotiation task for server connection from 127.0.0.1:57984 (local address 127.0.0.1:36627)
0928 19:27:55.237411 (+   470us) server_negotiation.cc:206] Beginning negotiation
0928 19:27:55.237430 (+    19us) server_negotiation.cc:399] Waiting for connection header
0928 19:27:55.237675 (+   245us) negotiation.cc:327] Negotiation complete: Network error: Server connection negotiation failed: server connection from 127.0.0.1:57984: BlockingRecv error: recv got EOF from 127.0.0.1:57984 (error 108)
Metrics: {"server-negotiator.queue_time_us":117}
[       OK ] Parameters/TestRpc.AcceptorDispatchingTimesMetric/SSL_TCP (25 ms)
[ RUN      ] Parameters/TestRpc.TestRpcCallbackDestroysMessenger/SSL_TCP
[       OK ] Parameters/TestRpc.TestRpcCallbackDestroysMessenger/SSL_TCP (26 ms)
[ RUN      ] Parameters/TestRpc.TestApplicationFeatureFlag/SSL_TCP
I20260928 19:27:55.290618   779 acceptor_pool.cc:254] collecting diagnostics on the listening RPC socket 0.0.0.0:37363 every 8 connection(s)
I20260928 19:27:55.291525   780 acceptor_pool.cc:254] collecting diagnostics on the listening RPC socket 0.0.0.0:37363 every 8 connection(s)
W20260928 19:27:55.331231   777 messenger.cc:357] Unable to handle RPC call: Not implemented: call requires unsupported application feature flags: 99
[       OK ] Parameters/TestRpc.TestApplicationFeatureFlag/SSL_TCP (69 ms)
[ RUN      ] Parameters/TestRpc.TestCancellation/SSL_TCP
I20260928 19:27:55.373992   804 acceptor_pool.cc:254] collecting diagnostics on the listening RPC socket 0.0.0.0:40271 every 8 connection(s)
I20260928 19:27:55.374763   805 acceptor_pool.cc:254] collecting diagnostics on the listening RPC socket 0.0.0.0:40271 every 8 connection(s)
I20260928 19:27:55.377977   390 rpc-test.cc:1648] Connecting to 0.0.0.0:40271
I20260928 19:27:55.504765   390 rpc-test-base.h:595] status: Aborted: Sleep RPC to 0.0.0.0:40271 is cancelled in state READY, seconds elapsed: 0.00043641
I20260928 19:27:55.659960   390 rpc-test-base.h:595] status: Aborted: Sleep RPC to 0.0.0.0:40271 is cancelled in state SENT, seconds elapsed: 0.000835115
I20260928 19:27:55.702983   807 rpc-test-base.h:222] got call: sleep_micros: 510000
I20260928 19:27:55.825793   390 rpc-test-base.h:595] status: Aborted: Sleep RPC to 0.0.0.0:40271 is cancelled in state SENT, seconds elapsed: 0.000836954
I20260928 19:27:55.881286   806 rpc-test-base.h:222] got call: sleep_micros: 510000
I20260928 19:27:55.998338   390 rpc-test-base.h:595] status: Aborted: Sleep RPC to 0.0.0.0:40271 is cancelled in state SENT, seconds elapsed: 0.000857381
W20260928 19:27:56.044710   808 rpcz_store.cc:267] Call kudu.rpc.GenericCalculatorService.Sleep from 127.0.0.1:47234 (request call id 11) took 17 ms (client timeout 10 ms). Trace:
W20260928 19:27:56.045035   808 rpcz_store.cc:269] 0928 19:27:56.026821 (+     0us) service_pool.cc:170] Inserting onto call queue
0928 19:27:56.044411 (+ 17590us) service_pool.cc:214] Skipping call since client already timed out
0928 19:27:56.044528 (+   117us) inbound_call.cc:173] Queueing failure response
Metrics: {}
I20260928 19:27:56.045588   808 rpc-test-base.h:222] got call: sleep_micros: 1500000
W20260928 19:27:56.213707   807 rpcz_store.cc:267] Call kudu.rpc.GenericCalculatorService.Sleep from 127.0.0.1:47234 (request call id 3) took 511 ms (client timeout 10 ms). Trace:
W20260928 19:27:56.214087   807 rpcz_store.cc:269] 0928 19:27:55.702701 (+     0us) service_pool.cc:170] Inserting onto call queue
0928 19:27:55.702913 (+   212us) service_pool.cc:227] Handling call
0928 19:27:56.213651 (+510738us) inbound_call.cc:173] Queueing success response
Metrics: {}
W20260928 19:27:56.392119   806 rpcz_store.cc:267] Call kudu.rpc.GenericCalculatorService.Sleep from 127.0.0.1:47234 (request call id 7) took 511 ms (client timeout 10 ms). Trace:
W20260928 19:27:56.392493   806 rpcz_store.cc:269] 0928 19:27:55.880979 (+     0us) service_pool.cc:170] Inserting onto call queue
0928 19:27:55.881195 (+   216us) service_pool.cc:227] Handling call
0928 19:27:56.392060 (+510865us) inbound_call.cc:173] Queueing success response
Metrics: {}
I20260928 19:27:57.000054   390 rpc-test-base.h:595] status: Timed out: Sleep RPC to 0.0.0.0:40271 timed out after 1.000s (SENT), seconds elapsed: 1.00129
I20260928 19:27:57.001523   806 rpc-test-base.h:222] got call: sleep_micros: 1500000
W20260928 19:27:57.546118   808 rpcz_store.cc:267] Call kudu.rpc.GenericCalculatorService.Sleep from 127.0.0.1:47234 (request call id 12) took 1519 ms (client timeout 1000 ms). Trace:
W20260928 19:27:57.546489   808 rpcz_store.cc:269] 0928 19:27:56.027194 (+     0us) service_pool.cc:170] Inserting onto call queue
0928 19:27:56.045554 (+ 18360us) service_pool.cc:227] Handling call
0928 19:27:57.546067 (+1500513us) inbound_call.cc:173] Queueing success response
Metrics: {}
I20260928 19:27:58.002238   390 rpc-test-base.h:595] status: Timed out: Sleep RPC to 0.0.0.0:40271 timed out after 1.000s (SENT), seconds elapsed: 1.00182
W20260928 19:27:58.003708   801 messenger.cc:357] Unable to handle RPC call: Not implemented: call requires unsupported application feature flags: 99, 1
W20260928 19:27:58.005409   801 messenger.cc:357] Unable to handle RPC call: Not implemented: call requires unsupported application feature flags: 99, 1
W20260928 19:27:58.502149   806 rpcz_store.cc:267] Call kudu.rpc.GenericCalculatorService.Sleep from 127.0.0.1:47234 (request call id 13) took 1500 ms (client timeout 1000 ms). Trace:
W20260928 19:27:58.502525   806 rpcz_store.cc:269] 0928 19:27:57.001299 (+     0us) service_pool.cc:170] Inserting onto call queue
0928 19:27:57.001471 (+   172us) service_pool.cc:227] Handling call
0928 19:27:58.502093 (+1500622us) inbound_call.cc:173] Queueing success response
Metrics: {}
W20260928 19:27:58.503135   801 connection.cc:441] server connection from 127.0.0.1:47234 torn down before Call kudu.rpc.GenericCalculatorService.Sleep from 127.0.0.1:47234 (request call id 13) could send its response
[       OK ] Parameters/TestRpc.TestCancellation/SSL_TCP (3169 ms)
[ RUN      ] Parameters/TestRpc.TestCancellationMultiThreads/SSL_TCP
I20260928 19:27:58.538674   829 acceptor_pool.cc:254] collecting diagnostics on the listening RPC socket 0.0.0.0:44707 every 8 connection(s)
I20260928 19:27:58.539422   830 acceptor_pool.cc:254] collecting diagnostics on the listening RPC socket 0.0.0.0:44707 every 8 connection(s)
I20260928 19:27:58.542935   390 rpc-test.cc:1808] Connecting to 0.0.0.0:44707
I20260928 19:27:58.720574   844 test_util.cc:268] Using random seed: 273410413
I20260928 19:27:58.721829   845 test_util.cc:268] Using random seed: 273411720
I20260928 19:27:58.725564   847 test_util.cc:268] Using random seed: 273415258
I20260928 19:27:58.723699   846 test_util.cc:268] Using random seed: 273413581
I20260928 19:27:58.727829   848 test_util.cc:268] Using random seed: 273417626
I20260928 19:27:58.729938   849 test_util.cc:268] Using random seed: 273419548
I20260928 19:27:58.732445   850 test_util.cc:268] Using random seed: 273422120
I20260928 19:27:58.734586   851 test_util.cc:268] Using random seed: 273424477
I20260928 19:27:58.736515   852 test_util.cc:268] Using random seed: 273426370
I20260928 19:27:58.738016   853 test_util.cc:268] Using random seed: 273427890
I20260928 19:27:58.739976   854 test_util.cc:268] Using random seed: 273429828
I20260928 19:27:58.741797   855 test_util.cc:268] Using random seed: 273431643
I20260928 19:27:58.743408   856 test_util.cc:268] Using random seed: 273433255
I20260928 19:27:58.744977   857 test_util.cc:268] Using random seed: 273434866
I20260928 19:27:58.751828   858 test_util.cc:268] Using random seed: 273441659
I20260928 19:27:58.753409   859 test_util.cc:268] Using random seed: 273443193
I20260928 19:27:58.755259   860 test_util.cc:268] Using random seed: 273445163
I20260928 19:27:58.757436   861 test_util.cc:268] Using random seed: 273447254
I20260928 19:27:58.759253   862 test_util.cc:268] Using random seed: 273449076
I20260928 19:27:58.761245   863 test_util.cc:268] Using random seed: 273450960
I20260928 19:27:58.763851   864 test_util.cc:268] Using random seed: 273453631
I20260928 19:27:58.765755   865 test_util.cc:268] Using random seed: 273455555
I20260928 19:27:58.767784   866 test_util.cc:268] Using random seed: 273457533
I20260928 19:27:58.771422   867 test_util.cc:268] Using random seed: 273461288
I20260928 19:27:58.773273   868 test_util.cc:268] Using random seed: 273463179
I20260928 19:27:58.774803   869 test_util.cc:268] Using random seed: 273464705
I20260928 19:27:58.777963   870 test_util.cc:268] Using random seed: 273467475
I20260928 19:27:58.780316   871 test_util.cc:268] Using random seed: 273470150
I20260928 19:27:58.782156   872 test_util.cc:268] Using random seed: 273472018
I20260928 19:27:58.783778   873 test_util.cc:268] Using random seed: 273473623
[       OK ] Parameters/TestRpc.TestCancellationMultiThreads/SSL_TCP (19050 ms)
[ RUN      ] Parameters/TestRpc.TestCallId/SSL_TCP
I20260928 19:28:17.590152   886 acceptor_pool.cc:254] collecting diagnostics on the listening RPC socket 0.0.0.0:43495 every 8 connection(s)
I20260928 19:28:17.591437   887 acceptor_pool.cc:254] collecting diagnostics on the listening RPC socket 0.0.0.0:43495 every 8 connection(s)
[       OK ] Parameters/TestRpc.TestCallId/SSL_TCP (96 ms)
[----------] 20 tests from Parameters/TestRpc (39025 ms total)

[----------] Global test environment tear-down
[==========] 21 tests from 2 test suites ran. (39033 ms total)
[  PASSED  ] 20 tests.
[  FAILED  ] 1 test, listed below:
[  FAILED  ] Parameters/TestRpc.TestCallWithChainCertAndRootCA/SSL_TCP, where GetParam() = (true, false)

 1 FAILED TEST