Diagnosed failure

Parameters/TestRpc.TestCallWithChainCertAndRootCA/SSL_UnixSocket: /data0/somelongdirectorytoavoidrpathissues/src/kudu/src/kudu/rpc/rpc-test.cc:303: Failure
Failed
Bad status: Runtime error: could not verify certificate chain (error with cert: subject=CN = localhost, ST = sadfjas, C = AS, emailAddress = sdflkdsajf, O = lskdfjlsad, OU = sldfkja, issuer=C = AS, ST = ASDfkjdhf, L = lskdjf, O = saldfja, OU = skdjf, CN = localhost, emailAddress = sadjflkadsj): : certificate has expired
Google Test trace:
/data0/somelongdirectorytoavoidrpathissues/src/kudu/src/kudu/rpc/rpc-test.cc:300: Connecting to unix:/tmp/dist-test-task3Wj2LM/test-tmp/rpc-test-a10d9f74b86044af8ea7529f9eff6479.sock
I20260929 10:43:53.403273 27058 test_util.cc:175] -----------------------------------------------
I20260929 10:43:53.403482 27058 test_util.cc:176] Had fatal failures, leaving test files at /tmp/dist-test-task3Wj2LM/test-tmp/rpc-test.2.Parameters_TestRpc.TestCallWithChainCertAndRootCA_SSL_UnixSocket.1790678629716895-27058-0

Full log

Note: This is test shard 3 of 8.
[==========] Running 21 tests from 2 test suites.
[----------] Global test environment set-up.
[----------] 1 test from TestRpc
[ RUN      ] TestRpc.TestNegotiationTimeout
WARNING: Logging before InitGoogleLogging() is written to STDERR
I20260929 10:43:49.922600 27058 rpc-test-base.h:595] status: Timed out: connection negotiation to 0.0.0.0:33705 for RPC Sleep timed out after 0.100s (ON_OUTBOUND_QUEUE), seconds elapsed: 0.101482
W20260929 10:43:53.077769 27068 negotiation.cc:337] Failed RPC negotiation. Trace:
0929 10:43:49.822160 (+     0us) reactor.cc:625] Submitting negotiation task for client connection to 0.0.0.0:33705 (local address 127.0.0.1:57790)
0929 10:43:49.822932 (+   772us) negotiation.cc:107] Waiting for socket to connect
0929 10:43:49.822989 (+    57us) client_negotiation.cc:174] Beginning negotiation
0929 10:43:49.837104 (+ 14115us) client_negotiation.cc:252] Sending NEGOTIATE NegotiatePB request
0929 10:43:53.076444 (+3239340us) negotiation.cc:327] Negotiation complete: Timed out: Client connection negotiation failed: client connection to 0.0.0.0:33705: received 0 of 4 requested bytes
Metrics: {"client-negotiator.queue_time_us":259}
[       OK ] TestRpc.TestNegotiationTimeout (3305 ms)
[----------] 1 test from TestRpc (3305 ms total)

[----------] 20 tests from Parameters/TestRpc
[ RUN      ] Parameters/TestRpc.TestAcceptorPoolStartStop/SSL_UnixSocket
I20260929 10:43:53.124135 27084 acceptor_pool.cc:254] collecting diagnostics on the listening RPC socket unix:/tmp/dist-test-task3Wj2LM/test-tmp/rpc-test-d477de6fee6c45599fd6ef84ac60f61d.sock every 8 connection(s)
I20260929 10:43:53.126199 27085 acceptor_pool.cc:254] collecting diagnostics on the listening RPC socket unix:/tmp/dist-test-task3Wj2LM/test-tmp/rpc-test-d477de6fee6c45599fd6ef84ac60f61d.sock every 8 connection(s)
I20260929 10:43:53.162590 27095 acceptor_pool.cc:254] collecting diagnostics on the listening RPC socket unix:/tmp/dist-test-task3Wj2LM/test-tmp/rpc-test-d477de6fee6c45599fd6ef84ac60f61d.sock every 8 connection(s)
I20260929 10:43:53.164371 27096 acceptor_pool.cc:254] collecting diagnostics on the listening RPC socket unix:/tmp/dist-test-task3Wj2LM/test-tmp/rpc-test-d477de6fee6c45599fd6ef84ac60f61d.sock every 8 connection(s)
I20260929 10:43:53.195279 27106 acceptor_pool.cc:254] collecting diagnostics on the listening RPC socket unix:/tmp/dist-test-task3Wj2LM/test-tmp/rpc-test-d477de6fee6c45599fd6ef84ac60f61d.sock every 8 connection(s)
I20260929 10:43:53.196100 27107 acceptor_pool.cc:254] collecting diagnostics on the listening RPC socket unix:/tmp/dist-test-task3Wj2LM/test-tmp/rpc-test-d477de6fee6c45599fd6ef84ac60f61d.sock every 8 connection(s)
I20260929 10:43:53.228597 27117 acceptor_pool.cc:254] collecting diagnostics on the listening RPC socket unix:/tmp/dist-test-task3Wj2LM/test-tmp/rpc-test-d477de6fee6c45599fd6ef84ac60f61d.sock every 8 connection(s)
I20260929 10:43:53.229403 27118 acceptor_pool.cc:254] collecting diagnostics on the listening RPC socket unix:/tmp/dist-test-task3Wj2LM/test-tmp/rpc-test-d477de6fee6c45599fd6ef84ac60f61d.sock every 8 connection(s)
I20260929 10:43:53.249063 27128 acceptor_pool.cc:254] collecting diagnostics on the listening RPC socket unix:/tmp/dist-test-task3Wj2LM/test-tmp/rpc-test-d477de6fee6c45599fd6ef84ac60f61d.sock every 8 connection(s)
I20260929 10:43:53.249852 27129 acceptor_pool.cc:254] collecting diagnostics on the listening RPC socket unix:/tmp/dist-test-task3Wj2LM/test-tmp/rpc-test-d477de6fee6c45599fd6ef84ac60f61d.sock every 8 connection(s)
[       OK ] Parameters/TestRpc.TestAcceptorPoolStartStop/SSL_UnixSocket (170 ms)
[ RUN      ] Parameters/TestRpc.TestCall/SSL_UnixSocket
I20260929 10:43:53.271286 27141 acceptor_pool.cc:254] collecting diagnostics on the listening RPC socket unix:/tmp/dist-test-task3Wj2LM/test-tmp/rpc-test-39d3e7b1e4d3465f91638c5122ef5346.sock every 8 connection(s)
I20260929 10:43:53.273901 27142 acceptor_pool.cc:254] collecting diagnostics on the listening RPC socket unix:/tmp/dist-test-task3Wj2LM/test-tmp/rpc-test-39d3e7b1e4d3465f91638c5122ef5346.sock every 8 connection(s)
I20260929 10:43:53.279805 27058 rpc-test.cc:234] Connecting to unix:/tmp/dist-test-task3Wj2LM/test-tmp/rpc-test-39d3e7b1e4d3465f91638c5122ef5346.sock
W20260929 10:43:53.348738 27138 connection.cc:196] Error closing socket: Network error: TlsSocket::Close: Broken pipe
[       OK ] Parameters/TestRpc.TestCall/SSL_UnixSocket (100 ms)
[ RUN      ] Parameters/TestRpc.TestCallWithChainCertAndRootCA/SSL_UnixSocket
I20260929 10:43:53.379904 27166 acceptor_pool.cc:254] collecting diagnostics on the listening RPC socket unix:/tmp/dist-test-task3Wj2LM/test-tmp/rpc-test-a10d9f74b86044af8ea7529f9eff6479.sock every 8 connection(s)
I20260929 10:43:53.380766 27167 acceptor_pool.cc:254] collecting diagnostics on the listening RPC socket unix:/tmp/dist-test-task3Wj2LM/test-tmp/rpc-test-a10d9f74b86044af8ea7529f9eff6479.sock every 8 connection(s)
/data0/somelongdirectorytoavoidrpathissues/src/kudu/src/kudu/rpc/rpc-test.cc:303: Failure
Failed
Bad status: Runtime error: could not verify certificate chain (error with cert: subject=CN = localhost, ST = sadfjas, C = AS, emailAddress = sdflkdsajf, O = lskdfjlsad, OU = sldfkja, issuer=C = AS, ST = ASDfkjdhf, L = lskdjf, O = saldfja, OU = skdjf, CN = localhost, emailAddress = sadjflkadsj): : certificate has expired
Google Test trace:
/data0/somelongdirectorytoavoidrpathissues/src/kudu/src/kudu/rpc/rpc-test.cc:300: Connecting to unix:/tmp/dist-test-task3Wj2LM/test-tmp/rpc-test-a10d9f74b86044af8ea7529f9eff6479.sock
I20260929 10:43:53.403273 27058 test_util.cc:175] -----------------------------------------------
I20260929 10:43:53.403482 27058 test_util.cc:176] Had fatal failures, leaving test files at /tmp/dist-test-task3Wj2LM/test-tmp/rpc-test.2.Parameters_TestRpc.TestCallWithChainCertAndRootCA_SSL_UnixSocket.1790678629716895-27058-0
[  FAILED  ] Parameters/TestRpc.TestCallWithChainCertAndRootCA/SSL_UnixSocket, where GetParam() = (true, true) (49 ms)
[ RUN      ] Parameters/TestRpc.TestCallWithBadPasswordProtectedKey/SSL_UnixSocket
[       OK ] Parameters/TestRpc.TestCallWithBadPasswordProtectedKey/SSL_UnixSocket (38 ms)
[ RUN      ] Parameters/TestRpc.TestInvalidMethodCall/SSL_UnixSocket
I20260929 10:43:53.474493 27203 acceptor_pool.cc:254] collecting diagnostics on the listening RPC socket unix:/tmp/dist-test-task3Wj2LM/test-tmp/rpc-test-d37d94034ca144b1bf4a110938486281.sock every 8 connection(s)
I20260929 10:43:53.475507 27204 acceptor_pool.cc:254] collecting diagnostics on the listening RPC socket unix:/tmp/dist-test-task3Wj2LM/test-tmp/rpc-test-d37d94034ca144b1bf4a110938486281.sock every 8 connection(s)
I20260929 10:43:53.479650 27058 rpc-test.cc:406] Connecting to unix:/tmp/dist-test-task3Wj2LM/test-tmp/rpc-test-d37d94034ca144b1bf4a110938486281.sock
W20260929 10:43:53.538244 27200 connection.cc:196] Error closing socket: Network error: TlsSocket::Close: Broken pipe
[       OK ] Parameters/TestRpc.TestInvalidMethodCall/SSL_UnixSocket (101 ms)
[ RUN      ] Parameters/TestRpc.TestHighFDs/SSL_UnixSocket
I20260929 10:43:53.762636 27228 acceptor_pool.cc:254] collecting diagnostics on the listening RPC socket unix:/tmp/dist-test-task3Wj2LM/test-tmp/rpc-test-4e3e98e1a3a14fb59e2503cb28082c02.sock every 8 connection(s)
I20260929 10:43:53.763466 27229 acceptor_pool.cc:254] collecting diagnostics on the listening RPC socket unix:/tmp/dist-test-task3Wj2LM/test-tmp/rpc-test-4e3e98e1a3a14fb59e2503cb28082c02.sock every 8 connection(s)
[       OK ] Parameters/TestRpc.TestHighFDs/SSL_UnixSocket (267 ms)
[ RUN      ] Parameters/TestRpc.TestConnectionAlwaysKeepalive/SSL_UnixSocket
I20260929 10:43:53.830890 27251 acceptor_pool.cc:254] collecting diagnostics on the listening RPC socket unix:/tmp/dist-test-task3Wj2LM/test-tmp/rpc-test-0ddb72a46bf946d989081ea8c081dfaf.sock every 8 connection(s)
I20260929 10:43:53.831795 27252 acceptor_pool.cc:254] collecting diagnostics on the listening RPC socket unix:/tmp/dist-test-task3Wj2LM/test-tmp/rpc-test-0ddb72a46bf946d989081ea8c081dfaf.sock every 8 connection(s)
I20260929 10:43:53.835691 27058 rpc-test.cc:532] Connecting to unix:/tmp/dist-test-task3Wj2LM/test-tmp/rpc-test-0ddb72a46bf946d989081ea8c081dfaf.sock
W20260929 10:43:56.900339 27250 connection.cc:196] Error closing socket: Network error: TlsSocket::Close: Broken pipe
[       OK ] Parameters/TestRpc.TestConnectionAlwaysKeepalive/SSL_UnixSocket (3094 ms)
[ RUN      ] Parameters/TestRpc.TestReopenOutboundConnections/SSL_UnixSocket
I20260929 10:43:56.924755 27274 acceptor_pool.cc:254] collecting diagnostics on the listening RPC socket unix:/tmp/dist-test-task3Wj2LM/test-tmp/rpc-test-a8e396449aaa4e21a07be0e59f817861.sock every 8 connection(s)
I20260929 10:43:56.925545 27275 acceptor_pool.cc:254] collecting diagnostics on the listening RPC socket unix:/tmp/dist-test-task3Wj2LM/test-tmp/rpc-test-a8e396449aaa4e21a07be0e59f817861.sock every 8 connection(s)
I20260929 10:43:56.929041 27058 rpc-test.cc:658] Connecting to unix:/tmp/dist-test-task3Wj2LM/test-tmp/rpc-test-a8e396449aaa4e21a07be0e59f817861.sock
W20260929 10:43:56.961522 27273 connection.cc:196] Error closing socket: Network error: TlsSocket::Close: Broken pipe
W20260929 10:43:56.973009 27273 connection.cc:196] Error closing socket: Network error: TlsSocket::Close: Broken pipe
W20260929 10:43:56.984078 27273 connection.cc:196] Error closing socket: Network error: TlsSocket::Close: Broken pipe
W20260929 10:43:56.995078 27273 connection.cc:196] Error closing socket: Network error: TlsSocket::Close: Broken pipe
W20260929 10:43:57.006003 27273 connection.cc:196] Error closing socket: Network error: TlsSocket::Close: Broken pipe
W20260929 10:43:57.016813 27273 connection.cc:196] Error closing socket: Network error: TlsSocket::Close: Broken pipe
W20260929 10:43:57.027596 27273 connection.cc:196] Error closing socket: Network error: TlsSocket::Close: Broken pipe
W20260929 10:43:57.038406 27273 connection.cc:196] Error closing socket: Network error: TlsSocket::Close: Broken pipe
W20260929 10:43:57.049443 27273 connection.cc:196] Error closing socket: Network error: TlsSocket::Close: Broken pipe
W20260929 10:43:57.060452 27273 connection.cc:196] Error closing socket: Network error: TlsSocket::Close: Broken pipe
W20260929 10:43:57.071084 27273 connection.cc:196] Error closing socket: Network error: TlsSocket::Close: Broken pipe
W20260929 10:43:57.081867 27273 connection.cc:196] Error closing socket: Network error: TlsSocket::Close: Broken pipe
W20260929 10:43:57.092816 27273 connection.cc:196] Error closing socket: Network error: TlsSocket::Close: Broken pipe
W20260929 10:43:57.103899 27273 connection.cc:196] Error closing socket: Network error: TlsSocket::Close: Broken pipe
W20260929 10:43:57.104027 27274 acceptor_pool.cc:285] unable to collect diagnostics on RPC socket unix:/tmp/dist-test-task3Wj2LM/test-tmp/rpc-test-a8e396449aaa4e21a07be0e59f817861.sock: Not implemented: netlink diagnostics is currently supported only on IPv4 TCP sockets
W20260929 10:43:57.114120 27273 connection.cc:196] Error closing socket: Network error: TlsSocket::Close: Broken pipe
W20260929 10:43:57.125525 27273 connection.cc:196] Error closing socket: Network error: TlsSocket::Close: Broken pipe
W20260929 10:43:57.136618 27273 connection.cc:196] Error closing socket: Network error: TlsSocket::Close: Broken pipe
W20260929 10:43:57.148173 27273 connection.cc:196] Error closing socket: Network error: TlsSocket::Close: Broken pipe
W20260929 10:43:57.159358 27273 connection.cc:196] Error closing socket: Network error: TlsSocket::Close: Broken pipe
W20260929 10:43:57.170348 27273 connection.cc:196] Error closing socket: Network error: TlsSocket::Close: Broken pipe
W20260929 10:43:57.181560 27273 connection.cc:196] Error closing socket: Network error: TlsSocket::Close: Broken pipe
W20260929 10:43:57.192591 27273 connection.cc:196] Error closing socket: Network error: TlsSocket::Close: Broken pipe
W20260929 10:43:57.203796 27273 connection.cc:196] Error closing socket: Network error: TlsSocket::Close: Broken pipe
W20260929 10:43:57.214814 27273 connection.cc:196] Error closing socket: Network error: TlsSocket::Close: Broken pipe
W20260929 10:43:57.225698 27273 connection.cc:196] Error closing socket: Network error: TlsSocket::Close: Broken pipe
W20260929 10:43:57.236150 27273 connection.cc:196] Error closing socket: Network error: TlsSocket::Close: Broken pipe
W20260929 10:43:57.246060 27273 connection.cc:196] Error closing socket: Network error: TlsSocket::Close: Broken pipe
W20260929 10:43:57.256313 27273 connection.cc:196] Error closing socket: Network error: TlsSocket::Close: Broken pipe
W20260929 10:43:57.266031 27273 connection.cc:196] Error closing socket: Network error: TlsSocket::Close: Broken pipe
W20260929 10:43:57.276051 27273 connection.cc:196] Error closing socket: Network error: TlsSocket::Close: Broken pipe
W20260929 10:43:57.285864 27273 connection.cc:196] Error closing socket: Network error: TlsSocket::Close: Broken pipe
[       OK ] Parameters/TestRpc.TestReopenOutboundConnections/SSL_UnixSocket (396 ms)
[ RUN      ] Parameters/TestRpc.TestConnectionNetworkPlane/SSL_UnixSocket
I20260929 10:43:57.330876 27297 acceptor_pool.cc:254] collecting diagnostics on the listening RPC socket unix:/tmp/dist-test-task3Wj2LM/test-tmp/rpc-test-858b08ec68f2423fbf9c1c5b332001d9.sock every 8 connection(s)
I20260929 10:43:57.331708 27298 acceptor_pool.cc:254] collecting diagnostics on the listening RPC socket unix:/tmp/dist-test-task3Wj2LM/test-tmp/rpc-test-858b08ec68f2423fbf9c1c5b332001d9.sock every 8 connection(s)
I20260929 10:43:57.335242 27058 rpc-test.cc:772] Connecting to unix:/tmp/dist-test-task3Wj2LM/test-tmp/rpc-test-858b08ec68f2423fbf9c1c5b332001d9.sock
W20260929 10:43:57.380825 27296 connection.cc:196] Error closing socket: Network error: TlsSocket::Close: Broken pipe
W20260929 10:43:57.381590 27296 connection.cc:196] Error closing socket: Network error: TlsSocket::Close: Broken pipe
[       OK ] Parameters/TestRpc.TestConnectionNetworkPlane/SSL_UnixSocket (84 ms)
[ RUN      ] Parameters/TestRpc.TestTCPKeepalive/SSL_UnixSocket
I20260929 10:43:57.404202 27322 acceptor_pool.cc:254] collecting diagnostics on the listening RPC socket unix:/tmp/dist-test-task3Wj2LM/test-tmp/rpc-test-1ed75c4fa9644242aed9881b4cea6053.sock every 8 connection(s)
I20260929 10:43:57.405048 27323 acceptor_pool.cc:254] collecting diagnostics on the listening RPC socket unix:/tmp/dist-test-task3Wj2LM/test-tmp/rpc-test-1ed75c4fa9644242aed9881b4cea6053.sock every 8 connection(s)
I20260929 10:43:57.433956 27326 rpc-test-base.h:222] got call: sleep_micros: 8000000 deferred: true
I20260929 10:44:05.438616 27326 rpcz_store.cc:275] Call kudu.rpc.GenericCalculatorService.Sleep from unix:<unnamed> (request call id 0) took 8004 ms. Trace:
I20260929 10:44:05.439152 27326 rpcz_store.cc:276] 0929 10:43:57.433773 (+     0us) service_pool.cc:170] Inserting onto call queue
0929 10:43:57.433884 (+   111us) service_pool.cc:227] Handling call
0929 10:44:05.438408 (+8004524us) inbound_call.cc:173] Queueing success response
Metrics: {}
[       OK ] Parameters/TestRpc.TestTCPKeepalive/SSL_UnixSocket (8066 ms)
[ RUN      ] Parameters/TestRpc.TestMaxSmallSidecars/SSL_UnixSocket
I20260929 10:44:05.471737 27348 acceptor_pool.cc:254] collecting diagnostics on the listening RPC socket unix:/tmp/dist-test-task3Wj2LM/test-tmp/rpc-test-999cf355588646a99473b0f90fb5221f.sock every 8 connection(s)
I20260929 10:44:05.472620 27349 acceptor_pool.cc:254] collecting diagnostics on the listening RPC socket unix:/tmp/dist-test-task3Wj2LM/test-tmp/rpc-test-999cf355588646a99473b0f90fb5221f.sock every 8 connection(s)
W20260929 10:44:05.652166 27345 connection.cc:196] Error closing socket: Network error: TlsSocket::Close: Broken pipe
[       OK ] Parameters/TestRpc.TestMaxSmallSidecars/SSL_UnixSocket (204 ms)
[ RUN      ] Parameters/TestRpc.TestCallTimeout/SSL_UnixSocket
I20260929 10:44:05.682621 27373 acceptor_pool.cc:254] collecting diagnostics on the listening RPC socket unix:/tmp/dist-test-task3Wj2LM/test-tmp/rpc-test-d6df0ffd4dd2455a87db3f50055bdf8d.sock every 8 connection(s)
I20260929 10:44:05.683436 27374 acceptor_pool.cc:254] collecting diagnostics on the listening RPC socket unix:/tmp/dist-test-task3Wj2LM/test-tmp/rpc-test-d6df0ffd4dd2455a87db3f50055bdf8d.sock every 8 connection(s)
I20260929 10:44:05.702059 27058 rpc-test-base.h:595] status: Timed out: connection negotiation to unix:/tmp/dist-test-task3Wj2LM/test-tmp/rpc-test-d6df0ffd4dd2455a87db3f50055bdf8d.sock for RPC Sleep timed out after 0.000s (ON_OUTBOUND_QUEUE), seconds elapsed: 0.0025668
I20260929 10:44:05.710930 27377 rpc-test-base.h:222] got call: sleep_micros: 700000
I20260929 10:44:05.903673 27058 rpc-test-base.h:595] status: Timed out: Sleep RPC to unix:/tmp/dist-test-task3Wj2LM/test-tmp/rpc-test-d6df0ffd4dd2455a87db3f50055bdf8d.sock timed out after 0.200s (SENT), seconds elapsed: 0.201208
I20260929 10:44:05.905435 27376 rpc-test-base.h:222] got call: sleep_micros: 2000000
W20260929 10:44:06.411753 27377 rpcz_store.cc:267] Call kudu.rpc.GenericCalculatorService.Sleep from unix:<unnamed> (request call id 1) took 701 ms (client timeout 200 ms). Trace:
W20260929 10:44:06.412253 27377 rpcz_store.cc:269] 0929 10:44:05.710745 (+     0us) service_pool.cc:170] Inserting onto call queue
0929 10:44:05.710874 (+   129us) service_pool.cc:227] Handling call
0929 10:44:06.411660 (+700786us) inbound_call.cc:173] Queueing success response
Metrics: {}
I20260929 10:44:07.406112 27058 rpc-test-base.h:595] status: Timed out: Sleep RPC to unix:/tmp/dist-test-task3Wj2LM/test-tmp/rpc-test-d6df0ffd4dd2455a87db3f50055bdf8d.sock timed out after 1.500s (SENT), seconds elapsed: 1.50199
W20260929 10:44:07.906044 27376 rpcz_store.cc:267] Call kudu.rpc.GenericCalculatorService.Sleep from unix:<unnamed> (request call id 2) took 2001 ms (client timeout 1500 ms). Trace:
W20260929 10:44:07.906435 27376 rpcz_store.cc:269] 0929 10:44:05.905073 (+     0us) service_pool.cc:170] Inserting onto call queue
0929 10:44:05.905240 (+   167us) service_pool.cc:227] Handling call
0929 10:44:07.905970 (+2000730us) inbound_call.cc:173] Queueing success response
Metrics: {}
W20260929 10:44:07.907094 27370 connection.cc:441] server connection from unix:<unnamed> torn down before Call kudu.rpc.GenericCalculatorService.Sleep from unix:<unnamed> (request call id 2) could send its response
[       OK ] Parameters/TestRpc.TestCallTimeout/SSL_UnixSocket (2255 ms)
[ RUN      ] Parameters/TestRpc.TestServerShutsDown/SSL_UnixSocket
I20260929 10:44:07.915491 27058 rpc-test.cc:1125] Connecting to 0.0.0.0:38987
W20260929 10:44:07.933358 27390 negotiation.cc:337] Failed RPC negotiation. Trace:
0929 10:44:07.931745 (+     0us) reactor.cc:625] Submitting negotiation task for client connection to 0.0.0.0:38987 (local address 127.0.0.1:36624)
0929 10:44:07.932243 (+   498us) negotiation.cc:107] Waiting for socket to connect
0929 10:44:07.932277 (+    34us) client_negotiation.cc:174] Beginning negotiation
0929 10:44:07.932549 (+   272us) client_negotiation.cc:252] Sending NEGOTIATE NegotiatePB request
0929 10:44:07.932794 (+   245us) negotiation.cc:327] Negotiation complete: Network error: Client connection negotiation failed: client connection to 0.0.0.0:38987: BlockingWrite error: write error: Broken pipe (error 32)
Metrics: {"client-negotiator.queue_time_us":119}
[       OK ] Parameters/TestRpc.TestServerShutsDown/SSL_UnixSocket (23 ms)
[ RUN      ] Parameters/TestRpc.TimedOutOnResponseMetric/SSL_UnixSocket
I20260929 10:44:07.959476 27407 acceptor_pool.cc:254] collecting diagnostics on the listening RPC socket unix:/tmp/dist-test-task3Wj2LM/test-tmp/rpc-test-84e358564ace4bfd8fd1d58cb53ac928.sock every 8 connection(s)
I20260929 10:44:07.960376 27408 acceptor_pool.cc:254] collecting diagnostics on the listening RPC socket unix:/tmp/dist-test-task3Wj2LM/test-tmp/rpc-test-84e358564ace4bfd8fd1d58cb53ac928.sock every 8 connection(s)
W20260929 10:44:08.199441 27411 rpcz_store.cc:267] Call kudu.rpc_test.CalculatorService.Sleep from unix:<unnamed> (request call id 3) took 50 ms (client timeout 25 ms). Trace:
W20260929 10:44:08.199836 27411 rpcz_store.cc:269] 0929 10:44:08.148738 (+     0us) service_pool.cc:170] Inserting onto call queue
0929 10:44:08.148862 (+   124us) service_pool.cc:227] Handling call
0929 10:44:08.199342 (+ 50480us) inbound_call.cc:173] Queueing success response
Related trace 'test_child':
Metrics: {"test_sleep_us":50000,"child_traces":[["test_child",{"related_trace_metric":1}]]}
W20260929 10:44:08.259060 27411 rpcz_store.cc:267] Call kudu.rpc_test.CalculatorService.Sleep from unix:<unnamed> (request call id 4) took 50 ms (client timeout 50 ms). Trace:
W20260929 10:44:08.259436 27411 rpcz_store.cc:269] 0929 10:44:08.208417 (+     0us) service_pool.cc:170] Inserting onto call queue
0929 10:44:08.208556 (+   139us) service_pool.cc:227] Handling call
0929 10:44:08.258979 (+ 50423us) inbound_call.cc:173] Queueing success response
Related trace 'test_child':
Metrics: {"test_sleep_us":50000,"child_traces":[["test_child",{"related_trace_metric":1}]]}
W20260929 10:44:08.263195 27404 connection.cc:196] Error closing socket: Network error: TlsSocket::Close: Broken pipe
[       OK ] Parameters/TestRpc.TimedOutOnResponseMetric/SSL_UnixSocket (332 ms)
[ RUN      ] Parameters/TestRpc.AcceptorDispatchingTimesMetric/SSL_UnixSocket
I20260929 10:44:08.282220 27432 acceptor_pool.cc:254] collecting diagnostics on the listening RPC socket 0.0.0.0:45623 every 8 connection(s)
I20260929 10:44:08.282964 27433 acceptor_pool.cc:254] collecting diagnostics on the listening RPC socket 0.0.0.0:45623 every 8 connection(s)
W20260929 10:44:08.288416 27428 negotiation.cc:337] Failed RPC negotiation. Trace:
0929 10:44:08.287068 (+     0us) reactor.cc:625] Submitting negotiation task for server connection from 127.0.0.1:56638 (local address 127.0.0.1:45623)
0929 10:44:08.287655 (+   587us) server_negotiation.cc:206] Beginning negotiation
0929 10:44:08.287676 (+    21us) server_negotiation.cc:399] Waiting for connection header
0929 10:44:08.287934 (+   258us) negotiation.cc:327] Negotiation complete: Network error: Server connection negotiation failed: server connection from 127.0.0.1:56638: BlockingRecv error: recv got EOF from 127.0.0.1:56638 (error 108)
Metrics: {"server-negotiator.queue_time_us":127}
[       OK ] Parameters/TestRpc.AcceptorDispatchingTimesMetric/SSL_UnixSocket (24 ms)
[ RUN      ] Parameters/TestRpc.TestRpcCallbackDestroysMessenger/SSL_UnixSocket
[       OK ] Parameters/TestRpc.TestRpcCallbackDestroysMessenger/SSL_UnixSocket (17 ms)
[ RUN      ] Parameters/TestRpc.TestApplicationFeatureFlag/SSL_UnixSocket
I20260929 10:44:08.332906 27457 acceptor_pool.cc:254] collecting diagnostics on the listening RPC socket unix:/tmp/dist-test-task3Wj2LM/test-tmp/rpc-test-bb6fe51a3a2647d29e9a34f095f67f96.sock every 8 connection(s)
I20260929 10:44:08.333891 27458 acceptor_pool.cc:254] collecting diagnostics on the listening RPC socket unix:/tmp/dist-test-task3Wj2LM/test-tmp/rpc-test-bb6fe51a3a2647d29e9a34f095f67f96.sock every 8 connection(s)
W20260929 10:44:08.376060 27454 messenger.cc:357] Unable to handle RPC call: Not implemented: call requires unsupported application feature flags: 99
[       OK ] Parameters/TestRpc.TestApplicationFeatureFlag/SSL_UnixSocket (76 ms)
[ RUN      ] Parameters/TestRpc.TestCancellation/SSL_UnixSocket
I20260929 10:44:08.409313 27482 acceptor_pool.cc:254] collecting diagnostics on the listening RPC socket unix:/tmp/dist-test-task3Wj2LM/test-tmp/rpc-test-e42884a5948a4d388a25c1b03fce8938.sock every 8 connection(s)
I20260929 10:44:08.410161 27483 acceptor_pool.cc:254] collecting diagnostics on the listening RPC socket unix:/tmp/dist-test-task3Wj2LM/test-tmp/rpc-test-e42884a5948a4d388a25c1b03fce8938.sock every 8 connection(s)
I20260929 10:44:08.413775 27058 rpc-test.cc:1648] Connecting to unix:/tmp/dist-test-task3Wj2LM/test-tmp/rpc-test-e42884a5948a4d388a25c1b03fce8938.sock
I20260929 10:44:08.545677 27058 rpc-test-base.h:595] status: Aborted: Sleep RPC to unix:/tmp/dist-test-task3Wj2LM/test-tmp/rpc-test-e42884a5948a4d388a25c1b03fce8938.sock is cancelled in state READY, seconds elapsed: 0.0003832
I20260929 10:44:08.743281 27058 rpc-test-base.h:595] status: Aborted: Sleep RPC to unix:/tmp/dist-test-task3Wj2LM/test-tmp/rpc-test-e42884a5948a4d388a25c1b03fce8938.sock is cancelled in state SENT, seconds elapsed: 0.00107782
I20260929 10:44:08.743530 27485 rpc-test-base.h:222] got call: sleep_micros: 510000
I20260929 10:44:08.934069 27058 rpc-test-base.h:595] status: Aborted: Sleep RPC to unix:/tmp/dist-test-task3Wj2LM/test-tmp/rpc-test-e42884a5948a4d388a25c1b03fce8938.sock is cancelled in state SENT, seconds elapsed: 0.000778812
I20260929 10:44:08.934485 27484 rpc-test-base.h:222] got call: sleep_micros: 510000
I20260929 10:44:09.123015 27058 rpc-test-base.h:595] status: Aborted: Sleep RPC to unix:/tmp/dist-test-task3Wj2LM/test-tmp/rpc-test-e42884a5948a4d388a25c1b03fce8938.sock is cancelled in state SENT, seconds elapsed: 0.00078113
W20260929 10:44:09.134953 27486 rpcz_store.cc:267] Call kudu.rpc.GenericCalculatorService.Sleep from unix:<unnamed> (request call id 11) took 11 ms (client timeout 10 ms). Trace:
W20260929 10:44:09.135275 27486 rpcz_store.cc:269] 0929 10:44:09.123167 (+     0us) service_pool.cc:170] Inserting onto call queue
0929 10:44:09.134610 (+ 11443us) service_pool.cc:214] Skipping call since client already timed out
0929 10:44:09.134754 (+   144us) inbound_call.cc:173] Queueing failure response
Metrics: {}
I20260929 10:44:09.135979 27486 rpc-test-base.h:222] got call: sleep_micros: 1500000
W20260929 10:44:09.254582 27485 rpcz_store.cc:267] Call kudu.rpc.GenericCalculatorService.Sleep from unix:<unnamed> (request call id 3) took 511 ms (client timeout 10 ms). Trace:
W20260929 10:44:09.254976 27485 rpcz_store.cc:269] 0929 10:44:08.743321 (+     0us) service_pool.cc:170] Inserting onto call queue
0929 10:44:08.743472 (+   151us) service_pool.cc:227] Handling call
0929 10:44:09.254496 (+511024us) inbound_call.cc:173] Queueing success response
Metrics: {}
W20260929 10:44:09.445369 27484 rpcz_store.cc:267] Call kudu.rpc.GenericCalculatorService.Sleep from unix:<unnamed> (request call id 7) took 511 ms (client timeout 10 ms). Trace:
W20260929 10:44:09.445806 27484 rpcz_store.cc:269] 0929 10:44:08.934235 (+     0us) service_pool.cc:170] Inserting onto call queue
0929 10:44:08.934410 (+   175us) service_pool.cc:227] Handling call
0929 10:44:09.445278 (+510868us) inbound_call.cc:173] Queueing success response
Metrics: {}
I20260929 10:44:10.125633 27058 rpc-test-base.h:595] status: Timed out: Sleep RPC to unix:/tmp/dist-test-task3Wj2LM/test-tmp/rpc-test-e42884a5948a4d388a25c1b03fce8938.sock timed out after 1.000s (SENT), seconds elapsed: 1.00208
I20260929 10:44:10.127983 27484 rpc-test-base.h:222] got call: sleep_micros: 1500000
W20260929 10:44:10.636837 27486 rpcz_store.cc:267] Call kudu.rpc.GenericCalculatorService.Sleep from unix:<unnamed> (request call id 12) took 1512 ms (client timeout 1000 ms). Trace:
W20260929 10:44:10.637305 27486 rpcz_store.cc:269] 0929 10:44:09.124203 (+     0us) service_pool.cc:170] Inserting onto call queue
0929 10:44:09.135909 (+ 11706us) service_pool.cc:227] Handling call
0929 10:44:10.636620 (+1500711us) inbound_call.cc:173] Queueing success response
Metrics: {}
I20260929 10:44:11.128358 27058 rpc-test-base.h:595] status: Timed out: Sleep RPC to unix:/tmp/dist-test-task3Wj2LM/test-tmp/rpc-test-e42884a5948a4d388a25c1b03fce8938.sock timed out after 1.000s (SENT), seconds elapsed: 1.00208
W20260929 10:44:11.130141 27479 messenger.cc:357] Unable to handle RPC call: Not implemented: call requires unsupported application feature flags: 99, 1
W20260929 10:44:11.131614 27479 messenger.cc:357] Unable to handle RPC call: Not implemented: call requires unsupported application feature flags: 99, 1
W20260929 10:44:11.394001 27479 connection.cc:196] Error closing socket: Network error: TlsSocket::Close: Broken pipe
W20260929 10:44:11.628834 27484 rpcz_store.cc:267] Call kudu.rpc.GenericCalculatorService.Sleep from unix:<unnamed> (request call id 13) took 1501 ms (client timeout 1000 ms). Trace:
W20260929 10:44:11.629421 27484 rpcz_store.cc:269] 0929 10:44:10.127608 (+     0us) service_pool.cc:170] Inserting onto call queue
0929 10:44:10.127840 (+   232us) service_pool.cc:227] Handling call
0929 10:44:11.628714 (+1500874us) inbound_call.cc:173] Queueing success response
Metrics: {}
W20260929 10:44:11.630194 27479 connection.cc:441] server connection from unix:<unnamed> torn down before Call kudu.rpc.GenericCalculatorService.Sleep from unix:<unnamed> (request call id 13) could send its response
[       OK ] Parameters/TestRpc.TestCancellation/SSL_UnixSocket (3254 ms)
[ RUN      ] Parameters/TestRpc.TestCancellationMultiThreads/SSL_UnixSocket
I20260929 10:44:11.690609 27508 acceptor_pool.cc:254] collecting diagnostics on the listening RPC socket unix:/tmp/dist-test-task3Wj2LM/test-tmp/rpc-test-0244733184854a3fba1cf577099bc44a.sock every 8 connection(s)
I20260929 10:44:11.691588 27509 acceptor_pool.cc:254] collecting diagnostics on the listening RPC socket unix:/tmp/dist-test-task3Wj2LM/test-tmp/rpc-test-0244733184854a3fba1cf577099bc44a.sock every 8 connection(s)
I20260929 10:44:11.695123 27058 rpc-test.cc:1808] Connecting to unix:/tmp/dist-test-task3Wj2LM/test-tmp/rpc-test-0244733184854a3fba1cf577099bc44a.sock
I20260929 10:44:11.864750 27522 test_util.cc:268] Using random seed: -588020190
I20260929 10:44:11.866566 27523 test_util.cc:268] Using random seed: -588018282
I20260929 10:44:11.868461 27524 test_util.cc:268] Using random seed: -588016459
I20260929 10:44:11.870123 27525 test_util.cc:268] Using random seed: -588014741
I20260929 10:44:11.871846 27526 test_util.cc:268] Using random seed: -588013097
I20260929 10:44:11.873785 27527 test_util.cc:268] Using random seed: -588011217
I20260929 10:44:11.875422 27528 test_util.cc:268] Using random seed: -588009596
I20260929 10:44:11.877431 27529 test_util.cc:268] Using random seed: -588007523
I20260929 10:44:11.879886 27530 test_util.cc:268] Using random seed: -588005145
I20260929 10:44:11.881735 27531 test_util.cc:268] Using random seed: -588003265
I20260929 10:44:11.884095 27532 test_util.cc:268] Using random seed: -588000936
I20260929 10:44:11.885882 27533 test_util.cc:268] Using random seed: -587999137
I20260929 10:44:11.888181 27534 test_util.cc:268] Using random seed: -587996905
I20260929 10:44:11.889971 27535 test_util.cc:268] Using random seed: -587995055
I20260929 10:44:11.891958 27536 test_util.cc:268] Using random seed: -587993128
I20260929 10:44:11.896442 27537 test_util.cc:268] Using random seed: -587988605
I20260929 10:44:11.898075 27538 test_util.cc:268] Using random seed: -587986886
I20260929 10:44:11.899878 27539 test_util.cc:268] Using random seed: -587985156
I20260929 10:44:11.901861 27540 test_util.cc:268] Using random seed: -587983102
I20260929 10:44:11.903944 27541 test_util.cc:268] Using random seed: -587981051
I20260929 10:44:11.906420 27542 test_util.cc:268] Using random seed: -587978752
I20260929 10:44:11.908371 27543 test_util.cc:268] Using random seed: -587976623
I20260929 10:44:11.910511 27544 test_util.cc:268] Using random seed: -587974578
I20260929 10:44:11.912691 27545 test_util.cc:268] Using random seed: -587972352
I20260929 10:44:11.915023 27546 test_util.cc:268] Using random seed: -587970010
I20260929 10:44:11.917303 27547 test_util.cc:268] Using random seed: -587967746
I20260929 10:44:11.920595 27548 test_util.cc:268] Using random seed: -587964474
I20260929 10:44:11.922465 27549 test_util.cc:268] Using random seed: -587962602
I20260929 10:44:11.924577 27550 test_util.cc:268] Using random seed: -587960474
I20260929 10:44:11.926220 27551 test_util.cc:268] Using random seed: -587958752
W20260929 10:44:32.741919 27505 connection.cc:196] Error closing socket: Network error: TlsSocket::Close: Broken pipe
[       OK ] Parameters/TestRpc.TestCancellationMultiThreads/SSL_UnixSocket (21120 ms)
[ RUN      ] Parameters/TestRpc.TestCallId/SSL_UnixSocket
I20260929 10:44:32.803758 27565 acceptor_pool.cc:254] collecting diagnostics on the listening RPC socket unix:/tmp/dist-test-task3Wj2LM/test-tmp/rpc-test-fc3850c716cc4171b1b211f457003240.sock every 8 connection(s)
I20260929 10:44:32.804778 27566 acceptor_pool.cc:254] collecting diagnostics on the listening RPC socket unix:/tmp/dist-test-task3Wj2LM/test-tmp/rpc-test-fc3850c716cc4171b1b211f457003240.sock every 8 connection(s)
W20260929 10:44:32.870605 27562 connection.cc:196] Error closing socket: Network error: TlsSocket::Close: Broken pipe
[       OK ] Parameters/TestRpc.TestCallId/SSL_UnixSocket (115 ms)
[----------] 20 tests from Parameters/TestRpc (39795 ms total)

[----------] Global test environment tear-down
[==========] 21 tests from 2 test suites ran. (43102 ms total)
[  PASSED  ] 20 tests.
[  FAILED  ] 1 test, listed below:
[  FAILED  ] Parameters/TestRpc.TestCallWithChainCertAndRootCA/SSL_UnixSocket, where GetParam() = (true, true)

 1 FAILED TEST
I20260929 10:44:32.897534 27058 logging.cc:424] LogThrottler /data0/somelongdirectorytoavoidrpathissues/src/kudu/src/kudu/rpc/acceptor_pool.cc:285: suppressed but not reported on 3 messages since previous log ~35 seconds ago