Diagnosed failure
Parameters/TestRpc.TestCallWithChainCertAndChainCA/SSL_TCP: /data0/somelongdirectorytoavoidrpathissues/src/kudu/src/kudu/rpc/rpc-test.cc:270: Failure
Failed
Bad status: Runtime error: could not verify certificate chain (error with cert: subject=CN = localhost, ST = sadfjas, C = AS, emailAddress = sdflkdsajf, O = lskdfjlsad, OU = sldfkja, issuer=C = AS, ST = ASDfkjdhf, L = lskdjf, O = saldfja, OU = skdjf, CN = localhost, emailAddress = sadjflkadsj): : certificate has expired
Google Test trace:
/data0/somelongdirectorytoavoidrpathissues/src/kudu/src/kudu/rpc/rpc-test.cc:267: Connecting to 0.0.0.0:43629
I20260926 03:37:38.482401 3419 test_util.cc:175] -----------------------------------------------
I20260926 03:37:38.482539 3419 test_util.cc:176] Had fatal failures, leaving test files at /tmp/dist-test-taskE8UlyP/test-tmp/rpc-test.5.Parameters_TestRpc.TestCallWithChainCertAndChainCA_SSL_TCP.1790393858335451-3419-0
Full log
Note: This is test shard 6 of 8.
[==========] Running 21 tests from 2 test suites.
[----------] Global test environment set-up.
[----------] 20 tests from Parameters/TestRpc
[ RUN ] Parameters/TestRpc.TestMessengerCreateDestroy/SSL_TCP
WARNING: Logging before InitGoogleLogging() is written to STDERR
I20260926 03:37:38.396421 3419 rpc-test.cc:169] started messenger TestCreateDestroy
[ OK ] Parameters/TestRpc.TestMessengerCreateDestroy/SSL_TCP (42 ms)
[ RUN ] Parameters/TestRpc.TestNegotiationDeadlock/SSL_TCP
I20260926 03:37:38.423563 3439 acceptor_pool.cc:254] collecting diagnostics on the listening RPC socket 0.0.0.0:36733 every 8 connection(s)
I20260926 03:37:38.423748 3440 acceptor_pool.cc:254] collecting diagnostics on the listening RPC socket 0.0.0.0:36733 every 8 connection(s)
[ OK ] Parameters/TestRpc.TestNegotiationDeadlock/SSL_TCP (48 ms)
[ RUN ] Parameters/TestRpc.TestCallWithChainCertAndChainCA/SSL_TCP
I20260926 03:37:38.467620 3455 acceptor_pool.cc:254] collecting diagnostics on the listening RPC socket 0.0.0.0:43629 every 8 connection(s)
I20260926 03:37:38.468073 3456 acceptor_pool.cc:254] collecting diagnostics on the listening RPC socket 0.0.0.0:43629 every 8 connection(s)
/data0/somelongdirectorytoavoidrpathissues/src/kudu/src/kudu/rpc/rpc-test.cc:270: Failure
Failed
Bad status: Runtime error: could not verify certificate chain (error with cert: subject=CN = localhost, ST = sadfjas, C = AS, emailAddress = sdflkdsajf, O = lskdfjlsad, OU = sldfkja, issuer=C = AS, ST = ASDfkjdhf, L = lskdjf, O = saldfja, OU = skdjf, CN = localhost, emailAddress = sadjflkadsj): : certificate has expired
Google Test trace:
/data0/somelongdirectorytoavoidrpathissues/src/kudu/src/kudu/rpc/rpc-test.cc:267: Connecting to 0.0.0.0:43629
I20260926 03:37:38.482401 3419 test_util.cc:175] -----------------------------------------------
I20260926 03:37:38.482539 3419 test_util.cc:176] Had fatal failures, leaving test files at /tmp/dist-test-taskE8UlyP/test-tmp/rpc-test.5.Parameters_TestRpc.TestCallWithChainCertAndChainCA_SSL_TCP.1790393858335451-3419-0
[ FAILED ] Parameters/TestRpc.TestCallWithChainCertAndChainCA/SSL_TCP, where GetParam() = (true, false) (33 ms)
[ RUN ] Parameters/TestRpc.TestCallWithPasswordProtectedKey/SSL_TCP
I20260926 03:37:38.503252 3480 acceptor_pool.cc:254] collecting diagnostics on the listening RPC socket 0.0.0.0:43613 every 8 connection(s)
I20260926 03:37:38.503479 3481 acceptor_pool.cc:254] collecting diagnostics on the listening RPC socket 0.0.0.0:43613 every 8 connection(s)
[ OK ] Parameters/TestRpc.TestCallWithPasswordProtectedKey/SSL_TCP (62 ms)
[ RUN ] Parameters/TestRpc.TestCallToBadServer/SSL_TCP
I20260926 03:37:38.559916 3419 rpc-test.cc:394] Status: Network error: Client connection negotiation failed: client connection to 0.0.0.0:0: connect: Connection refused (error 111)
I20260926 03:37:38.560752 3419 rpc-test.cc:394] Status: Network error: Client connection negotiation failed: client connection to 0.0.0.0:0: connect: Connection refused (error 111)
I20260926 03:37:38.561529 3419 rpc-test.cc:394] Status: Network error: Client connection negotiation failed: client connection to 0.0.0.0:0: connect: Connection refused (error 111)
I20260926 03:37:38.562196 3419 rpc-test.cc:394] Status: Network error: Client connection negotiation failed: client connection to 0.0.0.0:0: connect: Connection refused (error 111)
I20260926 03:37:38.562891 3419 rpc-test.cc:394] Status: Network error: Client connection negotiation failed: client connection to 0.0.0.0:0: connect: Connection refused (error 111)
[ OK ] Parameters/TestRpc.TestCallToBadServer/SSL_TCP (20 ms)
[ RUN ] Parameters/TestRpc.TestWrongService/SSL_TCP
I20260926 03:37:38.586179 3515 acceptor_pool.cc:254] collecting diagnostics on the listening RPC socket 0.0.0.0:39419 every 8 connection(s)
I20260926 03:37:38.586503 3516 acceptor_pool.cc:254] collecting diagnostics on the listening RPC socket 0.0.0.0:39419 every 8 connection(s)
I20260926 03:37:38.608703 3514 messenger.cc:345] service WrongServiceName not registered on TestServer
[ OK ] Parameters/TestRpc.TestWrongService/SSL_TCP (48 ms)
[ RUN ] Parameters/TestRpc.TestConnectionKeepalive/SSL_TCP
I20260926 03:37:38.628116 3538 acceptor_pool.cc:254] collecting diagnostics on the listening RPC socket 0.0.0.0:46269 every 8 connection(s)
I20260926 03:37:38.628376 3539 acceptor_pool.cc:254] collecting diagnostics on the listening RPC socket 0.0.0.0:46269 every 8 connection(s)
I20260926 03:37:38.629469 3419 rpc-test.cc:488] Connecting to 0.0.0.0:46269
[ OK ] Parameters/TestRpc.TestConnectionKeepalive/SSL_TCP (1050 ms)
[ RUN ] Parameters/TestRpc.TestClientConnectionMetrics/SSL_TCP
I20260926 03:37:39.709708 3563 acceptor_pool.cc:254] collecting diagnostics on the listening RPC socket 0.0.0.0:45261 every 8 connection(s)
I20260926 03:37:39.710088 3564 acceptor_pool.cc:254] collecting diagnostics on the listening RPC socket 0.0.0.0:45261 every 8 connection(s)
I20260926 03:37:39.711297 3419 rpc-test.cc:569] Connecting to 0.0.0.0:45261
[ OK ] Parameters/TestRpc.TestClientConnectionMetrics/SSL_TCP (23484 ms)
[ RUN ] Parameters/TestRpc.TestCredentialsPolicy/SSL_TCP
I20260926 03:38:03.190517 3586 acceptor_pool.cc:254] collecting diagnostics on the listening RPC socket 0.0.0.0:42987 every 8 connection(s)
I20260926 03:38:03.190766 3587 acceptor_pool.cc:254] collecting diagnostics on the listening RPC socket 0.0.0.0:42987 every 8 connection(s)
I20260926 03:38:03.192056 3419 rpc-test.cc:700] Connecting to 0.0.0.0:42987
[ OK ] Parameters/TestRpc.TestCredentialsPolicy/SSL_TCP (88 ms)
[ RUN ] Parameters/TestRpc.TestCallLongerThanKeepalive/SSL_TCP
I20260926 03:38:03.260525 3611 acceptor_pool.cc:254] collecting diagnostics on the listening RPC socket 0.0.0.0:44757 every 8 connection(s)
I20260926 03:38:03.260842 3612 acceptor_pool.cc:254] collecting diagnostics on the listening RPC socket 0.0.0.0:44757 every 8 connection(s)
I20260926 03:38:03.281116 3615 rpc-test-base.h:222] got call: sleep_micros: 3000000 deferred: true
I20260926 03:38:06.283268 3615 rpcz_store.cc:275] Call kudu.rpc.GenericCalculatorService.Sleep from 127.0.0.1:60290 (request call id 0) took 3002 ms. Trace:
I20260926 03:38:06.283509 3615 rpcz_store.cc:276] 0926 03:38:03.280968 (+ 0us) service_pool.cc:170] Inserting onto call queue
0926 03:38:03.281049 (+ 81us) service_pool.cc:227] Handling call
0926 03:38:06.283214 (+3002165us) inbound_call.cc:173] Queueing success response
Metrics: {}
[ OK ] Parameters/TestRpc.TestCallLongerThanKeepalive/SSL_TCP (3053 ms)
[ RUN ] Parameters/TestRpc.TestRpcSidecar/SSL_TCP
I20260926 03:38:06.320487 3636 acceptor_pool.cc:254] collecting diagnostics on the listening RPC socket 0.0.0.0:42045 every 8 connection(s)
I20260926 03:38:06.320721 3637 acceptor_pool.cc:254] collecting diagnostics on the listening RPC socket 0.0.0.0:42045 every 8 connection(s)
[ OK ] Parameters/TestRpc.TestRpcSidecar/SSL_TCP (164 ms)
[ RUN ] Parameters/TestRpc.TestRpcSidecarLimits/SSL_TCP
I20260926 03:38:09.063869 3661 acceptor_pool.cc:254] collecting diagnostics on the listening RPC socket 0.0.0.0:38291 every 8 connection(s)
I20260926 03:38:09.064119 3662 acceptor_pool.cc:254] collecting diagnostics on the listening RPC socket 0.0.0.0:38291 every 8 connection(s)
W20260926 03:38:09.074074 3419 serialization.cc:72] Serialized kudu.rpc_test.PushStringsRequestPB (2147483654 bytes) is larger than the maximum configured RPC message size (52428800 bytes). Sending anyway, but peer may reject the data.
W20260926 03:38:09.081302 3658 connection.cc:535] server connection from 127.0.0.1:55380 recv error: Network error: RPC frame had a length of 2147483714, but we only support messages up to 52428800 bytes long.
W20260926 03:38:09.081499 3658 connection.cc:158] shutting down server connection from 127.0.0.1:55380 with pending inbound data: 4/2147483714 bytes received; last active 0 ns ago: status Network error: RPC frame had a length of 2147483714, but we only support messages up to 52428800 bytes long.
W20260926 03:38:09.082096 3674 connection.cc:196] Error closing socket: Network error: TlsSocket::Close: Connection reset by peer
I20260926 03:38:09.110035 3686 acceptor_pool.cc:254] collecting diagnostics on the listening RPC socket 0.0.0.0:42957 every 8 connection(s)
I20260926 03:38:09.110308 3687 acceptor_pool.cc:254] collecting diagnostics on the listening RPC socket 0.0.0.0:42957 every 8 connection(s)
W20260926 03:38:15.583047 3683 connection.cc:577] server connection from 127.0.0.1:57858: received bad data: 'Corruption: Invalid packet: message had a length of 2147483710, but we only support messages up to 2147483647 bytes
'
[ OK ] Parameters/TestRpc.TestRpcSidecarLimits/SSL_TCP (9730 ms)
[ RUN ] Parameters/TestRpc.TestCallTimeoutDoesntAffectNegotiation/SSL_TCP
I20260926 03:38:16.214977 3711 acceptor_pool.cc:254] collecting diagnostics on the listening RPC socket 0.0.0.0:41515 every 8 connection(s)
I20260926 03:38:16.215356 3712 acceptor_pool.cc:254] collecting diagnostics on the listening RPC socket 0.0.0.0:41515 every 8 connection(s)
W20260926 03:38:16.233053 3707 negotiation.cc:266] Injecting 500ms delay in negotiation
I20260926 03:38:16.283764 3419 rpc-test-base.h:595] status: Timed out: connection negotiation to 0.0.0.0:41515 for RPC Sleep timed out after 0.050s (ON_OUTBOUND_QUEUE), seconds elapsed: 0.0515031
[ OK ] Parameters/TestRpc.TestCallTimeoutDoesntAffectNegotiation/SSL_TCP (560 ms)
[ RUN ] Parameters/TestRpc.TestRpcHandlerLatencyMetric/SSL_TCP
I20260926 03:38:16.759721 3736 acceptor_pool.cc:254] collecting diagnostics on the listening RPC socket 0.0.0.0:42027 every 8 connection(s)
I20260926 03:38:16.759990 3737 acceptor_pool.cc:254] collecting diagnostics on the listening RPC socket 0.0.0.0:42027 every 8 connection(s)
I20260926 03:38:16.800786 3419 rpc-test.cc:1236] Sleep() min lat: 20730
I20260926 03:38:16.800915 3419 rpc-test.cc:1237] Sleep() mean lat: 20730
I20260926 03:38:16.801007 3419 rpc-test.cc:1238] Sleep() max lat: 20730
I20260926 03:38:16.801048 3419 rpc-test.cc:1239] Sleep() #calls: 1
[ OK ] Parameters/TestRpc.TestRpcHandlerLatencyMetric/SSL_TCP (60 ms)
[ RUN ] Parameters/TestRpc.TimedOutOnResponseMetricServiceQueue/SSL_TCP
I20260926 03:38:16.829248 3762 acceptor_pool.cc:254] collecting diagnostics on the listening RPC socket 0.0.0.0:34695 every 8 connection(s)
I20260926 03:38:16.829504 3763 acceptor_pool.cc:254] collecting diagnostics on the listening RPC socket 0.0.0.0:34695 every 8 connection(s)
W20260926 03:38:16.916731 3764 rpcz_store.cc:267] Call kudu.rpc_test.CalculatorService.Sleep from 127.0.0.1:50070 (request call id 2) took 20 ms (client timeout 20 ms). Trace:
W20260926 03:38:16.916996 3764 rpcz_store.cc:269] 0926 03:38:16.896173 (+ 0us) service_pool.cc:170] Inserting onto call queue
0926 03:38:16.916644 (+ 20471us) service_pool.cc:214] Skipping call since client already timed out
0926 03:38:16.916707 (+ 63us) inbound_call.cc:173] Queueing failure response
Metrics: {}
[ OK ] Parameters/TestRpc.TimedOutOnResponseMetricServiceQueue/SSL_TCP (115 ms)
[ RUN ] Parameters/TestRpc.RpcPendingConnectionsMetric/SSL_TCP
I20260926 03:38:16.928418 3785 acceptor_pool.cc:254] collecting diagnostics on the listening RPC socket 0.0.0.0:36531 every 8 connection(s)
I20260926 03:38:16.928646 3786 acceptor_pool.cc:254] collecting diagnostics on the listening RPC socket 0.0.0.0:36531 every 8 connection(s)
W20260926 03:38:16.931138 3781 negotiation.cc:337] Failed RPC negotiation. Trace:
0926 03:38:16.930349 (+ 0us) reactor.cc:625] Submitting negotiation task for server connection from 127.0.0.1:54124 (local address 127.0.0.1:36531)
0926 03:38:16.930562 (+ 213us) server_negotiation.cc:206] Beginning negotiation
0926 03:38:16.930571 (+ 9us) server_negotiation.cc:399] Waiting for connection header
0926 03:38:16.930754 (+ 183us) negotiation.cc:327] Negotiation complete: Network error: Server connection negotiation failed: server connection from 127.0.0.1:54124: BlockingRecv error: recv got EOF from 127.0.0.1:54124 (error 108)
Metrics: {"server-negotiator.queue_time_us":57}
[ OK ] Parameters/TestRpc.RpcPendingConnectionsMetric/SSL_TCP (21 ms)
[ RUN ] Parameters/TestRpc.TestRpcContextClientDeadline/SSL_TCP
I20260926 03:38:16.961577 3801 acceptor_pool.cc:254] collecting diagnostics on the listening RPC socket 0.0.0.0:44043 every 8 connection(s)
I20260926 03:38:16.961874 3802 acceptor_pool.cc:254] collecting diagnostics on the listening RPC socket 0.0.0.0:44043 every 8 connection(s)
[ OK ] Parameters/TestRpc.TestRpcContextClientDeadline/SSL_TCP (66 ms)
[ RUN ] Parameters/TestRpc.TestApplicationFeatureFlagUnsupportedServer/SSL_TCP
I20260926 03:38:17.028187 3826 acceptor_pool.cc:254] collecting diagnostics on the listening RPC socket 0.0.0.0:36141 every 8 connection(s)
I20260926 03:38:17.028481 3827 acceptor_pool.cc:254] collecting diagnostics on the listening RPC socket 0.0.0.0:36141 every 8 connection(s)
[ OK ] Parameters/TestRpc.TestApplicationFeatureFlagUnsupportedServer/SSL_TCP (59 ms)
[ RUN ] Parameters/TestRpc.TestCancellationAsync/SSL_TCP
I20260926 03:38:17.085135 3851 acceptor_pool.cc:254] collecting diagnostics on the listening RPC socket 0.0.0.0:32897 every 8 connection(s)
I20260926 03:38:17.085419 3852 acceptor_pool.cc:254] collecting diagnostics on the listening RPC socket 0.0.0.0:32897 every 8 connection(s)
I20260926 03:38:17.086386 3419 rpc-test.cc:1716] Connecting to 0.0.0.0:32897
I20260926 03:38:17.128927 3419 test_util.cc:268] Using random seed: -1874914368
I20260926 03:38:17.170681 3855 rpc-test-base.h:240] got call: sleep_micros: 500 pattern: 4294967295 num_repetitions: 2097152 sidecar_idx: 0
I20260926 03:38:17.196197 3854 rpc-test-base.h:240] got call: sleep_micros: 500 pattern: 4294967295 num_repetitions: 2097152 sidecar_idx: 0
I20260926 03:38:17.227370 3855 rpc-test-base.h:240] got call: sleep_micros: 500 pattern: 4294967295 num_repetitions: 2097152 sidecar_idx: 0
I20260926 03:38:17.257820 3854 rpc-test-base.h:240] got call: sleep_micros: 500 pattern: 4294967295 num_repetitions: 2097152 sidecar_idx: 0
I20260926 03:38:17.287765 3853 rpc-test-base.h:240] got call: sleep_micros: 500 pattern: 4294967295 num_repetitions: 2097152 sidecar_idx: 0
I20260926 03:38:17.316669 3855 rpc-test-base.h:240] got call: sleep_micros: 500 pattern: 4294967295 num_repetitions: 2097152 sidecar_idx: 0
I20260926 03:38:17.351524 3853 rpc-test-base.h:240] got call: sleep_micros: 500 pattern: 4294967295 num_repetitions: 2097152 sidecar_idx: 0
W20260926 03:38:17.381978 3849 connection.cc:698] server connection from 127.0.0.1:51644 send error: Network error: failed to write to TLS socket: Broken pipe
W20260926 03:38:17.382187 3849 connection.cc:441] server connection from 127.0.0.1:51644 torn down before Call kudu.rpc.GenericCalculatorService.SleepWithSidecar from 127.0.0.1:51644 (request call id 9) could send its response
W20260926 03:38:17.382679 3849 connection.cc:196] Error closing socket: Network error: TlsSocket::Close: Success
W20260926 03:38:17.397825 3849 connection.cc:441] server connection from 127.0.0.1:51644 torn down before Call kudu.rpc.GenericCalculatorService.SleepWithSidecar from 127.0.0.1:51644 (request call id 8) could send its response
[ OK ] Parameters/TestRpc.TestCancellationAsync/SSL_TCP (330 ms)
[ RUN ] Parameters/TestRpc.TestPerformanceBySocketType/SSL_TCP
I20260926 03:38:17.420791 3876 acceptor_pool.cc:254] collecting diagnostics on the listening RPC socket 0.0.0.0:46663 every 8 connection(s)
I20260926 03:38:17.421087 3877 acceptor_pool.cc:254] collecting diagnostics on the listening RPC socket 0.0.0.0:46663 every 8 connection(s)
I20260926 03:38:17.422323 3419 rpc-test.cc:1846] Connecting to 0.0.0.0:46663
I20260926 03:38:21.110744 3419 rpc-test.cc:1859] Sending 1024MB via ssl-enabled tcp socket: real 3.674s user 3.311s sys 2.676s
I20260926 03:38:24.801867 3419 rpc-test.cc:1859] Sending 1024MB via ssl-enabled tcp socket: real 3.691s user 3.460s sys 2.577s
I20260926 03:38:28.388427 3419 rpc-test.cc:1859] Sending 1024MB via ssl-enabled tcp socket: real 3.586s user 3.129s sys 2.676s
I20260926 03:38:31.969336 3419 rpc-test.cc:1859] Sending 1024MB via ssl-enabled tcp socket: real 3.581s user 3.332s sys 2.482s
I20260926 03:38:35.526585 3419 rpc-test.cc:1859] Sending 1024MB via ssl-enabled tcp socket: real 3.557s user 3.217s sys 2.566s
[ OK ] Parameters/TestRpc.TestPerformanceBySocketType/SSL_TCP (18135 ms)
[----------] 20 tests from Parameters/TestRpc (57179 ms total)
[----------] 1 test from Parameters/TestRpcSocketTxRxQueue
[ RUN ] Parameters/TestRpcSocketTxRxQueue.OverCapacity/0
W20260926 03:38:35.841588 3920 negotiation.cc:337] Failed RPC negotiation. Trace:
0926 03:38:35.551506 (+ 0us) reactor.cc:625] Submitting negotiation task for client connection to 0.0.0.0:33883 (local address 127.0.0.1:58794)
0926 03:38:35.551760 (+ 254us) negotiation.cc:107] Waiting for socket to connect
0926 03:38:35.551778 (+ 18us) client_negotiation.cc:174] Beginning negotiation
0926 03:38:35.551893 (+ 115us) client_negotiation.cc:252] Sending NEGOTIATE NegotiatePB request
0926 03:38:35.840885 (+288992us) negotiation.cc:327] Negotiation complete: Network error: Client connection negotiation failed: client connection to 0.0.0.0:33883: BlockingRecv error: recv error from unknown peer: Transport endpoint is not connected (error 107)
Metrics: {"client-negotiator.queue_time_us":59}
W20260926 03:38:35.841801 3938 negotiation.cc:337] Failed RPC negotiation. Trace:
0926 03:38:35.558762 (+ 0us) reactor.cc:625] Submitting negotiation task for client connection to 0.0.0.0:33883 (local address 127.0.0.1:58816)
0926 03:38:35.558983 (+ 221us) negotiation.cc:107] Waiting for socket to connect
0926 03:38:35.559002 (+ 19us) client_negotiation.cc:174] Beginning negotiation
0926 03:38:35.559116 (+ 114us) client_negotiation.cc:252] Sending NEGOTIATE NegotiatePB request
0926 03:38:35.841369 (+282253us) negotiation.cc:327] Negotiation complete: Network error: Client connection negotiation failed: client connection to 0.0.0.0:33883: BlockingRecv error: recv error from unknown peer: Transport endpoint is not connected (error 107)
Metrics: {"client-negotiator.queue_time_us":62}
W20260926 03:38:35.841884 3911 negotiation.cc:337] Failed RPC negotiation. Trace:
0926 03:38:35.548655 (+ 0us) reactor.cc:625] Submitting negotiation task for client connection to 0.0.0.0:33883 (local address 127.0.0.1:58786)
0926 03:38:35.548895 (+ 240us) negotiation.cc:107] Waiting for socket to connect
0926 03:38:35.548918 (+ 23us) client_negotiation.cc:174] Beginning negotiation
0926 03:38:35.549044 (+ 126us) client_negotiation.cc:252] Sending NEGOTIATE NegotiatePB request
0926 03:38:35.840886 (+291842us) negotiation.cc:327] Negotiation complete: Network error: Client connection negotiation failed: client connection to 0.0.0.0:33883: BlockingRecv error: recv error from unknown peer: Transport endpoint is not connected (error 107)
Metrics: {"client-negotiator.queue_time_us":63}
W20260926 03:38:35.841521 3902 negotiation.cc:337] Failed RPC negotiation. Trace:
0926 03:38:35.545859 (+ 0us) reactor.cc:625] Submitting negotiation task for client connection to 0.0.0.0:33883 (local address 127.0.0.1:58784)
0926 03:38:35.546074 (+ 215us) negotiation.cc:107] Waiting for socket to connect
0926 03:38:35.546093 (+ 19us) client_negotiation.cc:174] Beginning negotiation
0926 03:38:35.546232 (+ 139us) client_negotiation.cc:252] Sending NEGOTIATE NegotiatePB request
0926 03:38:35.840980 (+294748us) negotiation.cc:327] Negotiation complete: Network error: Client connection negotiation failed: client connection to 0.0.0.0:33883: BlockingRecv error: recv error from unknown peer: Transport endpoint is not connected (error 107)
Metrics: {"client-negotiator.queue_time_us":59}
W20260926 03:38:35.842546 3929 negotiation.cc:337] Failed RPC negotiation. Trace:
0926 03:38:35.554957 (+ 0us) reactor.cc:625] Submitting negotiation task for client connection to 0.0.0.0:33883 (local address 127.0.0.1:58810)
0926 03:38:35.555168 (+ 211us) negotiation.cc:107] Waiting for socket to connect
0926 03:38:35.555186 (+ 18us) client_negotiation.cc:174] Beginning negotiation
0926 03:38:35.555304 (+ 118us) client_negotiation.cc:252] Sending NEGOTIATE NegotiatePB request
0926 03:38:35.841436 (+286132us) negotiation.cc:327] Negotiation complete: Network error: Client connection negotiation failed: client connection to 0.0.0.0:33883: BlockingRecv error: recv error from unknown peer: Transport endpoint is not connected (error 107)
Metrics: {"client-negotiator.queue_time_us":59}
W20260926 03:38:35.842885 3893 negotiation.cc:337] Failed RPC negotiation. Trace:
0926 03:38:35.542622 (+ 0us) reactor.cc:625] Submitting negotiation task for client connection to 0.0.0.0:33883 (local address 127.0.0.1:58772)
0926 03:38:35.542868 (+ 246us) negotiation.cc:107] Waiting for socket to connect
0926 03:38:35.542896 (+ 28us) client_negotiation.cc:174] Beginning negotiation
0926 03:38:35.543051 (+ 155us) client_negotiation.cc:252] Sending NEGOTIATE NegotiatePB request
0926 03:38:35.840888 (+297837us) negotiation.cc:327] Negotiation complete: Network error: Client connection negotiation failed: client connection to 0.0.0.0:33883: BlockingRecv error: recv error from unknown peer: Transport endpoint is not connected (error 107)
Metrics: {"client-negotiator.queue_time_us":69}
[ OK ] Parameters/TestRpcSocketTxRxQueue.OverCapacity/0 (1087 ms)
[----------] 1 test from Parameters/TestRpcSocketTxRxQueue (1087 ms total)
[----------] Global test environment tear-down
[==========] 21 tests from 2 test suites ran. (58267 ms total)
[ PASSED ] 20 tests.
[ FAILED ] 1 test, listed below:
[ FAILED ] Parameters/TestRpc.TestCallWithChainCertAndChainCA/SSL_TCP, where GetParam() = (true, false)
1 FAILED TEST