Diagnosed failure
Parameters/TestRpc.TestCallWithChainCertAndChainCA/SSL_UnixSocket: /data0/somelongdirectorytoavoidrpathissues/src/kudu/src/kudu/rpc/rpc-test.cc:270: Failure
Failed
Bad status: Runtime error: could not verify certificate chain (error with cert: subject=CN = localhost, ST = sadfjas, C = AS, emailAddress = sdflkdsajf, O = lskdfjlsad, OU = sldfkja, issuer=C = AS, ST = ASDfkjdhf, L = lskdjf, O = saldfja, OU = skdjf, CN = localhost, emailAddress = sadjflkadsj): : certificate has expired
Google Test trace:
/data0/somelongdirectorytoavoidrpathissues/src/kudu/src/kudu/rpc/rpc-test.cc:267: Connecting to unix:/tmp/dist-test-taskTRfD1P/test-tmp/rpc-test-9fdde8712cdb40e593eea64503d7adbb.sock
I20260929 03:05:54.978502 30398 test_util.cc:175] -----------------------------------------------
I20260929 03:05:54.978564 30398 test_util.cc:176] Had fatal failures, leaving test files at /tmp/dist-test-taskTRfD1P/test-tmp/rpc-test.6.Parameters_TestRpc.TestCallWithChainCertAndChainCA_SSL_UnixSocket.1790651154865239-30398-0
Full log
Note: This is test shard 7 of 8.
[==========] Running 21 tests from 2 test suites.
[----------] Global test environment set-up.
[----------] 20 tests from Parameters/TestRpc
[ RUN ] Parameters/TestRpc.TestMessengerCreateDestroy/SSL_UnixSocket
WARNING: Logging before InitGoogleLogging() is written to STDERR
I20260929 03:05:54.911590 30398 rpc-test.cc:169] started messenger TestCreateDestroy
[ OK ] Parameters/TestRpc.TestMessengerCreateDestroy/SSL_UnixSocket (41 ms)
[ RUN ] Parameters/TestRpc.TestNegotiationDeadlock/SSL_UnixSocket
I20260929 03:05:54.928488 30418 acceptor_pool.cc:254] collecting diagnostics on the listening RPC socket unix:/tmp/dist-test-taskTRfD1P/test-tmp/rpc-test-d2af1e4f2e7c4f119e4ccd0ba15e2123.sock every 8 connection(s)
I20260929 03:05:54.928527 30419 acceptor_pool.cc:254] collecting diagnostics on the listening RPC socket unix:/tmp/dist-test-taskTRfD1P/test-tmp/rpc-test-d2af1e4f2e7c4f119e4ccd0ba15e2123.sock every 8 connection(s)
[ OK ] Parameters/TestRpc.TestNegotiationDeadlock/SSL_UnixSocket (25 ms)
[ RUN ] Parameters/TestRpc.TestCallWithChainCertAndChainCA/SSL_UnixSocket
I20260929 03:05:54.971989 30435 acceptor_pool.cc:254] collecting diagnostics on the listening RPC socket unix:/tmp/dist-test-taskTRfD1P/test-tmp/rpc-test-9fdde8712cdb40e593eea64503d7adbb.sock every 8 connection(s)
I20260929 03:05:54.971956 30434 acceptor_pool.cc:254] collecting diagnostics on the listening RPC socket unix:/tmp/dist-test-taskTRfD1P/test-tmp/rpc-test-9fdde8712cdb40e593eea64503d7adbb.sock every 8 connection(s)
/data0/somelongdirectorytoavoidrpathissues/src/kudu/src/kudu/rpc/rpc-test.cc:270: Failure
Failed
Bad status: Runtime error: could not verify certificate chain (error with cert: subject=CN = localhost, ST = sadfjas, C = AS, emailAddress = sdflkdsajf, O = lskdfjlsad, OU = sldfkja, issuer=C = AS, ST = ASDfkjdhf, L = lskdjf, O = saldfja, OU = skdjf, CN = localhost, emailAddress = sadjflkadsj): : certificate has expired
Google Test trace:
/data0/somelongdirectorytoavoidrpathissues/src/kudu/src/kudu/rpc/rpc-test.cc:267: Connecting to unix:/tmp/dist-test-taskTRfD1P/test-tmp/rpc-test-9fdde8712cdb40e593eea64503d7adbb.sock
I20260929 03:05:54.978502 30398 test_util.cc:175] -----------------------------------------------
I20260929 03:05:54.978564 30398 test_util.cc:176] Had fatal failures, leaving test files at /tmp/dist-test-taskTRfD1P/test-tmp/rpc-test.6.Parameters_TestRpc.TestCallWithChainCertAndChainCA_SSL_UnixSocket.1790651154865239-30398-0
[ FAILED ] Parameters/TestRpc.TestCallWithChainCertAndChainCA/SSL_UnixSocket, where GetParam() = (true, true) (39 ms)
[ RUN ] Parameters/TestRpc.TestCallWithPasswordProtectedKey/SSL_UnixSocket
I20260929 03:05:54.988279 30459 acceptor_pool.cc:254] collecting diagnostics on the listening RPC socket unix:/tmp/dist-test-taskTRfD1P/test-tmp/rpc-test-0e0658658c904a96aeddf0bb9fe8efc8.sock every 8 connection(s)
I20260929 03:05:54.988294 30460 acceptor_pool.cc:254] collecting diagnostics on the listening RPC socket unix:/tmp/dist-test-taskTRfD1P/test-tmp/rpc-test-0e0658658c904a96aeddf0bb9fe8efc8.sock every 8 connection(s)
W20260929 03:05:55.002091 30456 connection.cc:196] Error closing socket: Network error: TlsSocket::Close: Broken pipe
[ OK ] Parameters/TestRpc.TestCallWithPasswordProtectedKey/SSL_UnixSocket (24 ms)
[ RUN ] Parameters/TestRpc.TestCallToBadServer/SSL_UnixSocket
I20260929 03:05:55.015338 30398 rpc-test.cc:394] Status: Network error: Client connection negotiation failed: client connection to 0.0.0.0:0: connect: Connection refused (error 111)
I20260929 03:05:55.015802 30398 rpc-test.cc:394] Status: Network error: Client connection negotiation failed: client connection to 0.0.0.0:0: connect: Connection refused (error 111)
I20260929 03:05:55.016165 30398 rpc-test.cc:394] Status: Network error: Client connection negotiation failed: client connection to 0.0.0.0:0: connect: Connection refused (error 111)
I20260929 03:05:55.016505 30398 rpc-test.cc:394] Status: Network error: Client connection negotiation failed: client connection to 0.0.0.0:0: connect: Connection refused (error 111)
I20260929 03:05:55.016835 30398 rpc-test.cc:394] Status: Network error: Client connection negotiation failed: client connection to 0.0.0.0:0: connect: Connection refused (error 111)
[ OK ] Parameters/TestRpc.TestCallToBadServer/SSL_UnixSocket (14 ms)
[ RUN ] Parameters/TestRpc.TestWrongService/SSL_UnixSocket
I20260929 03:05:55.027443 30494 acceptor_pool.cc:254] collecting diagnostics on the listening RPC socket unix:/tmp/dist-test-taskTRfD1P/test-tmp/rpc-test-53eb65fa93444654a84a3d16d1db346f.sock every 8 connection(s)
I20260929 03:05:55.027469 30495 acceptor_pool.cc:254] collecting diagnostics on the listening RPC socket unix:/tmp/dist-test-taskTRfD1P/test-tmp/rpc-test-53eb65fa93444654a84a3d16d1db346f.sock every 8 connection(s)
I20260929 03:05:55.047329 30491 messenger.cc:345] service WrongServiceName not registered on TestServer
[ OK ] Parameters/TestRpc.TestWrongService/SSL_UnixSocket (32 ms)
[ RUN ] Parameters/TestRpc.TestConnectionKeepalive/SSL_UnixSocket
I20260929 03:05:55.077651 30517 acceptor_pool.cc:254] collecting diagnostics on the listening RPC socket unix:/tmp/dist-test-taskTRfD1P/test-tmp/rpc-test-c3fed465f9d140b9817585ee71d99fe0.sock every 8 connection(s)
I20260929 03:05:55.077669 30518 acceptor_pool.cc:254] collecting diagnostics on the listening RPC socket unix:/tmp/dist-test-taskTRfD1P/test-tmp/rpc-test-c3fed465f9d140b9817585ee71d99fe0.sock every 8 connection(s)
I20260929 03:05:55.077896 30398 rpc-test.cc:488] Connecting to unix:/tmp/dist-test-taskTRfD1P/test-tmp/rpc-test-c3fed465f9d140b9817585ee71d99fe0.sock
W20260929 03:05:55.551528 30530 connection.cc:196] Error closing socket: Network error: TlsSocket::Close: Broken pipe
[ OK ] Parameters/TestRpc.TestConnectionKeepalive/SSL_UnixSocket (1066 ms)
[ RUN ] Parameters/TestRpc.TestClientConnectionMetrics/SSL_UnixSocket
I20260929 03:05:56.129599 30542 acceptor_pool.cc:254] collecting diagnostics on the listening RPC socket unix:/tmp/dist-test-taskTRfD1P/test-tmp/rpc-test-84d2f5468c4c4442a3d72311c5cbf94e.sock every 8 connection(s)
I20260929 03:05:56.129729 30543 acceptor_pool.cc:254] collecting diagnostics on the listening RPC socket unix:/tmp/dist-test-taskTRfD1P/test-tmp/rpc-test-84d2f5468c4c4442a3d72311c5cbf94e.sock every 8 connection(s)
I20260929 03:05:56.129908 30398 rpc-test.cc:569] Connecting to unix:/tmp/dist-test-taskTRfD1P/test-tmp/rpc-test-84d2f5468c4c4442a3d72311c5cbf94e.sock
[ OK ] Parameters/TestRpc.TestClientConnectionMetrics/SSL_UnixSocket (10413 ms)
[ RUN ] Parameters/TestRpc.TestCredentialsPolicy/SSL_UnixSocket
I20260929 03:06:06.539525 30565 acceptor_pool.cc:254] collecting diagnostics on the listening RPC socket unix:/tmp/dist-test-taskTRfD1P/test-tmp/rpc-test-3485ea2db1d346149c246ccb097249de.sock every 8 connection(s)
I20260929 03:06:06.539583 30566 acceptor_pool.cc:254] collecting diagnostics on the listening RPC socket unix:/tmp/dist-test-taskTRfD1P/test-tmp/rpc-test-3485ea2db1d346149c246ccb097249de.sock every 8 connection(s)
I20260929 03:06:06.539853 30398 rpc-test.cc:700] Connecting to unix:/tmp/dist-test-taskTRfD1P/test-tmp/rpc-test-3485ea2db1d346149c246ccb097249de.sock
W20260929 03:06:06.567314 30564 connection.cc:196] Error closing socket: Network error: TlsSocket::Close: Broken pipe
W20260929 03:06:06.572029 30564 connection.cc:196] Error closing socket: Network error: TlsSocket::Close: Broken pipe
[ OK ] Parameters/TestRpc.TestCredentialsPolicy/SSL_UnixSocket (43 ms)
[ RUN ] Parameters/TestRpc.TestCallLongerThanKeepalive/SSL_UnixSocket
I20260929 03:06:06.580791 30590 acceptor_pool.cc:254] collecting diagnostics on the listening RPC socket unix:/tmp/dist-test-taskTRfD1P/test-tmp/rpc-test-4689d6d8844b4e8f89b943317ba1b65f.sock every 8 connection(s)
I20260929 03:06:06.580835 30591 acceptor_pool.cc:254] collecting diagnostics on the listening RPC socket unix:/tmp/dist-test-taskTRfD1P/test-tmp/rpc-test-4689d6d8844b4e8f89b943317ba1b65f.sock every 8 connection(s)
I20260929 03:06:06.596434 30594 rpc-test-base.h:222] got call: sleep_micros: 3000000 deferred: true
I20260929 03:06:09.597285 30594 rpcz_store.cc:275] Call kudu.rpc.GenericCalculatorService.Sleep from unix:<unnamed> (request call id 0) took 3000 ms. Trace:
I20260929 03:06:09.597414 30594 rpcz_store.cc:276] 0929 03:06:06.596326 (+ 0us) service_pool.cc:170] Inserting onto call queue
0929 03:06:06.596408 (+ 82us) service_pool.cc:227] Handling call
0929 03:06:09.597264 (+3000856us) inbound_call.cc:173] Queueing success response
Metrics: {}
[ OK ] Parameters/TestRpc.TestCallLongerThanKeepalive/SSL_UnixSocket (3027 ms)
[ RUN ] Parameters/TestRpc.TestRpcSidecar/SSL_UnixSocket
I20260929 03:06:09.624066 30615 acceptor_pool.cc:254] collecting diagnostics on the listening RPC socket unix:/tmp/dist-test-taskTRfD1P/test-tmp/rpc-test-95846970d3f14a31a2128e2e1ff8a005.sock every 8 connection(s)
I20260929 03:06:09.624095 30616 acceptor_pool.cc:254] collecting diagnostics on the listening RPC socket unix:/tmp/dist-test-taskTRfD1P/test-tmp/rpc-test-95846970d3f14a31a2128e2e1ff8a005.sock every 8 connection(s)
W20260929 03:06:09.675949 30612 connection.cc:196] Error closing socket: Network error: TlsSocket::Close: Broken pipe
[ OK ] Parameters/TestRpc.TestRpcSidecar/SSL_UnixSocket (76 ms)
[ RUN ] Parameters/TestRpc.TestRpcSidecarLimits/SSL_UnixSocket
I20260929 03:06:11.325551 30640 acceptor_pool.cc:254] collecting diagnostics on the listening RPC socket unix:/tmp/dist-test-taskTRfD1P/test-tmp/rpc-test-5138ae68ff834c44b705b7fb2a11d74f.sock every 8 connection(s)
I20260929 03:06:11.325599 30641 acceptor_pool.cc:254] collecting diagnostics on the listening RPC socket unix:/tmp/dist-test-taskTRfD1P/test-tmp/rpc-test-5138ae68ff834c44b705b7fb2a11d74f.sock every 8 connection(s)
W20260929 03:06:11.340360 30398 serialization.cc:72] Serialized kudu.rpc_test.PushStringsRequestPB (2147483654 bytes) is larger than the maximum configured RPC message size (52428800 bytes). Sending anyway, but peer may reject the data.
W20260929 03:06:11.344215 30637 connection.cc:535] server connection from unix:<unnamed> recv error: Network error: RPC frame had a length of 2147483714, but we only support messages up to 52428800 bytes long.
W20260929 03:06:11.344301 30637 connection.cc:158] shutting down server connection from unix:<unnamed> with pending inbound data: 4/2147483714 bytes received; last active 0 ns ago: status Network error: RPC frame had a length of 2147483714, but we only support messages up to 52428800 bytes long.
W20260929 03:06:11.344548 30653 connection.cc:196] Error closing socket: Network error: TlsSocket::Close: Broken pipe
I20260929 03:06:11.365711 30665 acceptor_pool.cc:254] collecting diagnostics on the listening RPC socket unix:/tmp/dist-test-taskTRfD1P/test-tmp/rpc-test-5138ae68ff834c44b705b7fb2a11d74f.sock every 8 connection(s)
I20260929 03:06:11.365782 30666 acceptor_pool.cc:254] collecting diagnostics on the listening RPC socket unix:/tmp/dist-test-taskTRfD1P/test-tmp/rpc-test-5138ae68ff834c44b705b7fb2a11d74f.sock every 8 connection(s)
W20260929 03:06:16.186419 30662 connection.cc:577] server connection from unix:<unnamed>: received bad data: 'Corruption: Invalid packet: message had a length of 2147483710, but we only support messages up to 2147483647 bytes
'
W20260929 03:06:16.186756 30678 connection.cc:196] Error closing socket: Network error: TlsSocket::Close: Broken pipe
[ OK ] Parameters/TestRpc.TestRpcSidecarLimits/SSL_UnixSocket (6511 ms)
[ RUN ] Parameters/TestRpc.TestCallTimeoutDoesntAffectNegotiation/SSL_UnixSocket
I20260929 03:06:16.201639 30690 acceptor_pool.cc:254] collecting diagnostics on the listening RPC socket unix:/tmp/dist-test-taskTRfD1P/test-tmp/rpc-test-24bce256dc304f6fb60609962a6f5a10.sock every 8 connection(s)
I20260929 03:06:16.201694 30691 acceptor_pool.cc:254] collecting diagnostics on the listening RPC socket unix:/tmp/dist-test-taskTRfD1P/test-tmp/rpc-test-24bce256dc304f6fb60609962a6f5a10.sock every 8 connection(s)
W20260929 03:06:16.206815 30684 negotiation.cc:266] Injecting 500ms delay in negotiation
I20260929 03:06:16.257136 30398 rpc-test-base.h:595] status: Timed out: connection negotiation to unix:/tmp/dist-test-taskTRfD1P/test-tmp/rpc-test-24bce256dc304f6fb60609962a6f5a10.sock for RPC Sleep timed out after 0.050s (ON_OUTBOUND_QUEUE), seconds elapsed: 0.0506523
W20260929 03:06:16.711280 30687 connection.cc:196] Error closing socket: Network error: TlsSocket::Close: Broken pipe
[ OK ] Parameters/TestRpc.TestCallTimeoutDoesntAffectNegotiation/SSL_UnixSocket (523 ms)
[ RUN ] Parameters/TestRpc.TestRpcHandlerLatencyMetric/SSL_UnixSocket
I20260929 03:06:16.737207 30715 acceptor_pool.cc:254] collecting diagnostics on the listening RPC socket unix:/tmp/dist-test-taskTRfD1P/test-tmp/rpc-test-c2fb8ffea8684f53987b43b03c34b9bd.sock every 8 connection(s)
I20260929 03:06:16.737231 30716 acceptor_pool.cc:254] collecting diagnostics on the listening RPC socket unix:/tmp/dist-test-taskTRfD1P/test-tmp/rpc-test-c2fb8ffea8684f53987b43b03c34b9bd.sock every 8 connection(s)
I20260929 03:06:16.778080 30398 rpc-test.cc:1236] Sleep() min lat: 20430
I20260929 03:06:16.778149 30398 rpc-test.cc:1237] Sleep() mean lat: 20430
I20260929 03:06:16.778177 30398 rpc-test.cc:1238] Sleep() max lat: 20430
I20260929 03:06:16.778188 30398 rpc-test.cc:1239] Sleep() #calls: 1
[ OK ] Parameters/TestRpc.TestRpcHandlerLatencyMetric/SSL_UnixSocket (67 ms)
[ RUN ] Parameters/TestRpc.TimedOutOnResponseMetricServiceQueue/SSL_UnixSocket
I20260929 03:06:16.788707 30741 acceptor_pool.cc:254] collecting diagnostics on the listening RPC socket unix:/tmp/dist-test-taskTRfD1P/test-tmp/rpc-test-d9edac4778b44320bad85ed2868b93a5.sock every 8 connection(s)
I20260929 03:06:16.788724 30742 acceptor_pool.cc:254] collecting diagnostics on the listening RPC socket unix:/tmp/dist-test-taskTRfD1P/test-tmp/rpc-test-d9edac4778b44320bad85ed2868b93a5.sock every 8 connection(s)
W20260929 03:06:16.844471 30743 rpcz_store.cc:267] Call kudu.rpc_test.CalculatorService.Sleep from unix:<unnamed> (request call id 2) took 20 ms (client timeout 20 ms). Trace:
W20260929 03:06:16.844563 30743 rpcz_store.cc:269] 0929 03:06:16.824095 (+ 0us) service_pool.cc:170] Inserting onto call queue
0929 03:06:16.844429 (+ 20334us) service_pool.cc:214] Skipping call since client already timed out
0929 03:06:16.844456 (+ 27us) inbound_call.cc:173] Queueing failure response
Metrics: {}
W20260929 03:06:16.845450 30738 connection.cc:196] Error closing socket: Network error: TlsSocket::Close: Broken pipe
[ OK ] Parameters/TestRpc.TimedOutOnResponseMetricServiceQueue/SSL_UnixSocket (66 ms)
[ RUN ] Parameters/TestRpc.RpcPendingConnectionsMetric/SSL_UnixSocket
I20260929 03:06:16.848407 30764 acceptor_pool.cc:254] collecting diagnostics on the listening RPC socket 0.0.0.0:42431 every 8 connection(s)
I20260929 03:06:16.848443 30765 acceptor_pool.cc:254] collecting diagnostics on the listening RPC socket 0.0.0.0:42431 every 8 connection(s)
W20260929 03:06:16.849400 30760 negotiation.cc:337] Failed RPC negotiation. Trace:
0929 03:06:16.849011 (+ 0us) reactor.cc:625] Submitting negotiation task for server connection from 127.0.0.1:57530 (local address 127.0.0.1:42431)
0929 03:06:16.849101 (+ 90us) server_negotiation.cc:206] Beginning negotiation
0929 03:06:16.849104 (+ 3us) server_negotiation.cc:399] Waiting for connection header
0929 03:06:16.849208 (+ 104us) negotiation.cc:327] Negotiation complete: Network error: Server connection negotiation failed: server connection from 127.0.0.1:57530: BlockingRecv error: recv got EOF from 127.0.0.1:57530 (error 108)
Metrics: {"server-negotiator.queue_time_us":28}
[ OK ] Parameters/TestRpc.RpcPendingConnectionsMetric/SSL_UnixSocket (13 ms)
[ RUN ] Parameters/TestRpc.TestRpcContextClientDeadline/SSL_UnixSocket
I20260929 03:06:16.866012 30780 acceptor_pool.cc:254] collecting diagnostics on the listening RPC socket unix:/tmp/dist-test-taskTRfD1P/test-tmp/rpc-test-1a1f2b36b90a458c923a19f0361cfc5d.sock every 8 connection(s)
I20260929 03:06:16.866080 30781 acceptor_pool.cc:254] collecting diagnostics on the listening RPC socket unix:/tmp/dist-test-taskTRfD1P/test-tmp/rpc-test-1a1f2b36b90a458c923a19f0361cfc5d.sock every 8 connection(s)
[ OK ] Parameters/TestRpc.TestRpcContextClientDeadline/SSL_UnixSocket (45 ms)
[ RUN ] Parameters/TestRpc.TestApplicationFeatureFlagUnsupportedServer/SSL_UnixSocket
I20260929 03:06:16.925096 30805 acceptor_pool.cc:254] collecting diagnostics on the listening RPC socket unix:/tmp/dist-test-taskTRfD1P/test-tmp/rpc-test-a8fc7c2dfe044873bc2009c45eadcbec.sock every 8 connection(s)
I20260929 03:06:16.925117 30806 acceptor_pool.cc:254] collecting diagnostics on the listening RPC socket unix:/tmp/dist-test-taskTRfD1P/test-tmp/rpc-test-a8fc7c2dfe044873bc2009c45eadcbec.sock every 8 connection(s)
W20260929 03:06:16.948817 30802 connection.cc:196] Error closing socket: Network error: TlsSocket::Close: Broken pipe
[ OK ] Parameters/TestRpc.TestApplicationFeatureFlagUnsupportedServer/SSL_UnixSocket (43 ms)
[ RUN ] Parameters/TestRpc.TestCancellationAsync/SSL_UnixSocket
I20260929 03:06:16.974783 30830 acceptor_pool.cc:254] collecting diagnostics on the listening RPC socket unix:/tmp/dist-test-taskTRfD1P/test-tmp/rpc-test-48cf9d6e6b1547b4b06eb98c3d3ef24a.sock every 8 connection(s)
I20260929 03:06:16.974786 30831 acceptor_pool.cc:254] collecting diagnostics on the listening RPC socket unix:/tmp/dist-test-taskTRfD1P/test-tmp/rpc-test-48cf9d6e6b1547b4b06eb98c3d3ef24a.sock every 8 connection(s)
I20260929 03:06:16.975066 30398 rpc-test.cc:1716] Connecting to unix:/tmp/dist-test-taskTRfD1P/test-tmp/rpc-test-48cf9d6e6b1547b4b06eb98c3d3ef24a.sock
I20260929 03:06:16.981671 30398 test_util.cc:268] Using random seed: 2001867941
I20260929 03:06:16.998960 30834 rpc-test-base.h:240] got call: sleep_micros: 500 pattern: 4294967295 num_repetitions: 2097152 sidecar_idx: 0
I20260929 03:06:17.018491 30833 rpc-test-base.h:240] got call: sleep_micros: 500 pattern: 4294967295 num_repetitions: 2097152 sidecar_idx: 0
I20260929 03:06:17.033471 30834 rpc-test-base.h:240] got call: sleep_micros: 500 pattern: 4294967295 num_repetitions: 2097152 sidecar_idx: 0
I20260929 03:06:17.048789 30833 rpc-test-base.h:240] got call: sleep_micros: 500 pattern: 4294967295 num_repetitions: 2097152 sidecar_idx: 0
I20260929 03:06:17.063766 30834 rpc-test-base.h:240] got call: sleep_micros: 500 pattern: 4294967295 num_repetitions: 2097152 sidecar_idx: 0
I20260929 03:06:17.078828 30833 rpc-test-base.h:240] got call: sleep_micros: 500 pattern: 4294967295 num_repetitions: 2097152 sidecar_idx: 0
I20260929 03:06:17.093780 30834 rpc-test-base.h:240] got call: sleep_micros: 500 pattern: 4294967295 num_repetitions: 2097152 sidecar_idx: 0
I20260929 03:06:17.108171 30832 rpc-test-base.h:240] got call: sleep_micros: 500 pattern: 4294967295 num_repetitions: 2097152 sidecar_idx: 0
W20260929 03:06:17.109750 30827 connection.cc:196] Error closing socket: Network error: TlsSocket::Close: Broken pipe
W20260929 03:06:17.124490 30827 connection.cc:441] server connection from unix:<unnamed> torn down before Call kudu.rpc.GenericCalculatorService.SleepWithSidecar from unix:<unnamed> (request call id 8) could send its response
W20260929 03:06:17.132304 30827 connection.cc:441] server connection from unix:<unnamed> torn down before Call kudu.rpc.GenericCalculatorService.SleepWithSidecar from unix:<unnamed> (request call id 9) could send its response
[ OK ] Parameters/TestRpc.TestCancellationAsync/SSL_UnixSocket (183 ms)
[ RUN ] Parameters/TestRpc.TestPerformanceBySocketType/SSL_UnixSocket
I20260929 03:06:17.144953 30855 acceptor_pool.cc:254] collecting diagnostics on the listening RPC socket unix:/tmp/dist-test-taskTRfD1P/test-tmp/rpc-test-7bd6b8cd95304d3f884441c792a5d2c2.sock every 8 connection(s)
I20260929 03:06:17.144984 30856 acceptor_pool.cc:254] collecting diagnostics on the listening RPC socket unix:/tmp/dist-test-taskTRfD1P/test-tmp/rpc-test-7bd6b8cd95304d3f884441c792a5d2c2.sock every 8 connection(s)
I20260929 03:06:17.145228 30398 rpc-test.cc:1846] Connecting to unix:/tmp/dist-test-taskTRfD1P/test-tmp/rpc-test-7bd6b8cd95304d3f884441c792a5d2c2.sock
I20260929 03:06:18.708655 30398 rpc-test.cc:1859] Sending 1024MB via ssl-enabled unix socket: real 1.525s user 1.918s sys 0.832s
I20260929 03:06:20.260121 30398 rpc-test.cc:1859] Sending 1024MB via ssl-enabled unix socket: real 1.551s user 1.975s sys 0.817s
I20260929 03:06:21.767812 30398 rpc-test.cc:1859] Sending 1024MB via ssl-enabled unix socket: real 1.508s user 2.025s sys 0.682s
I20260929 03:06:23.283390 30398 rpc-test.cc:1859] Sending 1024MB via ssl-enabled unix socket: real 1.515s user 1.920s sys 0.815s
I20260929 03:06:24.856990 30398 rpc-test.cc:1859] Sending 1024MB via ssl-enabled unix socket: real 1.573s user 2.036s sys 0.814s
W20260929 03:06:24.857746 30852 connection.cc:196] Error closing socket: Network error: TlsSocket::Close: Broken pipe
[ OK ] Parameters/TestRpc.TestPerformanceBySocketType/SSL_UnixSocket (7725 ms)
[----------] 20 tests from Parameters/TestRpc (29987 ms total)
[----------] 1 test from Parameters/TestRpcSocketTxRxQueue
[ RUN ] Parameters/TestRpcSocketTxRxQueue.AcceptorRxQueueSizeMetric/0
I20260929 03:06:24.861239 30880 acceptor_pool.cc:254] collecting diagnostics on the listening RPC socket 0.0.0.0:35131 every 1 connection(s)
I20260929 03:06:24.861275 30881 acceptor_pool.cc:254] collecting diagnostics on the listening RPC socket 0.0.0.0:35131 every 1 connection(s)
W20260929 03:06:24.862052 30876 negotiation.cc:337] Failed RPC negotiation. Trace:
0929 03:06:24.861810 (+ 0us) reactor.cc:625] Submitting negotiation task for server connection from 127.0.0.1:52582 (local address 127.0.0.1:35131)
0929 03:06:24.861897 (+ 87us) server_negotiation.cc:206] Beginning negotiation
0929 03:06:24.861901 (+ 4us) server_negotiation.cc:399] Waiting for connection header
0929 03:06:24.861982 (+ 81us) negotiation.cc:327] Negotiation complete: Network error: Server connection negotiation failed: server connection from 127.0.0.1:52582: BlockingRecv error: recv got EOF from 127.0.0.1:52582 (error 108)
Metrics: {"server-negotiator.queue_time_us":22}
[ OK ] Parameters/TestRpcSocketTxRxQueue.AcceptorRxQueueSizeMetric/0 (4 ms)
[----------] 1 test from Parameters/TestRpcSocketTxRxQueue (4 ms total)
[----------] Global test environment tear-down
[==========] 21 tests from 2 test suites ran. (29992 ms total)
[ PASSED ] 20 tests.
[ FAILED ] 1 test, listed below:
[ FAILED ] Parameters/TestRpc.TestCallWithChainCertAndChainCA/SSL_UnixSocket, where GetParam() = (true, true)
1 FAILED TEST