Diagnosed failure

Parameters/TestRpc.TestCallWithChainCertAndChainCA/SSL_TCP: /data0/somelongdirectorytoavoidrpathissues/src/kudu/src/kudu/rpc/rpc-test.cc:270: Failure
Failed
Bad status: Runtime error: could not verify certificate chain (error with cert: subject=CN = localhost, ST = sadfjas, C = AS, emailAddress = sdflkdsajf, O = lskdfjlsad, OU = sldfkja, issuer=C = AS, ST = ASDfkjdhf, L = lskdjf, O = saldfja, OU = skdjf, CN = localhost, emailAddress = sadjflkadsj): : certificate has expired
Google Test trace:
/data0/somelongdirectorytoavoidrpathissues/src/kudu/src/kudu/rpc/rpc-test.cc:267: Connecting to 0.0.0.0:36141
I20260925 03:07:05.750700  8992 test_util.cc:175] -----------------------------------------------
I20260925 03:07:05.750861  8992 test_util.cc:176] Had fatal failures, leaving test files at /tmp/dist-test-taskgSkAEs/test-tmp/rpc-test.5.Parameters_TestRpc.TestCallWithChainCertAndChainCA_SSL_TCP.1790305624401030-8992-0

Full log

Note: This is test shard 6 of 8.
[==========] Running 21 tests from 2 test suites.
[----------] Global test environment set-up.
[----------] 20 tests from Parameters/TestRpc
[ RUN      ] Parameters/TestRpc.TestMessengerCreateDestroy/SSL_TCP
WARNING: Logging before InitGoogleLogging() is written to STDERR
I20260925 03:07:04.505040  8992 rpc-test.cc:169] started messenger TestCreateDestroy
[       OK ] Parameters/TestRpc.TestMessengerCreateDestroy/SSL_TCP (1171 ms)
[ RUN      ] Parameters/TestRpc.TestNegotiationDeadlock/SSL_TCP
I20260925 03:07:05.646240  9014 acceptor_pool.cc:254] collecting diagnostics on the listening RPC socket 0.0.0.0:32831 every 8 connection(s)
I20260925 03:07:05.647815  9015 acceptor_pool.cc:254] collecting diagnostics on the listening RPC socket 0.0.0.0:32831 every 8 connection(s)
[       OK ] Parameters/TestRpc.TestNegotiationDeadlock/SSL_TCP (72 ms)
[ RUN      ] Parameters/TestRpc.TestCallWithChainCertAndChainCA/SSL_TCP
I20260925 03:07:05.721737  9030 acceptor_pool.cc:254] collecting diagnostics on the listening RPC socket 0.0.0.0:36141 every 8 connection(s)
I20260925 03:07:05.724038  9031 acceptor_pool.cc:254] collecting diagnostics on the listening RPC socket 0.0.0.0:36141 every 8 connection(s)
/data0/somelongdirectorytoavoidrpathissues/src/kudu/src/kudu/rpc/rpc-test.cc:270: Failure
Failed
Bad status: Runtime error: could not verify certificate chain (error with cert: subject=CN = localhost, ST = sadfjas, C = AS, emailAddress = sdflkdsajf, O = lskdfjlsad, OU = sldfkja, issuer=C = AS, ST = ASDfkjdhf, L = lskdjf, O = saldfja, OU = skdjf, CN = localhost, emailAddress = sadjflkadsj): : certificate has expired
Google Test trace:
/data0/somelongdirectorytoavoidrpathissues/src/kudu/src/kudu/rpc/rpc-test.cc:267: Connecting to 0.0.0.0:36141
I20260925 03:07:05.750700  8992 test_util.cc:175] -----------------------------------------------
I20260925 03:07:05.750861  8992 test_util.cc:176] Had fatal failures, leaving test files at /tmp/dist-test-taskgSkAEs/test-tmp/rpc-test.5.Parameters_TestRpc.TestCallWithChainCertAndChainCA_SSL_TCP.1790305624401030-8992-0
[  FAILED  ] Parameters/TestRpc.TestCallWithChainCertAndChainCA/SSL_TCP, where GetParam() = (true, false) (53 ms)
[ RUN      ] Parameters/TestRpc.TestCallWithPasswordProtectedKey/SSL_TCP
I20260925 03:07:05.773598  9056 acceptor_pool.cc:254] collecting diagnostics on the listening RPC socket 0.0.0.0:39639 every 8 connection(s)
I20260925 03:07:05.774326  9057 acceptor_pool.cc:254] collecting diagnostics on the listening RPC socket 0.0.0.0:39639 every 8 connection(s)
[       OK ] Parameters/TestRpc.TestCallWithPasswordProtectedKey/SSL_TCP (72 ms)
[ RUN      ] Parameters/TestRpc.TestCallToBadServer/SSL_TCP
I20260925 03:07:05.845903  8992 rpc-test.cc:394] Status: Network error: Client connection negotiation failed: client connection to 0.0.0.0:0: connect: Connection refused (error 111)
I20260925 03:07:05.847093  8992 rpc-test.cc:394] Status: Network error: Client connection negotiation failed: client connection to 0.0.0.0:0: connect: Connection refused (error 111)
I20260925 03:07:05.848255  8992 rpc-test.cc:394] Status: Network error: Client connection negotiation failed: client connection to 0.0.0.0:0: connect: Connection refused (error 111)
I20260925 03:07:05.849509  8992 rpc-test.cc:394] Status: Network error: Client connection negotiation failed: client connection to 0.0.0.0:0: connect: Connection refused (error 111)
I20260925 03:07:05.850736  8992 rpc-test.cc:394] Status: Network error: Client connection negotiation failed: client connection to 0.0.0.0:0: connect: Connection refused (error 111)
[       OK ] Parameters/TestRpc.TestCallToBadServer/SSL_TCP (30 ms)
[ RUN      ] Parameters/TestRpc.TestWrongService/SSL_TCP
I20260925 03:07:05.879756  9091 acceptor_pool.cc:254] collecting diagnostics on the listening RPC socket 0.0.0.0:41753 every 8 connection(s)
I20260925 03:07:05.880790  9092 acceptor_pool.cc:254] collecting diagnostics on the listening RPC socket 0.0.0.0:41753 every 8 connection(s)
I20260925 03:07:05.908241  9090 messenger.cc:345] service WrongServiceName not registered on TestServer
[       OK ] Parameters/TestRpc.TestWrongService/SSL_TCP (62 ms)
[ RUN      ] Parameters/TestRpc.TestConnectionKeepalive/SSL_TCP
I20260925 03:07:05.938937  9114 acceptor_pool.cc:254] collecting diagnostics on the listening RPC socket 0.0.0.0:45013 every 8 connection(s)
I20260925 03:07:05.939699  9115 acceptor_pool.cc:254] collecting diagnostics on the listening RPC socket 0.0.0.0:45013 every 8 connection(s)
I20260925 03:07:05.942796  8992 rpc-test.cc:488] Connecting to 0.0.0.0:45013
[       OK ] Parameters/TestRpc.TestConnectionKeepalive/SSL_TCP (1070 ms)
[ RUN      ] Parameters/TestRpc.TestClientConnectionMetrics/SSL_TCP
I20260925 03:07:07.006598  9140 acceptor_pool.cc:254] collecting diagnostics on the listening RPC socket 0.0.0.0:42187 every 8 connection(s)
I20260925 03:07:07.007354  9141 acceptor_pool.cc:254] collecting diagnostics on the listening RPC socket 0.0.0.0:42187 every 8 connection(s)
I20260925 03:07:07.010485  8992 rpc-test.cc:569] Connecting to 0.0.0.0:42187
[       OK ] Parameters/TestRpc.TestClientConnectionMetrics/SSL_TCP (114957 ms)
[ RUN      ] Parameters/TestRpc.TestCredentialsPolicy/SSL_TCP
I20260925 03:09:01.977939  9176 acceptor_pool.cc:254] collecting diagnostics on the listening RPC socket 0.0.0.0:41395 every 8 connection(s)
I20260925 03:09:01.978758  9177 acceptor_pool.cc:254] collecting diagnostics on the listening RPC socket 0.0.0.0:41395 every 8 connection(s)
I20260925 03:09:01.982060  8992 rpc-test.cc:700] Connecting to 0.0.0.0:41395
[       OK ] Parameters/TestRpc.TestCredentialsPolicy/SSL_TCP (105 ms)
[ RUN      ] Parameters/TestRpc.TestCallLongerThanKeepalive/SSL_TCP
I20260925 03:09:02.063814  9201 acceptor_pool.cc:254] collecting diagnostics on the listening RPC socket 0.0.0.0:37665 every 8 connection(s)
I20260925 03:09:02.064563  9202 acceptor_pool.cc:254] collecting diagnostics on the listening RPC socket 0.0.0.0:37665 every 8 connection(s)
I20260925 03:09:02.090509  9205 rpc-test-base.h:222] got call: sleep_micros: 3000000 deferred: true
I20260925 03:09:05.095063  9205 rpcz_store.cc:275] Call kudu.rpc.GenericCalculatorService.Sleep from 127.0.0.1:38990 (request call id 0) took 3004 ms. Trace:
I20260925 03:09:05.095489  9205 rpcz_store.cc:276] 0925 03:09:02.090249 (+     0us) service_pool.cc:170] Inserting onto call queue
0925 03:09:02.090356 (+   107us) service_pool.cc:227] Handling call
0925 03:09:05.094886 (+3004530us) inbound_call.cc:173] Queueing success response
Metrics: {}
[       OK ] Parameters/TestRpc.TestCallLongerThanKeepalive/SSL_TCP (3058 ms)
[ RUN      ] Parameters/TestRpc.TestRpcSidecar/SSL_TCP
I20260925 03:09:05.163323  9228 acceptor_pool.cc:254] collecting diagnostics on the listening RPC socket 0.0.0.0:37067 every 8 connection(s)
I20260925 03:09:05.164198  9229 acceptor_pool.cc:254] collecting diagnostics on the listening RPC socket 0.0.0.0:37067 every 8 connection(s)
[       OK ] Parameters/TestRpc.TestRpcSidecar/SSL_TCP (549 ms)
[ RUN      ] Parameters/TestRpc.TestRpcSidecarLimits/SSL_TCP
I20260925 03:09:26.339125  9256 acceptor_pool.cc:254] collecting diagnostics on the listening RPC socket 0.0.0.0:39147 every 8 connection(s)
I20260925 03:09:26.339910  9257 acceptor_pool.cc:254] collecting diagnostics on the listening RPC socket 0.0.0.0:39147 every 8 connection(s)
W20260925 03:09:26.368672  8992 serialization.cc:72] Serialized kudu.rpc_test.PushStringsRequestPB (2147483654 bytes) is larger than the maximum configured RPC message size (52428800 bytes). Sending anyway, but peer may reject the data.
W20260925 03:09:26.378978  9253 connection.cc:535] server connection from 127.0.0.1:36784 recv error: Network error: RPC frame had a length of 2147483714, but we only support messages up to 52428800 bytes long.
W20260925 03:09:26.379266  9253 connection.cc:158] shutting down server connection from 127.0.0.1:36784 with pending inbound data: 4/2147483714 bytes received; last active 0 ns ago: status Network error: RPC frame had a length of 2147483714, but we only support messages up to 52428800 bytes long.
W20260925 03:09:26.380128  9269 connection.cc:698] client connection to 0.0.0.0:39147 send error: Network error: failed to write to TLS socket: Connection reset by peer
W20260925 03:09:26.380834  9269 connection.cc:196] Error closing socket: Network error: TlsSocket::Close: Success
[       OK ] Parameters/TestRpc.TestRpcSidecarLimits/SSL_TCP (21351 ms)
[ RUN      ] Parameters/TestRpc.TestCallTimeoutDoesntAffectNegotiation/SSL_TCP
I20260925 03:09:27.025933  9281 acceptor_pool.cc:254] collecting diagnostics on the listening RPC socket 0.0.0.0:36477 every 8 connection(s)
I20260925 03:09:27.026645  9282 acceptor_pool.cc:254] collecting diagnostics on the listening RPC socket 0.0.0.0:36477 every 8 connection(s)
W20260925 03:09:27.049998  9277 negotiation.cc:266] Injecting 500ms delay in negotiation
I20260925 03:09:27.099650  8992 rpc-test-base.h:595] status: Timed out: connection negotiation to 0.0.0.0:36477 for RPC Sleep timed out after 0.050s (ON_OUTBOUND_QUEUE), seconds elapsed: 0.0505913
[       OK ] Parameters/TestRpc.TestCallTimeoutDoesntAffectNegotiation/SSL_TCP (555 ms)
[ RUN      ] Parameters/TestRpc.TestRpcHandlerLatencyMetric/SSL_TCP
I20260925 03:09:27.591681  9306 acceptor_pool.cc:254] collecting diagnostics on the listening RPC socket 0.0.0.0:38783 every 8 connection(s)
I20260925 03:09:27.592460  9307 acceptor_pool.cc:254] collecting diagnostics on the listening RPC socket 0.0.0.0:38783 every 8 connection(s)
I20260925 03:09:27.642480  8992 rpc-test.cc:1236] Sleep() min lat: 21570
I20260925 03:09:27.642653  8992 rpc-test.cc:1237] Sleep() mean lat: 21570
I20260925 03:09:27.642793  8992 rpc-test.cc:1238] Sleep() max lat: 21570
I20260925 03:09:27.642900  8992 rpc-test.cc:1239] Sleep() #calls: 1
[       OK ] Parameters/TestRpc.TestRpcHandlerLatencyMetric/SSL_TCP (83 ms)
[ RUN      ] Parameters/TestRpc.TimedOutOnResponseMetricServiceQueue/SSL_TCP
I20260925 03:09:27.666522  9334 acceptor_pool.cc:254] collecting diagnostics on the listening RPC socket 0.0.0.0:41785 every 8 connection(s)
I20260925 03:09:27.667244  9335 acceptor_pool.cc:254] collecting diagnostics on the listening RPC socket 0.0.0.0:41785 every 8 connection(s)
W20260925 03:09:27.739499  9336 rpcz_store.cc:267] Call kudu.rpc_test.CalculatorService.Sleep from 127.0.0.1:43510 (request call id 2) took 20 ms (client timeout 20 ms). Trace:
W20260925 03:09:27.739874  9336 rpcz_store.cc:269] 0925 03:09:27.718910 (+     0us) service_pool.cc:170] Inserting onto call queue
0925 03:09:27.739304 (+ 20394us) service_pool.cc:214] Skipping call since client already timed out
0925 03:09:27.739429 (+   125us) inbound_call.cc:173] Queueing failure response
Metrics: {}
[       OK ] Parameters/TestRpc.TimedOutOnResponseMetricServiceQueue/SSL_TCP (96 ms)
[ RUN      ] Parameters/TestRpc.RpcPendingConnectionsMetric/SSL_TCP
I20260925 03:09:27.756021  9357 acceptor_pool.cc:254] collecting diagnostics on the listening RPC socket 0.0.0.0:45997 every 8 connection(s)
I20260925 03:09:27.756742  9358 acceptor_pool.cc:254] collecting diagnostics on the listening RPC socket 0.0.0.0:45997 every 8 connection(s)
W20260925 03:09:27.761487  9353 negotiation.cc:337] Failed RPC negotiation. Trace:
0925 03:09:27.760279 (+     0us) reactor.cc:625] Submitting negotiation task for server connection from 127.0.0.1:38936 (local address 127.0.0.1:45997)
0925 03:09:27.760708 (+   429us) server_negotiation.cc:206] Beginning negotiation
0925 03:09:27.760726 (+    18us) server_negotiation.cc:399] Waiting for connection header
0925 03:09:27.760959 (+   233us) negotiation.cc:327] Negotiation complete: Network error: Server connection negotiation failed: server connection from 127.0.0.1:38936: BlockingRecv error: recv got EOF from 127.0.0.1:38936 (error 108)
Metrics: {"server-negotiator.queue_time_us":87}
[       OK ] Parameters/TestRpc.RpcPendingConnectionsMetric/SSL_TCP (28 ms)
[ RUN      ] Parameters/TestRpc.TestRpcContextClientDeadline/SSL_TCP
I20260925 03:09:27.788627  9373 acceptor_pool.cc:254] collecting diagnostics on the listening RPC socket 0.0.0.0:40699 every 8 connection(s)
I20260925 03:09:27.789359  9374 acceptor_pool.cc:254] collecting diagnostics on the listening RPC socket 0.0.0.0:40699 every 8 connection(s)
[       OK ] Parameters/TestRpc.TestRpcContextClientDeadline/SSL_TCP (82 ms)
[ RUN      ] Parameters/TestRpc.TestApplicationFeatureFlagUnsupportedServer/SSL_TCP
I20260925 03:09:27.880347  9398 acceptor_pool.cc:254] collecting diagnostics on the listening RPC socket 0.0.0.0:39759 every 8 connection(s)
I20260925 03:09:27.881115  9399 acceptor_pool.cc:254] collecting diagnostics on the listening RPC socket 0.0.0.0:39759 every 8 connection(s)
[       OK ] Parameters/TestRpc.TestApplicationFeatureFlagUnsupportedServer/SSL_TCP (59 ms)
[ RUN      ] Parameters/TestRpc.TestCancellationAsync/SSL_TCP
I20260925 03:09:27.941675  9423 acceptor_pool.cc:254] collecting diagnostics on the listening RPC socket 0.0.0.0:33309 every 8 connection(s)
I20260925 03:09:27.942399  9424 acceptor_pool.cc:254] collecting diagnostics on the listening RPC socket 0.0.0.0:33309 every 8 connection(s)
I20260925 03:09:27.945458  8992 rpc-test.cc:1716] Connecting to 0.0.0.0:33309
I20260925 03:09:27.958191  8992 test_util.cc:268] Using random seed: 190228125
I20260925 03:09:28.190706  9427 rpc-test-base.h:240] got call: sleep_micros: 500 pattern: 4294967295 num_repetitions: 2097152 sidecar_idx: 0
I20260925 03:09:28.357044  9426 rpc-test-base.h:240] got call: sleep_micros: 500 pattern: 4294967295 num_repetitions: 2097152 sidecar_idx: 0
I20260925 03:09:28.557433  9427 rpc-test-base.h:240] got call: sleep_micros: 500 pattern: 4294967295 num_repetitions: 2097152 sidecar_idx: 0
I20260925 03:09:28.743980  9426 rpc-test-base.h:240] got call: sleep_micros: 500 pattern: 4294967295 num_repetitions: 2097152 sidecar_idx: 0
I20260925 03:09:28.924441  9427 rpc-test-base.h:240] got call: sleep_micros: 500 pattern: 4294967295 num_repetitions: 2097152 sidecar_idx: 0
I20260925 03:09:29.114612  9426 rpc-test-base.h:240] got call: sleep_micros: 500 pattern: 4294967295 num_repetitions: 2097152 sidecar_idx: 0
I20260925 03:09:29.288067  9427 rpc-test-base.h:240] got call: sleep_micros: 500 pattern: 4294967295 num_repetitions: 2097152 sidecar_idx: 0
I20260925 03:09:29.476854  9426 rpc-test-base.h:240] got call: sleep_micros: 500 pattern: 4294967295 num_repetitions: 2097152 sidecar_idx: 0
W20260925 03:09:29.649722  9422 connection.cc:698] server connection from 127.0.0.1:58090 send error: Network error: failed to write to TLS socket: Broken pipe
W20260925 03:09:29.649955  9422 connection.cc:441] server connection from 127.0.0.1:58090 torn down before Call kudu.rpc.GenericCalculatorService.SleepWithSidecar from 127.0.0.1:58090 (request call id 9) could send its response
W20260925 03:09:29.655045  9422 connection.cc:196] Error closing socket: Network error: TlsSocket::Close: Success
W20260925 03:09:29.666334  9422 connection.cc:441] server connection from 127.0.0.1:58090 torn down before Call kudu.rpc.GenericCalculatorService.SleepWithSidecar from 127.0.0.1:58090 (request call id 8) could send its response
[       OK ] Parameters/TestRpc.TestCancellationAsync/SSL_TCP (1759 ms)
[ RUN      ] Parameters/TestRpc.TestPerformanceBySocketType/SSL_TCP
I20260925 03:09:29.783272  9448 acceptor_pool.cc:254] collecting diagnostics on the listening RPC socket 0.0.0.0:45269 every 8 connection(s)
I20260925 03:09:29.784008  9449 acceptor_pool.cc:254] collecting diagnostics on the listening RPC socket 0.0.0.0:45269 every 8 connection(s)
I20260925 03:09:29.787072  8992 rpc-test.cc:1846] Connecting to 0.0.0.0:45269
I20260925 03:09:49.049299  8992 rpc-test.cc:1859] Sending 1024MB via ssl-enabled tcp socket: real 19.235s	user 16.280s	sys 10.964s
I20260925 03:10:08.192269  8992 rpc-test.cc:1859] Sending 1024MB via ssl-enabled tcp socket: real 19.142s	user 16.302s	sys 10.698s
I20260925 03:10:27.327353  8992 rpc-test.cc:1859] Sending 1024MB via ssl-enabled tcp socket: real 19.135s	user 16.127s	sys 10.905s
I20260925 03:10:46.453461  8992 rpc-test.cc:1859] Sending 1024MB via ssl-enabled tcp socket: real 19.126s	user 15.943s	sys 10.994s
I20260925 03:11:05.522280  8992 rpc-test.cc:1859] Sending 1024MB via ssl-enabled tcp socket: real 19.068s	user 16.020s	sys 10.861s
[       OK ] Parameters/TestRpc.TestPerformanceBySocketType/SSL_TCP (95865 ms)
[----------] 20 tests from Parameters/TestRpc (241088 ms total)

[----------] 1 test from Parameters/TestRpcSocketTxRxQueue
[ RUN      ] Parameters/TestRpcSocketTxRxQueue.OverCapacity/0
W20260925 03:11:05.980042  9485 negotiation.cc:337] Failed RPC negotiation. Trace:
0925 03:11:05.557572 (+     0us) reactor.cc:625] Submitting negotiation task for client connection to 0.0.0.0:42495 (local address 127.0.0.1:47614)
0925 03:11:05.558097 (+   525us) negotiation.cc:107] Waiting for socket to connect
0925 03:11:05.558126 (+    29us) client_negotiation.cc:174] Beginning negotiation
0925 03:11:05.558303 (+   177us) client_negotiation.cc:252] Sending NEGOTIATE NegotiatePB request
0925 03:11:05.978222 (+419919us) negotiation.cc:327] Negotiation complete: Network error: Client connection negotiation failed: client connection to 0.0.0.0:42495: BlockingRecv error: recv error from unknown peer: Transport endpoint is not connected (error 107)
Metrics: {"client-negotiator.queue_time_us":132}
W20260925 03:11:05.983410  9476 negotiation.cc:337] Failed RPC negotiation. Trace:
0925 03:11:05.551162 (+     0us) reactor.cc:625] Submitting negotiation task for client connection to 0.0.0.0:42495 (local address 127.0.0.1:47602)
0925 03:11:05.551837 (+   675us) negotiation.cc:107] Waiting for socket to connect
0925 03:11:05.551881 (+    44us) client_negotiation.cc:174] Beginning negotiation
0925 03:11:05.552354 (+   473us) client_negotiation.cc:252] Sending NEGOTIATE NegotiatePB request
0925 03:11:05.978070 (+425716us) negotiation.cc:327] Negotiation complete: Network error: Client connection negotiation failed: client connection to 0.0.0.0:42495: BlockingRecv error: recv error from unknown peer: Transport endpoint is not connected (error 107)
Metrics: {"client-negotiator.queue_time_us":120}
W20260925 03:11:05.983150  9494 negotiation.cc:337] Failed RPC negotiation. Trace:
0925 03:11:05.564628 (+     0us) reactor.cc:625] Submitting negotiation task for client connection to 0.0.0.0:42495 (local address 127.0.0.1:47630)
0925 03:11:05.565187 (+   559us) negotiation.cc:107] Waiting for socket to connect
0925 03:11:05.565215 (+    28us) client_negotiation.cc:174] Beginning negotiation
0925 03:11:05.565396 (+   181us) client_negotiation.cc:252] Sending NEGOTIATE NegotiatePB request
0925 03:11:05.978157 (+412761us) negotiation.cc:327] Negotiation complete: Network error: Client connection negotiation failed: client connection to 0.0.0.0:42495: BlockingRecv error: recv error from unknown peer: Transport endpoint is not connected (error 107)
Metrics: {"client-negotiator.queue_time_us":143}
W20260925 03:11:05.983969  9504 negotiation.cc:337] Failed RPC negotiation. Trace:
0925 03:11:05.576971 (+     0us) reactor.cc:625] Submitting negotiation task for client connection to 0.0.0.0:42495 (local address 127.0.0.1:47644)
0925 03:11:05.577499 (+   528us) negotiation.cc:107] Waiting for socket to connect
0925 03:11:05.577529 (+    30us) client_negotiation.cc:174] Beginning negotiation
0925 03:11:05.577712 (+   183us) client_negotiation.cc:252] Sending NEGOTIATE NegotiatePB request
0925 03:11:05.978070 (+400358us) negotiation.cc:327] Negotiation complete: Network error: Client connection negotiation failed: client connection to 0.0.0.0:42495: BlockingRecv error: recv error from unknown peer: Transport endpoint is not connected (error 107)
Metrics: {"client-negotiator.queue_time_us":135}
W20260925 03:11:05.984468  9513 negotiation.cc:337] Failed RPC negotiation. Trace:
0925 03:11:05.589454 (+     0us) reactor.cc:625] Submitting negotiation task for client connection to 0.0.0.0:42495 (local address 127.0.0.1:47658)
0925 03:11:05.589976 (+   522us) negotiation.cc:107] Waiting for socket to connect
0925 03:11:05.590005 (+    29us) client_negotiation.cc:174] Beginning negotiation
0925 03:11:05.590180 (+   175us) client_negotiation.cc:252] Sending NEGOTIATE NegotiatePB request
0925 03:11:05.978617 (+388437us) negotiation.cc:327] Negotiation complete: Network error: Client connection negotiation failed: client connection to 0.0.0.0:42495: BlockingRecv error: recv error from unknown peer: Transport endpoint is not connected (error 107)
Metrics: {"client-negotiator.queue_time_us":134}
W20260925 03:11:05.985142  9522 negotiation.cc:337] Failed RPC negotiation. Trace:
0925 03:11:05.601987 (+     0us) reactor.cc:625] Submitting negotiation task for client connection to 0.0.0.0:42495 (local address 127.0.0.1:47666)
0925 03:11:05.602520 (+   533us) negotiation.cc:107] Waiting for socket to connect
0925 03:11:05.602563 (+    43us) client_negotiation.cc:174] Beginning negotiation
0925 03:11:05.602737 (+   174us) client_negotiation.cc:252] Sending NEGOTIATE NegotiatePB request
0925 03:11:05.980717 (+377980us) negotiation.cc:327] Negotiation complete: Network error: Client connection negotiation failed: client connection to 0.0.0.0:42495: BlockingRecv error: recv error from unknown peer: Transport endpoint is not connected (error 107)
Metrics: {"client-negotiator.queue_time_us":130}
[       OK ] Parameters/TestRpcSocketTxRxQueue.OverCapacity/0 (1225 ms)
[----------] 1 test from Parameters/TestRpcSocketTxRxQueue (1225 ms total)

[----------] Global test environment tear-down
[==========] 21 tests from 2 test suites ran. (242315 ms total)
[  PASSED  ] 20 tests.
[  FAILED  ] 1 test, listed below:
[  FAILED  ] Parameters/TestRpc.TestCallWithChainCertAndChainCA/SSL_TCP, where GetParam() = (true, false)

 1 FAILED TEST