Diagnosed failure

Parameters/TestRpc.TestCallWithChainCertAndChainCA/SSL_TCP: /data0/somelongdirectorytoavoidrpathissues/src/kudu/src/kudu/rpc/rpc-test.cc:270: Failure
Failed
Bad status: Runtime error: could not verify certificate chain (error with cert: subject=CN = localhost, ST = sadfjas, C = AS, emailAddress = sdflkdsajf, O = lskdfjlsad, OU = sldfkja, issuer=C = AS, ST = ASDfkjdhf, L = lskdjf, O = saldfja, OU = skdjf, CN = localhost, emailAddress = sadjflkadsj): : certificate has expired
Google Test trace:
/data0/somelongdirectorytoavoidrpathissues/src/kudu/src/kudu/rpc/rpc-test.cc:267: Connecting to 0.0.0.0:33267
I20260928 16:35:51.373157   331 test_util.cc:175] -----------------------------------------------
I20260928 16:35:51.373203   331 test_util.cc:176] Had fatal failures, leaving test files at /tmp/dist-test-taskunnF0K/test-tmp/rpc-test.5.Parameters_TestRpc.TestCallWithChainCertAndChainCA_SSL_TCP.1790613351306465-331-0

Full log

Note: This is test shard 6 of 8.
[==========] Running 21 tests from 2 test suites.
[----------] Global test environment set-up.
[----------] 20 tests from Parameters/TestRpc
[ RUN      ] Parameters/TestRpc.TestMessengerCreateDestroy/SSL_TCP
WARNING: Logging before InitGoogleLogging() is written to STDERR
I20260928 16:35:51.326692   331 rpc-test.cc:169] started messenger TestCreateDestroy
[       OK ] Parameters/TestRpc.TestMessengerCreateDestroy/SSL_TCP (15 ms)
[ RUN      ] Parameters/TestRpc.TestNegotiationDeadlock/SSL_TCP
I20260928 16:35:51.344946   351 acceptor_pool.cc:254] collecting diagnostics on the listening RPC socket 0.0.0.0:35827 every 8 connection(s)
I20260928 16:35:51.344993   352 acceptor_pool.cc:254] collecting diagnostics on the listening RPC socket 0.0.0.0:35827 every 8 connection(s)
[       OK ] Parameters/TestRpc.TestNegotiationDeadlock/SSL_TCP (26 ms)
[ RUN      ] Parameters/TestRpc.TestCallWithChainCertAndChainCA/SSL_TCP
I20260928 16:35:51.368252   367 acceptor_pool.cc:254] collecting diagnostics on the listening RPC socket 0.0.0.0:33267 every 8 connection(s)
I20260928 16:35:51.368287   368 acceptor_pool.cc:254] collecting diagnostics on the listening RPC socket 0.0.0.0:33267 every 8 connection(s)
/data0/somelongdirectorytoavoidrpathissues/src/kudu/src/kudu/rpc/rpc-test.cc:270: Failure
Failed
Bad status: Runtime error: could not verify certificate chain (error with cert: subject=CN = localhost, ST = sadfjas, C = AS, emailAddress = sdflkdsajf, O = lskdfjlsad, OU = sldfkja, issuer=C = AS, ST = ASDfkjdhf, L = lskdjf, O = saldfja, OU = skdjf, CN = localhost, emailAddress = sadjflkadsj): : certificate has expired
Google Test trace:
/data0/somelongdirectorytoavoidrpathissues/src/kudu/src/kudu/rpc/rpc-test.cc:267: Connecting to 0.0.0.0:33267
I20260928 16:35:51.373157   331 test_util.cc:175] -----------------------------------------------
I20260928 16:35:51.373203   331 test_util.cc:176] Had fatal failures, leaving test files at /tmp/dist-test-taskunnF0K/test-tmp/rpc-test.5.Parameters_TestRpc.TestCallWithChainCertAndChainCA_SSL_TCP.1790613351306465-331-0
[  FAILED  ] Parameters/TestRpc.TestCallWithChainCertAndChainCA/SSL_TCP, where GetParam() = (true, false) (17 ms)
[ RUN      ] Parameters/TestRpc.TestCallWithPasswordProtectedKey/SSL_TCP
I20260928 16:35:51.384266   392 acceptor_pool.cc:254] collecting diagnostics on the listening RPC socket 0.0.0.0:33165 every 8 connection(s)
I20260928 16:35:51.384308   393 acceptor_pool.cc:254] collecting diagnostics on the listening RPC socket 0.0.0.0:33165 every 8 connection(s)
[       OK ] Parameters/TestRpc.TestCallWithPasswordProtectedKey/SSL_TCP (24 ms)
[ RUN      ] Parameters/TestRpc.TestCallToBadServer/SSL_TCP
I20260928 16:35:51.417484   331 rpc-test.cc:394] Status: Network error: Client connection negotiation failed: client connection to 0.0.0.0:0: connect: Connection refused (error 111)
I20260928 16:35:51.417857   331 rpc-test.cc:394] Status: Network error: Client connection negotiation failed: client connection to 0.0.0.0:0: connect: Connection refused (error 111)
I20260928 16:35:51.418241   331 rpc-test.cc:394] Status: Network error: Client connection negotiation failed: client connection to 0.0.0.0:0: connect: Connection refused (error 111)
I20260928 16:35:51.418672   331 rpc-test.cc:394] Status: Network error: Client connection negotiation failed: client connection to 0.0.0.0:0: connect: Connection refused (error 111)
I20260928 16:35:51.419123   331 rpc-test.cc:394] Status: Network error: Client connection negotiation failed: client connection to 0.0.0.0:0: connect: Connection refused (error 111)
[       OK ] Parameters/TestRpc.TestCallToBadServer/SSL_TCP (21 ms)
[ RUN      ] Parameters/TestRpc.TestWrongService/SSL_TCP
I20260928 16:35:51.445475   428 acceptor_pool.cc:254] collecting diagnostics on the listening RPC socket 0.0.0.0:34605 every 8 connection(s)
I20260928 16:35:51.445487   429 acceptor_pool.cc:254] collecting diagnostics on the listening RPC socket 0.0.0.0:34605 every 8 connection(s)
I20260928 16:35:51.460692   425 messenger.cc:345] service WrongServiceName not registered on TestServer
[       OK ] Parameters/TestRpc.TestWrongService/SSL_TCP (43 ms)
[ RUN      ] Parameters/TestRpc.TestConnectionKeepalive/SSL_TCP
I20260928 16:35:51.480814   451 acceptor_pool.cc:254] collecting diagnostics on the listening RPC socket 0.0.0.0:40465 every 8 connection(s)
I20260928 16:35:51.480859   452 acceptor_pool.cc:254] collecting diagnostics on the listening RPC socket 0.0.0.0:40465 every 8 connection(s)
I20260928 16:35:51.481122   331 rpc-test.cc:488] Connecting to 0.0.0.0:40465
[       OK ] Parameters/TestRpc.TestConnectionKeepalive/SSL_TCP (1033 ms)
[ RUN      ] Parameters/TestRpc.TestClientConnectionMetrics/SSL_TCP
I20260928 16:35:52.509373   476 acceptor_pool.cc:254] collecting diagnostics on the listening RPC socket 0.0.0.0:42533 every 8 connection(s)
I20260928 16:35:52.509410   477 acceptor_pool.cc:254] collecting diagnostics on the listening RPC socket 0.0.0.0:42533 every 8 connection(s)
I20260928 16:35:52.509707   331 rpc-test.cc:569] Connecting to 0.0.0.0:42533
[       OK ] Parameters/TestRpc.TestClientConnectionMetrics/SSL_TCP (12876 ms)
[ RUN      ] Parameters/TestRpc.TestCredentialsPolicy/SSL_TCP
I20260928 16:36:05.378178   500 acceptor_pool.cc:254] collecting diagnostics on the listening RPC socket 0.0.0.0:38825 every 8 connection(s)
I20260928 16:36:05.378235   501 acceptor_pool.cc:254] collecting diagnostics on the listening RPC socket 0.0.0.0:38825 every 8 connection(s)
I20260928 16:36:05.378536   331 rpc-test.cc:700] Connecting to 0.0.0.0:38825
[       OK ] Parameters/TestRpc.TestCredentialsPolicy/SSL_TCP (32 ms)
[ RUN      ] Parameters/TestRpc.TestCallLongerThanKeepalive/SSL_TCP
I20260928 16:36:05.426270   525 acceptor_pool.cc:254] collecting diagnostics on the listening RPC socket 0.0.0.0:34919 every 8 connection(s)
I20260928 16:36:05.426324   526 acceptor_pool.cc:254] collecting diagnostics on the listening RPC socket 0.0.0.0:34919 every 8 connection(s)
I20260928 16:36:05.442013   529 rpc-test-base.h:222] got call: sleep_micros: 3000000 deferred: true
I20260928 16:36:08.442862   529 rpcz_store.cc:275] Call kudu.rpc.GenericCalculatorService.Sleep from 127.0.0.1:48708 (request call id 0) took 3000 ms. Trace:
I20260928 16:36:08.443006   529 rpcz_store.cc:276] 0928 16:36:05.441899 (+     0us) service_pool.cc:170] Inserting onto call queue
0928 16:36:05.441983 (+    84us) service_pool.cc:227] Handling call
0928 16:36:08.442831 (+3000848us) inbound_call.cc:173] Queueing success response
Metrics: {}
[       OK ] Parameters/TestRpc.TestCallLongerThanKeepalive/SSL_TCP (3040 ms)
[ RUN      ] Parameters/TestRpc.TestRpcSidecar/SSL_TCP
I20260928 16:36:08.473882   550 acceptor_pool.cc:254] collecting diagnostics on the listening RPC socket 0.0.0.0:39055 every 8 connection(s)
I20260928 16:36:08.473979   551 acceptor_pool.cc:254] collecting diagnostics on the listening RPC socket 0.0.0.0:39055 every 8 connection(s)
[       OK ] Parameters/TestRpc.TestRpcSidecar/SSL_TCP (85 ms)
[ RUN      ] Parameters/TestRpc.TestRpcSidecarLimits/SSL_TCP
I20260928 16:36:10.448266   577 acceptor_pool.cc:254] collecting diagnostics on the listening RPC socket 0.0.0.0:44449 every 8 connection(s)
I20260928 16:36:10.448315   576 acceptor_pool.cc:254] collecting diagnostics on the listening RPC socket 0.0.0.0:44449 every 8 connection(s)
W20260928 16:36:10.462812   331 serialization.cc:72] Serialized kudu.rpc_test.PushStringsRequestPB (2147483654 bytes) is larger than the maximum configured RPC message size (52428800 bytes). Sending anyway, but peer may reject the data.
W20260928 16:36:10.467244   574 connection.cc:535] server connection from 127.0.0.1:46884 recv error: Network error: RPC frame had a length of 2147483714, but we only support messages up to 52428800 bytes long.
W20260928 16:36:10.467335   574 connection.cc:158] shutting down server connection from 127.0.0.1:46884 with pending inbound data: 4/2147483714 bytes received; last active 0 ns ago: status Network error: RPC frame had a length of 2147483714, but we only support messages up to 52428800 bytes long.
W20260928 16:36:10.467643   589 connection.cc:196] Error closing socket: Network error: TlsSocket::Close: Connection reset by peer
I20260928 16:36:10.474078   601 acceptor_pool.cc:254] collecting diagnostics on the listening RPC socket 0.0.0.0:35125 every 8 connection(s)
I20260928 16:36:10.474247   602 acceptor_pool.cc:254] collecting diagnostics on the listening RPC socket 0.0.0.0:35125 every 8 connection(s)
W20260928 16:36:14.982342   600 connection.cc:577] server connection from 127.0.0.1:55132: received bad data: 'Corruption: Invalid packet: message had a length of 2147483710, but we only support messages up to 2147483647 bytes
'
[       OK ] Parameters/TestRpc.TestRpcSidecarLimits/SSL_TCP (6453 ms)
[ RUN      ] Parameters/TestRpc.TestCallTimeoutDoesntAffectNegotiation/SSL_TCP
I20260928 16:36:15.002211   626 acceptor_pool.cc:254] collecting diagnostics on the listening RPC socket 0.0.0.0:44531 every 8 connection(s)
I20260928 16:36:15.002247   627 acceptor_pool.cc:254] collecting diagnostics on the listening RPC socket 0.0.0.0:44531 every 8 connection(s)
W20260928 16:36:15.013890   622 negotiation.cc:266] Injecting 500ms delay in negotiation
I20260928 16:36:15.064194   331 rpc-test-base.h:595] status: Timed out: connection negotiation to 0.0.0.0:44531 for RPC Sleep timed out after 0.050s (ON_OUTBOUND_QUEUE), seconds elapsed: 0.0508251
[       OK ] Parameters/TestRpc.TestCallTimeoutDoesntAffectNegotiation/SSL_TCP (534 ms)
[ RUN      ] Parameters/TestRpc.TestRpcHandlerLatencyMetric/SSL_TCP
I20260928 16:36:15.529289   652 acceptor_pool.cc:254] collecting diagnostics on the listening RPC socket 0.0.0.0:38051 every 8 connection(s)
I20260928 16:36:15.529336   653 acceptor_pool.cc:254] collecting diagnostics on the listening RPC socket 0.0.0.0:38051 every 8 connection(s)
I20260928 16:36:15.564821   331 rpc-test.cc:1236] Sleep() min lat: 20423
I20260928 16:36:15.564883   331 rpc-test.cc:1237] Sleep() mean lat: 20423
I20260928 16:36:15.564913   331 rpc-test.cc:1238] Sleep() max lat: 20423
I20260928 16:36:15.564925   331 rpc-test.cc:1239] Sleep() #calls: 1
[       OK ] Parameters/TestRpc.TestRpcHandlerLatencyMetric/SSL_TCP (46 ms)
[ RUN      ] Parameters/TestRpc.TimedOutOnResponseMetricServiceQueue/SSL_TCP
I20260928 16:36:15.574143   679 acceptor_pool.cc:254] collecting diagnostics on the listening RPC socket 0.0.0.0:33113 every 8 connection(s)
I20260928 16:36:15.574188   680 acceptor_pool.cc:254] collecting diagnostics on the listening RPC socket 0.0.0.0:33113 every 8 connection(s)
W20260928 16:36:15.642285   681 rpcz_store.cc:267] Call kudu.rpc_test.CalculatorService.Sleep from 127.0.0.1:33278 (request call id 2) took 20 ms (client timeout 20 ms). Trace:
W20260928 16:36:15.642395   681 rpcz_store.cc:269] 0928 16:36:15.622029 (+     0us) service_pool.cc:170] Inserting onto call queue
0928 16:36:15.642253 (+ 20224us) service_pool.cc:214] Skipping call since client already timed out
0928 16:36:15.642273 (+    20us) inbound_call.cc:173] Queueing failure response
Metrics: {}
[       OK ] Parameters/TestRpc.TimedOutOnResponseMetricServiceQueue/SSL_TCP (77 ms)
[ RUN      ] Parameters/TestRpc.RpcPendingConnectionsMetric/SSL_TCP
I20260928 16:36:15.646642   702 acceptor_pool.cc:254] collecting diagnostics on the listening RPC socket 0.0.0.0:40611 every 8 connection(s)
I20260928 16:36:15.646723   703 acceptor_pool.cc:254] collecting diagnostics on the listening RPC socket 0.0.0.0:40611 every 8 connection(s)
W20260928 16:36:15.647716   698 negotiation.cc:337] Failed RPC negotiation. Trace:
0928 16:36:15.647351 (+     0us) reactor.cc:625] Submitting negotiation task for server connection from 127.0.0.1:40414 (local address 127.0.0.1:40611)
0928 16:36:15.647456 (+   105us) server_negotiation.cc:206] Beginning negotiation
0928 16:36:15.647459 (+     3us) server_negotiation.cc:399] Waiting for connection header
0928 16:36:15.647532 (+    73us) negotiation.cc:327] Negotiation complete: Network error: Server connection negotiation failed: server connection from 127.0.0.1:40414: BlockingRecv error: recv got EOF from 127.0.0.1:40414 (error 108)
Metrics: {"server-negotiator.queue_time_us":38}
[       OK ] Parameters/TestRpc.RpcPendingConnectionsMetric/SSL_TCP (14 ms)
[ RUN      ] Parameters/TestRpc.TestRpcContextClientDeadline/SSL_TCP
I20260928 16:36:15.689845   719 acceptor_pool.cc:254] collecting diagnostics on the listening RPC socket 0.0.0.0:42607 every 8 connection(s)
I20260928 16:36:15.689847   718 acceptor_pool.cc:254] collecting diagnostics on the listening RPC socket 0.0.0.0:42607 every 8 connection(s)
[       OK ] Parameters/TestRpc.TestRpcContextClientDeadline/SSL_TCP (83 ms)
[ RUN      ] Parameters/TestRpc.TestApplicationFeatureFlagUnsupportedServer/SSL_TCP
I20260928 16:36:15.747040   743 acceptor_pool.cc:254] collecting diagnostics on the listening RPC socket 0.0.0.0:35063 every 8 connection(s)
I20260928 16:36:15.747114   744 acceptor_pool.cc:254] collecting diagnostics on the listening RPC socket 0.0.0.0:35063 every 8 connection(s)
[       OK ] Parameters/TestRpc.TestApplicationFeatureFlagUnsupportedServer/SSL_TCP (18 ms)
[ RUN      ] Parameters/TestRpc.TestCancellationAsync/SSL_TCP
I20260928 16:36:15.766834   769 acceptor_pool.cc:254] collecting diagnostics on the listening RPC socket 0.0.0.0:41609 every 8 connection(s)
I20260928 16:36:15.766887   770 acceptor_pool.cc:254] collecting diagnostics on the listening RPC socket 0.0.0.0:41609 every 8 connection(s)
I20260928 16:36:15.767153   331 rpc-test.cc:1716] Connecting to 0.0.0.0:41609
I20260928 16:36:15.783923   331 test_util.cc:268] Using random seed: -1439591440
I20260928 16:36:15.809460   773 rpc-test-base.h:240] got call: sleep_micros: 500 pattern: 4294967295 num_repetitions: 2097152 sidecar_idx: 0
I20260928 16:36:15.824623   772 rpc-test-base.h:240] got call: sleep_micros: 500 pattern: 4294967295 num_repetitions: 2097152 sidecar_idx: 0
I20260928 16:36:15.839145   773 rpc-test-base.h:240] got call: sleep_micros: 500 pattern: 4294967295 num_repetitions: 2097152 sidecar_idx: 0
I20260928 16:36:15.855520   772 rpc-test-base.h:240] got call: sleep_micros: 500 pattern: 4294967295 num_repetitions: 2097152 sidecar_idx: 0
I20260928 16:36:15.874295   773 rpc-test-base.h:240] got call: sleep_micros: 500 pattern: 4294967295 num_repetitions: 2097152 sidecar_idx: 0
I20260928 16:36:15.892153   772 rpc-test-base.h:240] got call: sleep_micros: 500 pattern: 4294967295 num_repetitions: 2097152 sidecar_idx: 0
I20260928 16:36:15.911607   773 rpc-test-base.h:240] got call: sleep_micros: 500 pattern: 4294967295 num_repetitions: 2097152 sidecar_idx: 0
I20260928 16:36:15.927208   772 rpc-test-base.h:240] got call: sleep_micros: 500 pattern: 4294967295 num_repetitions: 2097152 sidecar_idx: 0
W20260928 16:36:15.934077   767 connection.cc:441] server connection from 127.0.0.1:33662 torn down before Call kudu.rpc.GenericCalculatorService.SleepWithSidecar from 127.0.0.1:33662 (request call id 8) could send its response
W20260928 16:36:15.943678   767 connection.cc:441] server connection from 127.0.0.1:33662 torn down before Call kudu.rpc.GenericCalculatorService.SleepWithSidecar from 127.0.0.1:33662 (request call id 9) could send its response
[       OK ] Parameters/TestRpc.TestCancellationAsync/SSL_TCP (183 ms)
[ RUN      ] Parameters/TestRpc.TestPerformanceBySocketType/SSL_TCP
I20260928 16:36:15.973436   794 acceptor_pool.cc:254] collecting diagnostics on the listening RPC socket 0.0.0.0:45809 every 8 connection(s)
I20260928 16:36:15.973481   795 acceptor_pool.cc:254] collecting diagnostics on the listening RPC socket 0.0.0.0:45809 every 8 connection(s)
I20260928 16:36:15.973798   331 rpc-test.cc:1846] Connecting to 0.0.0.0:45809
I20260928 16:36:18.032678   331 rpc-test.cc:1859] Sending 1024MB via ssl-enabled tcp socket: real 2.029s	user 2.044s	sys 1.561s
I20260928 16:36:19.990600   331 rpc-test.cc:1859] Sending 1024MB via ssl-enabled tcp socket: real 1.958s	user 1.903s	sys 1.575s
I20260928 16:36:22.037468   331 rpc-test.cc:1859] Sending 1024MB via ssl-enabled tcp socket: real 2.047s	user 1.939s	sys 1.686s
I20260928 16:36:24.051900   331 rpc-test.cc:1859] Sending 1024MB via ssl-enabled tcp socket: real 2.014s	user 2.055s	sys 1.526s
I20260928 16:36:26.151182   331 rpc-test.cc:1859] Sending 1024MB via ssl-enabled tcp socket: real 2.099s	user 2.083s	sys 1.662s
[       OK ] Parameters/TestRpc.TestPerformanceBySocketType/SSL_TCP (10208 ms)
[----------] 20 tests from Parameters/TestRpc (34840 ms total)

[----------] 1 test from Parameters/TestRpcSocketTxRxQueue
[ RUN      ] Parameters/TestRpcSocketTxRxQueue.OverCapacity/0
W20260928 16:36:26.423547   811 negotiation.cc:337] Failed RPC negotiation. Trace:
0928 16:36:26.155537 (+     0us) reactor.cc:625] Submitting negotiation task for client connection to 0.0.0.0:45139 (local address 127.0.0.1:35670)
0928 16:36:26.155641 (+   104us) negotiation.cc:107] Waiting for socket to connect
0928 16:36:26.155656 (+    15us) client_negotiation.cc:174] Beginning negotiation
0928 16:36:26.155740 (+    84us) client_negotiation.cc:252] Sending NEGOTIATE NegotiatePB request
0928 16:36:26.423301 (+267561us) negotiation.cc:327] Negotiation complete: Network error: Client connection negotiation failed: client connection to 0.0.0.0:45139: BlockingRecv error: recv error from unknown peer: Transport endpoint is not connected (error 107)
Metrics: {"client-negotiator.queue_time_us":25}
W20260928 16:36:26.423578   856 negotiation.cc:337] Failed RPC negotiation. Trace:
0928 16:36:26.161168 (+     0us) reactor.cc:625] Submitting negotiation task for client connection to 0.0.0.0:45139 (local address 127.0.0.1:35704)
0928 16:36:26.161284 (+   116us) negotiation.cc:107] Waiting for socket to connect
0928 16:36:26.161297 (+    13us) client_negotiation.cc:174] Beginning negotiation
0928 16:36:26.161369 (+    72us) client_negotiation.cc:252] Sending NEGOTIATE NegotiatePB request
0928 16:36:26.423505 (+262136us) negotiation.cc:327] Negotiation complete: Network error: Client connection negotiation failed: client connection to 0.0.0.0:45139: BlockingRecv error: recv error from unknown peer: Transport endpoint is not connected (error 107)
Metrics: {"client-negotiator.queue_time_us":25}
W20260928 16:36:26.423357   847 negotiation.cc:337] Failed RPC negotiation. Trace:
0928 16:36:26.160007 (+     0us) reactor.cc:625] Submitting negotiation task for client connection to 0.0.0.0:45139 (local address 127.0.0.1:35696)
0928 16:36:26.160159 (+   152us) negotiation.cc:107] Waiting for socket to connect
0928 16:36:26.160173 (+    14us) client_negotiation.cc:174] Beginning negotiation
0928 16:36:26.160251 (+    78us) client_negotiation.cc:252] Sending NEGOTIATE NegotiatePB request
0928 16:36:26.423218 (+262967us) negotiation.cc:327] Negotiation complete: Network error: Client connection negotiation failed: client connection to 0.0.0.0:45139: BlockingRecv error: recv error from unknown peer: Transport endpoint is not connected (error 107)
Metrics: {"client-negotiator.queue_time_us":61}
W20260928 16:36:26.423547   829 negotiation.cc:337] Failed RPC negotiation. Trace:
0928 16:36:26.157697 (+     0us) reactor.cc:625] Submitting negotiation task for client connection to 0.0.0.0:45139 (local address 127.0.0.1:35676)
0928 16:36:26.157838 (+   141us) negotiation.cc:107] Waiting for socket to connect
0928 16:36:26.157850 (+    12us) client_negotiation.cc:174] Beginning negotiation
0928 16:36:26.157926 (+    76us) client_negotiation.cc:252] Sending NEGOTIATE NegotiatePB request
0928 16:36:26.423301 (+265375us) negotiation.cc:327] Negotiation complete: Network error: Client connection negotiation failed: client connection to 0.0.0.0:45139: BlockingRecv error: recv error from unknown peer: Transport endpoint is not connected (error 107)
Metrics: {"client-negotiator.queue_time_us":48}
W20260928 16:36:26.423375   838 negotiation.cc:337] Failed RPC negotiation. Trace:
0928 16:36:26.158865 (+     0us) reactor.cc:625] Submitting negotiation task for client connection to 0.0.0.0:45139 (local address 127.0.0.1:35688)
0928 16:36:26.159011 (+   146us) negotiation.cc:107] Waiting for socket to connect
0928 16:36:26.159023 (+    12us) client_negotiation.cc:174] Beginning negotiation
0928 16:36:26.159105 (+    82us) client_negotiation.cc:252] Sending NEGOTIATE NegotiatePB request
0928 16:36:26.423293 (+264188us) negotiation.cc:327] Negotiation complete: Network error: Client connection negotiation failed: client connection to 0.0.0.0:45139: BlockingRecv error: recv error from unknown peer: Transport endpoint is not connected (error 107)
Metrics: {"client-negotiator.queue_time_us":47}
W20260928 16:36:26.424145   820 negotiation.cc:337] Failed RPC negotiation. Trace:
0928 16:36:26.156551 (+     0us) reactor.cc:625] Submitting negotiation task for client connection to 0.0.0.0:45139 (local address 127.0.0.1:35674)
0928 16:36:26.156671 (+   120us) negotiation.cc:107] Waiting for socket to connect
0928 16:36:26.156684 (+    13us) client_negotiation.cc:174] Beginning negotiation
0928 16:36:26.156770 (+    86us) client_negotiation.cc:252] Sending NEGOTIATE NegotiatePB request
0928 16:36:26.423218 (+266448us) negotiation.cc:327] Negotiation complete: Network error: Client connection negotiation failed: client connection to 0.0.0.0:45139: BlockingRecv error: recv error from unknown peer: Transport endpoint is not connected (error 107)
Metrics: {"client-negotiator.queue_time_us":26}
[       OK ] Parameters/TestRpcSocketTxRxQueue.OverCapacity/0 (1025 ms)
[----------] 1 test from Parameters/TestRpcSocketTxRxQueue (1025 ms total)

[----------] Global test environment tear-down
[==========] 21 tests from 2 test suites ran. (35866 ms total)
[  PASSED  ] 20 tests.
[  FAILED  ] 1 test, listed below:
[  FAILED  ] Parameters/TestRpc.TestCallWithChainCertAndChainCA/SSL_TCP, where GetParam() = (true, false)

 1 FAILED TEST