Diagnosed failure
Parameters/TestRpc.TestCallWithChainCertAndChainCA/SSL_UnixSocket: /data0/somelongdirectorytoavoidrpathissues/src/kudu/src/kudu/rpc/rpc-test.cc:270: Failure
Failed
Bad status: Runtime error: could not verify certificate chain (error with cert: subject=CN = localhost, ST = sadfjas, C = AS, emailAddress = sdflkdsajf, O = lskdfjlsad, OU = sldfkja, issuer=C = AS, ST = ASDfkjdhf, L = lskdjf, O = saldfja, OU = skdjf, CN = localhost, emailAddress = sadjflkadsj): : certificate has expired
Google Test trace:
/data0/somelongdirectorytoavoidrpathissues/src/kudu/src/kudu/rpc/rpc-test.cc:267: Connecting to unix:/tmp/dist-test-task3ANG0c/test-tmp/rpc-test-291734a4849141208d00e331b1fea0a7.sock
I20260926 06:58:33.612056 3450 test_util.cc:175] -----------------------------------------------
I20260926 06:58:33.612139 3450 test_util.cc:176] Had fatal failures, leaving test files at /tmp/dist-test-task3ANG0c/test-tmp/rpc-test.6.Parameters_TestRpc.TestCallWithChainCertAndChainCA_SSL_UnixSocket.1790405913545552-3450-0
Full log
Note: This is test shard 7 of 8.
[==========] Running 21 tests from 2 test suites.
[----------] Global test environment set-up.
[----------] 20 tests from Parameters/TestRpc
[ RUN ] Parameters/TestRpc.TestMessengerCreateDestroy/SSL_UnixSocket
WARNING: Logging before InitGoogleLogging() is written to STDERR
I20260926 06:58:33.572144 3450 rpc-test.cc:169] started messenger TestCreateDestroy
[ OK ] Parameters/TestRpc.TestMessengerCreateDestroy/SSL_UnixSocket (25 ms)
[ RUN ] Parameters/TestRpc.TestNegotiationDeadlock/SSL_UnixSocket
I20260926 06:58:33.593712 3471 acceptor_pool.cc:254] collecting diagnostics on the listening RPC socket unix:/tmp/dist-test-task3ANG0c/test-tmp/rpc-test-db70d2d2dc0b49e98f35c8e1b05ff628.sock every 8 connection(s)
I20260926 06:58:33.593705 3470 acceptor_pool.cc:254] collecting diagnostics on the listening RPC socket unix:/tmp/dist-test-task3ANG0c/test-tmp/rpc-test-db70d2d2dc0b49e98f35c8e1b05ff628.sock every 8 connection(s)
[ OK ] Parameters/TestRpc.TestNegotiationDeadlock/SSL_UnixSocket (27 ms)
[ RUN ] Parameters/TestRpc.TestCallWithChainCertAndChainCA/SSL_UnixSocket
I20260926 06:58:33.608103 3486 acceptor_pool.cc:254] collecting diagnostics on the listening RPC socket unix:/tmp/dist-test-task3ANG0c/test-tmp/rpc-test-291734a4849141208d00e331b1fea0a7.sock every 8 connection(s)
I20260926 06:58:33.608139 3487 acceptor_pool.cc:254] collecting diagnostics on the listening RPC socket unix:/tmp/dist-test-task3ANG0c/test-tmp/rpc-test-291734a4849141208d00e331b1fea0a7.sock every 8 connection(s)
/data0/somelongdirectorytoavoidrpathissues/src/kudu/src/kudu/rpc/rpc-test.cc:270: Failure
Failed
Bad status: Runtime error: could not verify certificate chain (error with cert: subject=CN = localhost, ST = sadfjas, C = AS, emailAddress = sdflkdsajf, O = lskdfjlsad, OU = sldfkja, issuer=C = AS, ST = ASDfkjdhf, L = lskdjf, O = saldfja, OU = skdjf, CN = localhost, emailAddress = sadjflkadsj): : certificate has expired
Google Test trace:
/data0/somelongdirectorytoavoidrpathissues/src/kudu/src/kudu/rpc/rpc-test.cc:267: Connecting to unix:/tmp/dist-test-task3ANG0c/test-tmp/rpc-test-291734a4849141208d00e331b1fea0a7.sock
I20260926 06:58:33.612056 3450 test_util.cc:175] -----------------------------------------------
I20260926 06:58:33.612139 3450 test_util.cc:176] Had fatal failures, leaving test files at /tmp/dist-test-task3ANG0c/test-tmp/rpc-test.6.Parameters_TestRpc.TestCallWithChainCertAndChainCA_SSL_UnixSocket.1790405913545552-3450-0
[ FAILED ] Parameters/TestRpc.TestCallWithChainCertAndChainCA/SSL_UnixSocket, where GetParam() = (true, true) (11 ms)
[ RUN ] Parameters/TestRpc.TestCallWithPasswordProtectedKey/SSL_UnixSocket
I20260926 06:58:33.632910 3512 acceptor_pool.cc:254] collecting diagnostics on the listening RPC socket unix:/tmp/dist-test-task3ANG0c/test-tmp/rpc-test-70e8eabf02594c138bdca73fc46e0b98.sock every 8 connection(s)
I20260926 06:58:33.632898 3511 acceptor_pool.cc:254] collecting diagnostics on the listening RPC socket unix:/tmp/dist-test-task3ANG0c/test-tmp/rpc-test-70e8eabf02594c138bdca73fc46e0b98.sock every 8 connection(s)
W20260926 06:58:33.644528 3508 connection.cc:196] Error closing socket: Network error: TlsSocket::Close: Broken pipe
[ OK ] Parameters/TestRpc.TestCallWithPasswordProtectedKey/SSL_UnixSocket (33 ms)
[ RUN ] Parameters/TestRpc.TestCallToBadServer/SSL_UnixSocket
I20260926 06:58:33.659447 3450 rpc-test.cc:394] Status: Network error: Client connection negotiation failed: client connection to 0.0.0.0:0: connect: Connection refused (error 111)
I20260926 06:58:33.659822 3450 rpc-test.cc:394] Status: Network error: Client connection negotiation failed: client connection to 0.0.0.0:0: connect: Connection refused (error 111)
I20260926 06:58:33.660099 3450 rpc-test.cc:394] Status: Network error: Client connection negotiation failed: client connection to 0.0.0.0:0: connect: Connection refused (error 111)
I20260926 06:58:33.660326 3450 rpc-test.cc:394] Status: Network error: Client connection negotiation failed: client connection to 0.0.0.0:0: connect: Connection refused (error 111)
I20260926 06:58:33.660521 3450 rpc-test.cc:394] Status: Network error: Client connection negotiation failed: client connection to 0.0.0.0:0: connect: Connection refused (error 111)
[ OK ] Parameters/TestRpc.TestCallToBadServer/SSL_UnixSocket (15 ms)
[ RUN ] Parameters/TestRpc.TestWrongService/SSL_UnixSocket
I20260926 06:58:33.688899 3546 acceptor_pool.cc:254] collecting diagnostics on the listening RPC socket unix:/tmp/dist-test-task3ANG0c/test-tmp/rpc-test-568da15a1de84d888a88ddf81fac68f9.sock every 8 connection(s)
I20260926 06:58:33.688948 3547 acceptor_pool.cc:254] collecting diagnostics on the listening RPC socket unix:/tmp/dist-test-task3ANG0c/test-tmp/rpc-test-568da15a1de84d888a88ddf81fac68f9.sock every 8 connection(s)
I20260926 06:58:33.706952 3543 messenger.cc:345] service WrongServiceName not registered on TestServer
[ OK ] Parameters/TestRpc.TestWrongService/SSL_UnixSocket (47 ms)
[ RUN ] Parameters/TestRpc.TestConnectionKeepalive/SSL_UnixSocket
I20260926 06:58:33.718235 3569 acceptor_pool.cc:254] collecting diagnostics on the listening RPC socket unix:/tmp/dist-test-task3ANG0c/test-tmp/rpc-test-c2ae535cd8084dd680a6ec99b42e093a.sock every 8 connection(s)
I20260926 06:58:33.718282 3570 acceptor_pool.cc:254] collecting diagnostics on the listening RPC socket unix:/tmp/dist-test-task3ANG0c/test-tmp/rpc-test-c2ae535cd8084dd680a6ec99b42e093a.sock every 8 connection(s)
I20260926 06:58:33.718474 3450 rpc-test.cc:488] Connecting to unix:/tmp/dist-test-task3ANG0c/test-tmp/rpc-test-c2ae535cd8084dd680a6ec99b42e093a.sock
W20260926 06:58:34.210011 3582 connection.cc:196] Error closing socket: Network error: TlsSocket::Close: Broken pipe
[ OK ] Parameters/TestRpc.TestConnectionKeepalive/SSL_UnixSocket (1031 ms)
[ RUN ] Parameters/TestRpc.TestClientConnectionMetrics/SSL_UnixSocket
I20260926 06:58:34.757893 3594 acceptor_pool.cc:254] collecting diagnostics on the listening RPC socket unix:/tmp/dist-test-task3ANG0c/test-tmp/rpc-test-89197c4ee2f04d9fb344e4666f15e1b4.sock every 8 connection(s)
I20260926 06:58:34.757947 3595 acceptor_pool.cc:254] collecting diagnostics on the listening RPC socket unix:/tmp/dist-test-task3ANG0c/test-tmp/rpc-test-89197c4ee2f04d9fb344e4666f15e1b4.sock every 8 connection(s)
I20260926 06:58:34.758111 3450 rpc-test.cc:569] Connecting to unix:/tmp/dist-test-task3ANG0c/test-tmp/rpc-test-89197c4ee2f04d9fb344e4666f15e1b4.sock
W20260926 06:58:43.272938 3591 connection.cc:196] Error closing socket: Network error: TlsSocket::Close: Broken pipe
[ OK ] Parameters/TestRpc.TestClientConnectionMetrics/SSL_UnixSocket (8533 ms)
[ RUN ] Parameters/TestRpc.TestCredentialsPolicy/SSL_UnixSocket
I20260926 06:58:43.284796 3617 acceptor_pool.cc:254] collecting diagnostics on the listening RPC socket unix:/tmp/dist-test-task3ANG0c/test-tmp/rpc-test-41332bdecb2f427bbfdbd7e7af600f42.sock every 8 connection(s)
I20260926 06:58:43.284843 3618 acceptor_pool.cc:254] collecting diagnostics on the listening RPC socket unix:/tmp/dist-test-task3ANG0c/test-tmp/rpc-test-41332bdecb2f427bbfdbd7e7af600f42.sock every 8 connection(s)
I20260926 06:58:43.285022 3450 rpc-test.cc:700] Connecting to unix:/tmp/dist-test-task3ANG0c/test-tmp/rpc-test-41332bdecb2f427bbfdbd7e7af600f42.sock
W20260926 06:58:43.315335 3616 connection.cc:196] Error closing socket: Network error: TlsSocket::Close: Broken pipe
[ OK ] Parameters/TestRpc.TestCredentialsPolicy/SSL_UnixSocket (46 ms)
[ RUN ] Parameters/TestRpc.TestCallLongerThanKeepalive/SSL_UnixSocket
I20260926 06:58:43.337858 3642 acceptor_pool.cc:254] collecting diagnostics on the listening RPC socket unix:/tmp/dist-test-task3ANG0c/test-tmp/rpc-test-763720ef38c34cb8a6e75e107f05a0f4.sock every 8 connection(s)
I20260926 06:58:43.337908 3643 acceptor_pool.cc:254] collecting diagnostics on the listening RPC socket unix:/tmp/dist-test-task3ANG0c/test-tmp/rpc-test-763720ef38c34cb8a6e75e107f05a0f4.sock every 8 connection(s)
I20260926 06:58:43.356727 3646 rpc-test-base.h:222] got call: sleep_micros: 3000000 deferred: true
I20260926 06:58:46.357462 3646 rpcz_store.cc:275] Call kudu.rpc.GenericCalculatorService.Sleep from unix:<unnamed> (request call id 0) took 3000 ms. Trace:
I20260926 06:58:46.357625 3646 rpcz_store.cc:276] 0926 06:58:43.356663 (+ 0us) service_pool.cc:170] Inserting onto call queue
0926 06:58:43.356703 (+ 40us) service_pool.cc:227] Handling call
0926 06:58:46.357441 (+3000738us) inbound_call.cc:173] Queueing success response
Metrics: {}
[ OK ] Parameters/TestRpc.TestCallLongerThanKeepalive/SSL_UnixSocket (3039 ms)
[ RUN ] Parameters/TestRpc.TestRpcSidecar/SSL_UnixSocket
I20260926 06:58:46.369203 3667 acceptor_pool.cc:254] collecting diagnostics on the listening RPC socket unix:/tmp/dist-test-task3ANG0c/test-tmp/rpc-test-cda5908f57e24ca990f29b7db3acc2a8.sock every 8 connection(s)
I20260926 06:58:46.369313 3668 acceptor_pool.cc:254] collecting diagnostics on the listening RPC socket unix:/tmp/dist-test-task3ANG0c/test-tmp/rpc-test-cda5908f57e24ca990f29b7db3acc2a8.sock every 8 connection(s)
W20260926 06:58:46.422634 3664 connection.cc:196] Error closing socket: Network error: TlsSocket::Close: Broken pipe
[ OK ] Parameters/TestRpc.TestRpcSidecar/SSL_UnixSocket (63 ms)
[ RUN ] Parameters/TestRpc.TestRpcSidecarLimits/SSL_UnixSocket
I20260926 06:58:48.147876 3692 acceptor_pool.cc:254] collecting diagnostics on the listening RPC socket unix:/tmp/dist-test-task3ANG0c/test-tmp/rpc-test-12fd24792b8c45f9bc77c673c4e6a530.sock every 8 connection(s)
I20260926 06:58:48.147898 3693 acceptor_pool.cc:254] collecting diagnostics on the listening RPC socket unix:/tmp/dist-test-task3ANG0c/test-tmp/rpc-test-12fd24792b8c45f9bc77c673c4e6a530.sock every 8 connection(s)
W20260926 06:58:48.156286 3450 serialization.cc:72] Serialized kudu.rpc_test.PushStringsRequestPB (2147483654 bytes) is larger than the maximum configured RPC message size (52428800 bytes). Sending anyway, but peer may reject the data.
W20260926 06:58:48.159564 3689 connection.cc:535] server connection from unix:<unnamed> recv error: Network error: RPC frame had a length of 2147483714, but we only support messages up to 52428800 bytes long.
W20260926 06:58:48.159637 3689 connection.cc:158] shutting down server connection from unix:<unnamed> with pending inbound data: 4/2147483714 bytes received; last active 0 ns ago: status Network error: RPC frame had a length of 2147483714, but we only support messages up to 52428800 bytes long.
W20260926 06:58:48.159875 3705 connection.cc:196] Error closing socket: Network error: TlsSocket::Close: Broken pipe
I20260926 06:58:48.168089 3717 acceptor_pool.cc:254] collecting diagnostics on the listening RPC socket unix:/tmp/dist-test-task3ANG0c/test-tmp/rpc-test-12fd24792b8c45f9bc77c673c4e6a530.sock every 8 connection(s)
I20260926 06:58:48.168164 3718 acceptor_pool.cc:254] collecting diagnostics on the listening RPC socket unix:/tmp/dist-test-task3ANG0c/test-tmp/rpc-test-12fd24792b8c45f9bc77c673c4e6a530.sock every 8 connection(s)
W20260926 06:58:52.476409 3714 connection.cc:577] server connection from unix:<unnamed>: received bad data: 'Corruption: Invalid packet: message had a length of 2147483710, but we only support messages up to 2147483647 bytes
'
W20260926 06:58:52.477056 3730 connection.cc:196] Error closing socket: Network error: TlsSocket::Close: Broken pipe
[ OK ] Parameters/TestRpc.TestRpcSidecarLimits/SSL_UnixSocket (6054 ms)
[ RUN ] Parameters/TestRpc.TestCallTimeoutDoesntAffectNegotiation/SSL_UnixSocket
I20260926 06:58:52.502605 3742 acceptor_pool.cc:254] collecting diagnostics on the listening RPC socket unix:/tmp/dist-test-task3ANG0c/test-tmp/rpc-test-3de35c5986c64963a2116486dfff70ce.sock every 8 connection(s)
I20260926 06:58:52.502668 3743 acceptor_pool.cc:254] collecting diagnostics on the listening RPC socket unix:/tmp/dist-test-task3ANG0c/test-tmp/rpc-test-3de35c5986c64963a2116486dfff70ce.sock every 8 connection(s)
W20260926 06:58:52.514421 3738 negotiation.cc:266] Injecting 500ms delay in negotiation
I20260926 06:58:52.564810 3450 rpc-test-base.h:595] status: Timed out: connection negotiation to unix:/tmp/dist-test-task3ANG0c/test-tmp/rpc-test-3de35c5986c64963a2116486dfff70ce.sock for RPC Sleep timed out after 0.050s (ON_OUTBOUND_QUEUE), seconds elapsed: 0.0507372
[ OK ] Parameters/TestRpc.TestCallTimeoutDoesntAffectNegotiation/SSL_UnixSocket (540 ms)
[ RUN ] Parameters/TestRpc.TestRpcHandlerLatencyMetric/SSL_UnixSocket
I20260926 06:58:53.031946 3767 acceptor_pool.cc:254] collecting diagnostics on the listening RPC socket unix:/tmp/dist-test-task3ANG0c/test-tmp/rpc-test-2dd2bb75383f46acab733b26bdc0d76e.sock every 8 connection(s)
I20260926 06:58:53.031971 3768 acceptor_pool.cc:254] collecting diagnostics on the listening RPC socket unix:/tmp/dist-test-task3ANG0c/test-tmp/rpc-test-2dd2bb75383f46acab733b26bdc0d76e.sock every 8 connection(s)
I20260926 06:58:53.066196 3450 rpc-test.cc:1236] Sleep() min lat: 20339
I20260926 06:58:53.066273 3450 rpc-test.cc:1237] Sleep() mean lat: 20339
I20260926 06:58:53.066298 3450 rpc-test.cc:1238] Sleep() max lat: 20339
I20260926 06:58:53.066313 3450 rpc-test.cc:1239] Sleep() #calls: 1
[ OK ] Parameters/TestRpc.TestRpcHandlerLatencyMetric/SSL_UnixSocket (48 ms)
[ RUN ] Parameters/TestRpc.TimedOutOnResponseMetricServiceQueue/SSL_UnixSocket
I20260926 06:58:53.082970 3793 acceptor_pool.cc:254] collecting diagnostics on the listening RPC socket unix:/tmp/dist-test-task3ANG0c/test-tmp/rpc-test-6c830713c46c46cbba12b08066dc7610.sock every 8 connection(s)
I20260926 06:58:53.083029 3794 acceptor_pool.cc:254] collecting diagnostics on the listening RPC socket unix:/tmp/dist-test-task3ANG0c/test-tmp/rpc-test-6c830713c46c46cbba12b08066dc7610.sock every 8 connection(s)
W20260926 06:58:53.139657 3795 rpcz_store.cc:267] Call kudu.rpc_test.CalculatorService.Sleep from unix:<unnamed> (request call id 2) took 20 ms (client timeout 20 ms). Trace:
W20260926 06:58:53.139806 3795 rpcz_store.cc:269] 0926 06:58:53.119335 (+ 0us) service_pool.cc:170] Inserting onto call queue
0926 06:58:53.139605 (+ 20270us) service_pool.cc:214] Skipping call since client already timed out
0926 06:58:53.139617 (+ 12us) inbound_call.cc:173] Queueing failure response
Metrics: {}
[ OK ] Parameters/TestRpc.TimedOutOnResponseMetricServiceQueue/SSL_UnixSocket (73 ms)
[ RUN ] Parameters/TestRpc.RpcPendingConnectionsMetric/SSL_UnixSocket
I20260926 06:58:53.143052 3816 acceptor_pool.cc:254] collecting diagnostics on the listening RPC socket 0.0.0.0:36225 every 8 connection(s)
I20260926 06:58:53.143116 3817 acceptor_pool.cc:254] collecting diagnostics on the listening RPC socket 0.0.0.0:36225 every 8 connection(s)
W20260926 06:58:53.143766 3812 negotiation.cc:337] Failed RPC negotiation. Trace:
0926 06:58:53.143528 (+ 0us) reactor.cc:625] Submitting negotiation task for server connection from 127.0.0.1:45858 (local address 127.0.0.1:36225)
0926 06:58:53.143577 (+ 49us) server_negotiation.cc:206] Beginning negotiation
0926 06:58:53.143579 (+ 2us) server_negotiation.cc:399] Waiting for connection header
0926 06:58:53.143652 (+ 73us) negotiation.cc:327] Negotiation complete: Network error: Server connection negotiation failed: server connection from 127.0.0.1:45858: BlockingRecv error: recv got EOF from 127.0.0.1:45858 (error 108)
Metrics: {"server-negotiator.queue_time_us":14}
[ OK ] Parameters/TestRpc.RpcPendingConnectionsMetric/SSL_UnixSocket (13 ms)
[ RUN ] Parameters/TestRpc.TestRpcContextClientDeadline/SSL_UnixSocket
I20260926 06:58:53.185364 3832 acceptor_pool.cc:254] collecting diagnostics on the listening RPC socket unix:/tmp/dist-test-task3ANG0c/test-tmp/rpc-test-7954950c6a544c37be357e16e56563e0.sock every 8 connection(s)
I20260926 06:58:53.185408 3833 acceptor_pool.cc:254] collecting diagnostics on the listening RPC socket unix:/tmp/dist-test-task3ANG0c/test-tmp/rpc-test-7954950c6a544c37be357e16e56563e0.sock every 8 connection(s)
[ OK ] Parameters/TestRpc.TestRpcContextClientDeadline/SSL_UnixSocket (68 ms)
[ RUN ] Parameters/TestRpc.TestApplicationFeatureFlagUnsupportedServer/SSL_UnixSocket
I20260926 06:58:53.233786 3857 acceptor_pool.cc:254] collecting diagnostics on the listening RPC socket unix:/tmp/dist-test-task3ANG0c/test-tmp/rpc-test-f9b7594e6e354aec9b7621102cf8d338.sock every 8 connection(s)
I20260926 06:58:53.233829 3858 acceptor_pool.cc:254] collecting diagnostics on the listening RPC socket unix:/tmp/dist-test-task3ANG0c/test-tmp/rpc-test-f9b7594e6e354aec9b7621102cf8d338.sock every 8 connection(s)
W20260926 06:58:53.251137 3854 connection.cc:196] Error closing socket: Network error: TlsSocket::Close: Broken pipe
[ OK ] Parameters/TestRpc.TestApplicationFeatureFlagUnsupportedServer/SSL_UnixSocket (28 ms)
[ RUN ] Parameters/TestRpc.TestCancellationAsync/SSL_UnixSocket
I20260926 06:58:53.266438 3882 acceptor_pool.cc:254] collecting diagnostics on the listening RPC socket unix:/tmp/dist-test-task3ANG0c/test-tmp/rpc-test-1df4c51a5950430c98a02198f7025ada.sock every 8 connection(s)
I20260926 06:58:53.266475 3883 acceptor_pool.cc:254] collecting diagnostics on the listening RPC socket unix:/tmp/dist-test-task3ANG0c/test-tmp/rpc-test-1df4c51a5950430c98a02198f7025ada.sock every 8 connection(s)
I20260926 06:58:53.266644 3450 rpc-test.cc:1716] Connecting to unix:/tmp/dist-test-task3ANG0c/test-tmp/rpc-test-1df4c51a5950430c98a02198f7025ada.sock
I20260926 06:58:53.290513 3450 test_util.cc:268] Using random seed: 1571312654
I20260926 06:58:53.311511 3886 rpc-test-base.h:240] got call: sleep_micros: 500 pattern: 4294967295 num_repetitions: 2097152 sidecar_idx: 0
I20260926 06:58:53.324935 3886 rpc-test-base.h:240] got call: sleep_micros: 500 pattern: 4294967295 num_repetitions: 2097152 sidecar_idx: 0
I20260926 06:58:53.337445 3886 rpc-test-base.h:240] got call: sleep_micros: 500 pattern: 4294967295 num_repetitions: 2097152 sidecar_idx: 0
I20260926 06:58:53.347931 3886 rpc-test-base.h:240] got call: sleep_micros: 500 pattern: 4294967295 num_repetitions: 2097152 sidecar_idx: 0
I20260926 06:58:53.360859 3886 rpc-test-base.h:240] got call: sleep_micros: 500 pattern: 4294967295 num_repetitions: 2097152 sidecar_idx: 0
I20260926 06:58:53.374024 3886 rpc-test-base.h:240] got call: sleep_micros: 500 pattern: 4294967295 num_repetitions: 2097152 sidecar_idx: 0
I20260926 06:58:53.387524 3886 rpc-test-base.h:240] got call: sleep_micros: 500 pattern: 4294967295 num_repetitions: 2097152 sidecar_idx: 0
W20260926 06:58:53.389091 3879 connection.cc:196] Error closing socket: Network error: TlsSocket::Close: Broken pipe
W20260926 06:58:53.390615 3879 connection.cc:441] server connection from unix:<unnamed> torn down before Call kudu.rpc.GenericCalculatorService.SleepWithSidecar from unix:<unnamed> (request call id 9) could send its response
[ OK ] Parameters/TestRpc.TestCancellationAsync/SSL_UnixSocket (139 ms)
[ RUN ] Parameters/TestRpc.TestPerformanceBySocketType/SSL_UnixSocket
I20260926 06:58:53.408049 3907 acceptor_pool.cc:254] collecting diagnostics on the listening RPC socket unix:/tmp/dist-test-task3ANG0c/test-tmp/rpc-test-8b1168490489445dab2bae1068484c3e.sock every 8 connection(s)
I20260926 06:58:53.408074 3908 acceptor_pool.cc:254] collecting diagnostics on the listening RPC socket unix:/tmp/dist-test-task3ANG0c/test-tmp/rpc-test-8b1168490489445dab2bae1068484c3e.sock every 8 connection(s)
I20260926 06:58:53.408267 3450 rpc-test.cc:1846] Connecting to unix:/tmp/dist-test-task3ANG0c/test-tmp/rpc-test-8b1168490489445dab2bae1068484c3e.sock
I20260926 06:58:54.709407 3450 rpc-test.cc:1859] Sending 1024MB via ssl-enabled unix socket: real 1.277s user 1.380s sys 0.910s
I20260926 06:58:55.975057 3450 rpc-test.cc:1859] Sending 1024MB via ssl-enabled unix socket: real 1.266s user 1.412s sys 0.866s
I20260926 06:58:57.203330 3450 rpc-test.cc:1859] Sending 1024MB via ssl-enabled unix socket: real 1.228s user 1.341s sys 0.873s
I20260926 06:58:58.405666 3450 rpc-test.cc:1859] Sending 1024MB via ssl-enabled unix socket: real 1.202s user 1.291s sys 0.876s
I20260926 06:58:59.580300 3450 rpc-test.cc:1859] Sending 1024MB via ssl-enabled unix socket: real 1.175s user 1.266s sys 0.858s
W20260926 06:58:59.581107 3904 connection.cc:196] Error closing socket: Network error: TlsSocket::Close: Broken pipe
[ OK ] Parameters/TestRpc.TestPerformanceBySocketType/SSL_UnixSocket (6190 ms)
[----------] 20 tests from Parameters/TestRpc (26034 ms total)
[----------] 1 test from Parameters/TestRpcSocketTxRxQueue
[ RUN ] Parameters/TestRpcSocketTxRxQueue.AcceptorRxQueueSizeMetric/0
I20260926 06:58:59.587683 3932 acceptor_pool.cc:254] collecting diagnostics on the listening RPC socket 0.0.0.0:46345 every 1 connection(s)
I20260926 06:58:59.587790 3933 acceptor_pool.cc:254] collecting diagnostics on the listening RPC socket 0.0.0.0:46345 every 1 connection(s)
W20260926 06:58:59.588321 3928 negotiation.cc:337] Failed RPC negotiation. Trace:
0926 06:58:59.588179 (+ 0us) reactor.cc:625] Submitting negotiation task for server connection from 127.0.0.1:50608 (local address 127.0.0.1:46345)
0926 06:58:59.588222 (+ 43us) server_negotiation.cc:206] Beginning negotiation
0926 06:58:59.588224 (+ 2us) server_negotiation.cc:399] Waiting for connection header
0926 06:58:59.588290 (+ 66us) negotiation.cc:327] Negotiation complete: Network error: Server connection negotiation failed: server connection from 127.0.0.1:50608: BlockingRecv error: recv got EOF from 127.0.0.1:50608 (error 108)
Metrics: {"server-negotiator.queue_time_us":15}
[ OK ] Parameters/TestRpcSocketTxRxQueue.AcceptorRxQueueSizeMetric/0 (8 ms)
[----------] 1 test from Parameters/TestRpcSocketTxRxQueue (8 ms total)
[----------] Global test environment tear-down
[==========] 21 tests from 2 test suites ran. (26042 ms total)
[ PASSED ] 20 tests.
[ FAILED ] 1 test, listed below:
[ FAILED ] Parameters/TestRpc.TestCallWithChainCertAndChainCA/SSL_UnixSocket, where GetParam() = (true, true)
1 FAILED TEST