Diagnosed failure
Parameters/TestRpc.TestCallWithChainCertAndChainCA/SSL_TCP: /data0/somelongdirectorytoavoidrpathissues/src/kudu/src/kudu/rpc/rpc-test.cc:270: Failure
Failed
Bad status: Runtime error: could not verify certificate chain (error with cert: subject=CN = localhost, ST = sadfjas, C = AS, emailAddress = sdflkdsajf, O = lskdfjlsad, OU = sldfkja, issuer=C = AS, ST = ASDfkjdhf, L = lskdjf, O = saldfja, OU = skdjf, CN = localhost, emailAddress = sadjflkadsj): : certificate has expired
Google Test trace:
/data0/somelongdirectorytoavoidrpathissues/src/kudu/src/kudu/rpc/rpc-test.cc:267: Connecting to 0.0.0.0:32777
I20260928 05:51:27.500494 379 test_util.cc:175] -----------------------------------------------
I20260928 05:51:27.500560 379 test_util.cc:176] Had fatal failures, leaving test files at /tmp/dist-test-taskNwdd8B/test-tmp/rpc-test.5.Parameters_TestRpc.TestCallWithChainCertAndChainCA_SSL_TCP.1790574687399360-379-0
Full log
Note: This is test shard 6 of 8.
[==========] Running 21 tests from 2 test suites.
[----------] Global test environment set-up.
[----------] 20 tests from Parameters/TestRpc
[ RUN ] Parameters/TestRpc.TestMessengerCreateDestroy/SSL_TCP
WARNING: Logging before InitGoogleLogging() is written to STDERR
I20260928 05:51:27.442744 379 rpc-test.cc:169] started messenger TestCreateDestroy
[ OK ] Parameters/TestRpc.TestMessengerCreateDestroy/SSL_TCP (28 ms)
[ RUN ] Parameters/TestRpc.TestNegotiationDeadlock/SSL_TCP
I20260928 05:51:27.458055 399 acceptor_pool.cc:254] collecting diagnostics on the listening RPC socket 0.0.0.0:40345 every 8 connection(s)
I20260928 05:51:27.458298 400 acceptor_pool.cc:254] collecting diagnostics on the listening RPC socket 0.0.0.0:40345 every 8 connection(s)
[ OK ] Parameters/TestRpc.TestNegotiationDeadlock/SSL_TCP (33 ms)
[ RUN ] Parameters/TestRpc.TestCallWithChainCertAndChainCA/SSL_TCP
I20260928 05:51:27.490851 415 acceptor_pool.cc:254] collecting diagnostics on the listening RPC socket 0.0.0.0:32777 every 8 connection(s)
I20260928 05:51:27.491127 416 acceptor_pool.cc:254] collecting diagnostics on the listening RPC socket 0.0.0.0:32777 every 8 connection(s)
/data0/somelongdirectorytoavoidrpathissues/src/kudu/src/kudu/rpc/rpc-test.cc:270: Failure
Failed
Bad status: Runtime error: could not verify certificate chain (error with cert: subject=CN = localhost, ST = sadfjas, C = AS, emailAddress = sdflkdsajf, O = lskdfjlsad, OU = sldfkja, issuer=C = AS, ST = ASDfkjdhf, L = lskdjf, O = saldfja, OU = skdjf, CN = localhost, emailAddress = sadjflkadsj): : certificate has expired
Google Test trace:
/data0/somelongdirectorytoavoidrpathissues/src/kudu/src/kudu/rpc/rpc-test.cc:267: Connecting to 0.0.0.0:32777
I20260928 05:51:27.500494 379 test_util.cc:175] -----------------------------------------------
I20260928 05:51:27.500560 379 test_util.cc:176] Had fatal failures, leaving test files at /tmp/dist-test-taskNwdd8B/test-tmp/rpc-test.5.Parameters_TestRpc.TestCallWithChainCertAndChainCA_SSL_TCP.1790574687399360-379-0
[ FAILED ] Parameters/TestRpc.TestCallWithChainCertAndChainCA/SSL_TCP, where GetParam() = (true, false) (21 ms)
[ RUN ] Parameters/TestRpc.TestCallWithPasswordProtectedKey/SSL_TCP
I20260928 05:51:27.523191 440 acceptor_pool.cc:254] collecting diagnostics on the listening RPC socket 0.0.0.0:40549 every 8 connection(s)
I20260928 05:51:27.523398 441 acceptor_pool.cc:254] collecting diagnostics on the listening RPC socket 0.0.0.0:40549 every 8 connection(s)
[ OK ] Parameters/TestRpc.TestCallWithPasswordProtectedKey/SSL_TCP (52 ms)
[ RUN ] Parameters/TestRpc.TestCallToBadServer/SSL_TCP
I20260928 05:51:27.563589 379 rpc-test.cc:394] Status: Network error: Client connection negotiation failed: client connection to 0.0.0.0:0: connect: Connection refused (error 111)
I20260928 05:51:27.564239 379 rpc-test.cc:394] Status: Network error: Client connection negotiation failed: client connection to 0.0.0.0:0: connect: Connection refused (error 111)
I20260928 05:51:27.564775 379 rpc-test.cc:394] Status: Network error: Client connection negotiation failed: client connection to 0.0.0.0:0: connect: Connection refused (error 111)
I20260928 05:51:27.565270 379 rpc-test.cc:394] Status: Network error: Client connection negotiation failed: client connection to 0.0.0.0:0: connect: Connection refused (error 111)
I20260928 05:51:27.565775 379 rpc-test.cc:394] Status: Network error: Client connection negotiation failed: client connection to 0.0.0.0:0: connect: Connection refused (error 111)
[ OK ] Parameters/TestRpc.TestCallToBadServer/SSL_TCP (13 ms)
[ RUN ] Parameters/TestRpc.TestWrongService/SSL_TCP
I20260928 05:51:27.580209 475 acceptor_pool.cc:254] collecting diagnostics on the listening RPC socket 0.0.0.0:39451 every 8 connection(s)
I20260928 05:51:27.580478 476 acceptor_pool.cc:254] collecting diagnostics on the listening RPC socket 0.0.0.0:39451 every 8 connection(s)
I20260928 05:51:27.593502 473 messenger.cc:345] service WrongServiceName not registered on TestServer
[ OK ] Parameters/TestRpc.TestWrongService/SSL_TCP (30 ms)
[ RUN ] Parameters/TestRpc.TestConnectionKeepalive/SSL_TCP
I20260928 05:51:27.612619 498 acceptor_pool.cc:254] collecting diagnostics on the listening RPC socket 0.0.0.0:45475 every 8 connection(s)
I20260928 05:51:27.612854 499 acceptor_pool.cc:254] collecting diagnostics on the listening RPC socket 0.0.0.0:45475 every 8 connection(s)
I20260928 05:51:27.613574 379 rpc-test.cc:488] Connecting to 0.0.0.0:45475
[ OK ] Parameters/TestRpc.TestConnectionKeepalive/SSL_TCP (1042 ms)
[ RUN ] Parameters/TestRpc.TestClientConnectionMetrics/SSL_TCP
I20260928 05:51:28.667642 523 acceptor_pool.cc:254] collecting diagnostics on the listening RPC socket 0.0.0.0:42091 every 8 connection(s)
I20260928 05:51:28.667862 524 acceptor_pool.cc:254] collecting diagnostics on the listening RPC socket 0.0.0.0:42091 every 8 connection(s)
I20260928 05:51:28.668705 379 rpc-test.cc:569] Connecting to 0.0.0.0:42091
[ OK ] Parameters/TestRpc.TestClientConnectionMetrics/SSL_TCP (17333 ms)
[ RUN ] Parameters/TestRpc.TestCredentialsPolicy/SSL_TCP
I20260928 05:51:45.986231 546 acceptor_pool.cc:254] collecting diagnostics on the listening RPC socket 0.0.0.0:44915 every 8 connection(s)
I20260928 05:51:45.986441 547 acceptor_pool.cc:254] collecting diagnostics on the listening RPC socket 0.0.0.0:44915 every 8 connection(s)
I20260928 05:51:45.987254 379 rpc-test.cc:700] Connecting to 0.0.0.0:44915
[ OK ] Parameters/TestRpc.TestCredentialsPolicy/SSL_TCP (64 ms)
[ RUN ] Parameters/TestRpc.TestCallLongerThanKeepalive/SSL_TCP
I20260928 05:51:46.051720 571 acceptor_pool.cc:254] collecting diagnostics on the listening RPC socket 0.0.0.0:34627 every 8 connection(s)
I20260928 05:51:46.051916 572 acceptor_pool.cc:254] collecting diagnostics on the listening RPC socket 0.0.0.0:34627 every 8 connection(s)
I20260928 05:51:46.080305 575 rpc-test-base.h:222] got call: sleep_micros: 3000000 deferred: true
I20260928 05:51:49.081802 575 rpcz_store.cc:275] Call kudu.rpc.GenericCalculatorService.Sleep from 127.0.0.1:51624 (request call id 0) took 3001 ms. Trace:
I20260928 05:51:49.081938 575 rpcz_store.cc:276] 0928 05:51:46.080225 (+ 0us) service_pool.cc:170] Inserting onto call queue
0928 05:51:46.080271 (+ 46us) service_pool.cc:227] Handling call
0928 05:51:49.081765 (+3001494us) inbound_call.cc:173] Queueing success response
Metrics: {}
[ OK ] Parameters/TestRpc.TestCallLongerThanKeepalive/SSL_TCP (3049 ms)
[ RUN ] Parameters/TestRpc.TestRpcSidecar/SSL_TCP
I20260928 05:51:49.110208 596 acceptor_pool.cc:254] collecting diagnostics on the listening RPC socket 0.0.0.0:44639 every 8 connection(s)
I20260928 05:51:49.110410 597 acceptor_pool.cc:254] collecting diagnostics on the listening RPC socket 0.0.0.0:44639 every 8 connection(s)
[ OK ] Parameters/TestRpc.TestRpcSidecar/SSL_TCP (122 ms)
[ RUN ] Parameters/TestRpc.TestRpcSidecarLimits/SSL_TCP
I20260928 05:51:51.190071 621 acceptor_pool.cc:254] collecting diagnostics on the listening RPC socket 0.0.0.0:35819 every 8 connection(s)
I20260928 05:51:51.190348 622 acceptor_pool.cc:254] collecting diagnostics on the listening RPC socket 0.0.0.0:35819 every 8 connection(s)
W20260928 05:51:51.209052 379 serialization.cc:72] Serialized kudu.rpc_test.PushStringsRequestPB (2147483654 bytes) is larger than the maximum configured RPC message size (52428800 bytes). Sending anyway, but peer may reject the data.
W20260928 05:51:51.214485 620 connection.cc:535] server connection from 127.0.0.1:50110 recv error: Network error: RPC frame had a length of 2147483714, but we only support messages up to 52428800 bytes long.
W20260928 05:51:51.214579 620 connection.cc:158] shutting down server connection from 127.0.0.1:50110 with pending inbound data: 4/2147483714 bytes received; last active 0 ns ago: status Network error: RPC frame had a length of 2147483714, but we only support messages up to 52428800 bytes long.
W20260928 05:51:51.214979 634 connection.cc:196] Error closing socket: Network error: TlsSocket::Close: Connection reset by peer
I20260928 05:51:51.230717 646 acceptor_pool.cc:254] collecting diagnostics on the listening RPC socket 0.0.0.0:33777 every 8 connection(s)
I20260928 05:51:51.231086 647 acceptor_pool.cc:254] collecting diagnostics on the listening RPC socket 0.0.0.0:33777 every 8 connection(s)
W20260928 05:51:55.953943 643 connection.cc:577] server connection from 127.0.0.1:53178: received bad data: 'Corruption: Invalid packet: message had a length of 2147483710, but we only support messages up to 2147483647 bytes
'
[ OK ] Parameters/TestRpc.TestRpcSidecarLimits/SSL_TCP (7173 ms)
[ RUN ] Parameters/TestRpc.TestCallTimeoutDoesntAffectNegotiation/SSL_TCP
I20260928 05:51:56.416913 671 acceptor_pool.cc:254] collecting diagnostics on the listening RPC socket 0.0.0.0:39539 every 8 connection(s)
I20260928 05:51:56.417146 672 acceptor_pool.cc:254] collecting diagnostics on the listening RPC socket 0.0.0.0:39539 every 8 connection(s)
W20260928 05:51:56.448184 667 negotiation.cc:266] Injecting 500ms delay in negotiation
I20260928 05:51:56.498435 379 rpc-test-base.h:595] status: Timed out: connection negotiation to 0.0.0.0:39539 for RPC Sleep timed out after 0.050s (ON_OUTBOUND_QUEUE), seconds elapsed: 0.0507903
[ OK ] Parameters/TestRpc.TestCallTimeoutDoesntAffectNegotiation/SSL_TCP (574 ms)
[ RUN ] Parameters/TestRpc.TestRpcHandlerLatencyMetric/SSL_TCP
I20260928 05:51:56.965480 696 acceptor_pool.cc:254] collecting diagnostics on the listening RPC socket 0.0.0.0:42721 every 8 connection(s)
I20260928 05:51:56.965655 697 acceptor_pool.cc:254] collecting diagnostics on the listening RPC socket 0.0.0.0:42721 every 8 connection(s)
I20260928 05:51:57.009065 379 rpc-test.cc:1236] Sleep() min lat: 20484
I20260928 05:51:57.009133 379 rpc-test.cc:1237] Sleep() mean lat: 20484
I20260928 05:51:57.009203 379 rpc-test.cc:1238] Sleep() max lat: 20484
I20260928 05:51:57.009258 379 rpc-test.cc:1239] Sleep() #calls: 1
[ OK ] Parameters/TestRpc.TestRpcHandlerLatencyMetric/SSL_TCP (55 ms)
[ RUN ] Parameters/TestRpc.TimedOutOnResponseMetricServiceQueue/SSL_TCP
I20260928 05:51:57.032255 722 acceptor_pool.cc:254] collecting diagnostics on the listening RPC socket 0.0.0.0:41913 every 8 connection(s)
I20260928 05:51:57.032482 723 acceptor_pool.cc:254] collecting diagnostics on the listening RPC socket 0.0.0.0:41913 every 8 connection(s)
W20260928 05:51:57.090471 724 rpcz_store.cc:267] Call kudu.rpc_test.CalculatorService.Sleep from 127.0.0.1:54174 (request call id 2) took 20 ms (client timeout 20 ms). Trace:
W20260928 05:51:57.090575 724 rpcz_store.cc:269] 0928 05:51:57.070227 (+ 0us) service_pool.cc:170] Inserting onto call queue
0928 05:51:57.090413 (+ 20186us) service_pool.cc:214] Skipping call since client already timed out
0928 05:51:57.090445 (+ 32us) inbound_call.cc:173] Queueing failure response
Metrics: {}
[ OK ] Parameters/TestRpc.TimedOutOnResponseMetricServiceQueue/SSL_TCP (80 ms)
[ RUN ] Parameters/TestRpc.RpcPendingConnectionsMetric/SSL_TCP
I20260928 05:51:57.097407 745 acceptor_pool.cc:254] collecting diagnostics on the listening RPC socket 0.0.0.0:46479 every 8 connection(s)
I20260928 05:51:57.097595 746 acceptor_pool.cc:254] collecting diagnostics on the listening RPC socket 0.0.0.0:46479 every 8 connection(s)
W20260928 05:51:57.107049 741 negotiation.cc:337] Failed RPC negotiation. Trace:
0928 05:51:57.106375 (+ 0us) reactor.cc:625] Submitting negotiation task for server connection from 127.0.0.1:60398 (local address 127.0.0.1:46479)
0928 05:51:57.106525 (+ 150us) server_negotiation.cc:206] Beginning negotiation
0928 05:51:57.106530 (+ 5us) server_negotiation.cc:399] Waiting for connection header
0928 05:51:57.106684 (+ 154us) negotiation.cc:327] Negotiation complete: Network error: Server connection negotiation failed: server connection from 127.0.0.1:60398: BlockingRecv error: recv got EOF from 127.0.0.1:60398 (error 108)
Metrics: {"server-negotiator.queue_time_us":48}
[ OK ] Parameters/TestRpc.RpcPendingConnectionsMetric/SSL_TCP (24 ms)
[ RUN ] Parameters/TestRpc.TestRpcContextClientDeadline/SSL_TCP
I20260928 05:51:57.134219 761 acceptor_pool.cc:254] collecting diagnostics on the listening RPC socket 0.0.0.0:45177 every 8 connection(s)
I20260928 05:51:57.134408 762 acceptor_pool.cc:254] collecting diagnostics on the listening RPC socket 0.0.0.0:45177 every 8 connection(s)
[ OK ] Parameters/TestRpc.TestRpcContextClientDeadline/SSL_TCP (61 ms)
[ RUN ] Parameters/TestRpc.TestApplicationFeatureFlagUnsupportedServer/SSL_TCP
I20260928 05:51:57.203691 786 acceptor_pool.cc:254] collecting diagnostics on the listening RPC socket 0.0.0.0:36279 every 8 connection(s)
I20260928 05:51:57.203902 787 acceptor_pool.cc:254] collecting diagnostics on the listening RPC socket 0.0.0.0:36279 every 8 connection(s)
[ OK ] Parameters/TestRpc.TestApplicationFeatureFlagUnsupportedServer/SSL_TCP (40 ms)
[ RUN ] Parameters/TestRpc.TestCancellationAsync/SSL_TCP
I20260928 05:51:57.231567 811 acceptor_pool.cc:254] collecting diagnostics on the listening RPC socket 0.0.0.0:34285 every 8 connection(s)
I20260928 05:51:57.231762 812 acceptor_pool.cc:254] collecting diagnostics on the listening RPC socket 0.0.0.0:34285 every 8 connection(s)
I20260928 05:51:57.232438 379 rpc-test.cc:1716] Connecting to 0.0.0.0:34285
I20260928 05:51:57.242290 379 test_util.cc:268] Using random seed: -1443427430
I20260928 05:51:57.280285 815 rpc-test-base.h:240] got call: sleep_micros: 500 pattern: 4294967295 num_repetitions: 2097152 sidecar_idx: 0
I20260928 05:51:57.307178 814 rpc-test-base.h:240] got call: sleep_micros: 500 pattern: 4294967295 num_repetitions: 2097152 sidecar_idx: 0
I20260928 05:51:57.334219 815 rpc-test-base.h:240] got call: sleep_micros: 500 pattern: 4294967295 num_repetitions: 2097152 sidecar_idx: 0
I20260928 05:51:57.361241 814 rpc-test-base.h:240] got call: sleep_micros: 500 pattern: 4294967295 num_repetitions: 2097152 sidecar_idx: 0
I20260928 05:51:57.386729 815 rpc-test-base.h:240] got call: sleep_micros: 500 pattern: 4294967295 num_repetitions: 2097152 sidecar_idx: 0
I20260928 05:51:57.410813 813 rpc-test-base.h:240] got call: sleep_micros: 500 pattern: 4294967295 num_repetitions: 2097152 sidecar_idx: 0
W20260928 05:51:57.433518 808 connection.cc:698] server connection from 127.0.0.1:47386 send error: Network error: failed to write to TLS socket: Connection reset by peer
W20260928 05:51:57.433691 808 connection.cc:441] server connection from 127.0.0.1:47386 torn down before Call kudu.rpc.GenericCalculatorService.SleepWithSidecar from 127.0.0.1:47386 (request call id 9) could send its response
W20260928 05:51:57.433992 808 connection.cc:196] Error closing socket: Network error: TlsSocket::Close: Success
W20260928 05:51:57.438930 808 connection.cc:441] server connection from 127.0.0.1:47386 torn down before Call kudu.rpc.GenericCalculatorService.SleepWithSidecar from 127.0.0.1:47386 (request call id 7) could send its response
W20260928 05:51:57.452087 808 connection.cc:441] server connection from 127.0.0.1:47386 torn down before Call kudu.rpc.GenericCalculatorService.SleepWithSidecar from 127.0.0.1:47386 (request call id 8) could send its response
[ OK ] Parameters/TestRpc.TestCancellationAsync/SSL_TCP (233 ms)
[ RUN ] Parameters/TestRpc.TestPerformanceBySocketType/SSL_TCP
I20260928 05:51:57.486810 836 acceptor_pool.cc:254] collecting diagnostics on the listening RPC socket 0.0.0.0:35381 every 8 connection(s)
I20260928 05:51:57.487051 837 acceptor_pool.cc:254] collecting diagnostics on the listening RPC socket 0.0.0.0:35381 every 8 connection(s)
I20260928 05:51:57.487838 379 rpc-test.cc:1846] Connecting to 0.0.0.0:35381
I20260928 05:52:00.032569 379 rpc-test.cc:1859] Sending 1024MB via ssl-enabled tcp socket: real 2.530s user 2.314s sys 1.920s
I20260928 05:52:02.555388 379 rpc-test.cc:1859] Sending 1024MB via ssl-enabled tcp socket: real 2.523s user 2.409s sys 1.779s
I20260928 05:52:05.073040 379 rpc-test.cc:1859] Sending 1024MB via ssl-enabled tcp socket: real 2.518s user 2.351s sys 1.853s
I20260928 05:52:07.590695 379 rpc-test.cc:1859] Sending 1024MB via ssl-enabled tcp socket: real 2.518s user 2.338s sys 1.854s
I20260928 05:52:10.116942 379 rpc-test.cc:1859] Sending 1024MB via ssl-enabled tcp socket: real 2.526s user 2.298s sys 1.931s
[ OK ] Parameters/TestRpc.TestPerformanceBySocketType/SSL_TCP (12668 ms)
[----------] 20 tests from Parameters/TestRpc (42705 ms total)
[----------] 1 test from Parameters/TestRpcSocketTxRxQueue
[ RUN ] Parameters/TestRpcSocketTxRxQueue.OverCapacity/0
W20260928 05:52:10.412376 853 negotiation.cc:337] Failed RPC negotiation. Trace:
0928 05:52:10.126466 (+ 0us) reactor.cc:625] Submitting negotiation task for client connection to 0.0.0.0:41587 (local address 127.0.0.1:50056)
0928 05:52:10.126624 (+ 158us) negotiation.cc:107] Waiting for socket to connect
0928 05:52:10.126641 (+ 17us) client_negotiation.cc:174] Beginning negotiation
0928 05:52:10.126728 (+ 87us) client_negotiation.cc:252] Sending NEGOTIATE NegotiatePB request
0928 05:52:10.412047 (+285319us) negotiation.cc:327] Negotiation complete: Network error: Client connection negotiation failed: client connection to 0.0.0.0:41587: BlockingRecv error: recv error from unknown peer: Transport endpoint is not connected (error 107)
Metrics: {"client-negotiator.queue_time_us":42}
W20260928 05:52:10.412528 898 negotiation.cc:337] Failed RPC negotiation. Trace:
0928 05:52:10.138349 (+ 0us) reactor.cc:625] Submitting negotiation task for client connection to 0.0.0.0:41587 (local address 127.0.0.1:50104)
0928 05:52:10.138503 (+ 154us) negotiation.cc:107] Waiting for socket to connect
0928 05:52:10.138515 (+ 12us) client_negotiation.cc:174] Beginning negotiation
0928 05:52:10.138596 (+ 81us) client_negotiation.cc:252] Sending NEGOTIATE NegotiatePB request
0928 05:52:10.412306 (+273710us) negotiation.cc:327] Negotiation complete: Network error: Client connection negotiation failed: client connection to 0.0.0.0:41587: BlockingRecv error: recv error from unknown peer: Transport endpoint is not connected (error 107)
Metrics: {"client-negotiator.queue_time_us":46}
W20260928 05:52:10.412631 871 negotiation.cc:337] Failed RPC negotiation. Trace:
0928 05:52:10.130864 (+ 0us) reactor.cc:625] Submitting negotiation task for client connection to 0.0.0.0:41587 (local address 127.0.0.1:50080)
0928 05:52:10.131014 (+ 150us) negotiation.cc:107] Waiting for socket to connect
0928 05:52:10.131029 (+ 15us) client_negotiation.cc:174] Beginning negotiation
0928 05:52:10.131125 (+ 96us) client_negotiation.cc:252] Sending NEGOTIATE NegotiatePB request
0928 05:52:10.412067 (+280942us) negotiation.cc:327] Negotiation complete: Network error: Client connection negotiation failed: client connection to 0.0.0.0:41587: BlockingRecv error: recv error from unknown peer: Transport endpoint is not connected (error 107)
Metrics: {"client-negotiator.queue_time_us":51}
W20260928 05:52:10.412410 862 negotiation.cc:337] Failed RPC negotiation. Trace:
0928 05:52:10.128529 (+ 0us) reactor.cc:625] Submitting negotiation task for client connection to 0.0.0.0:41587 (local address 127.0.0.1:50070)
0928 05:52:10.128670 (+ 141us) negotiation.cc:107] Waiting for socket to connect
0928 05:52:10.128685 (+ 15us) client_negotiation.cc:174] Beginning negotiation
0928 05:52:10.128774 (+ 89us) client_negotiation.cc:252] Sending NEGOTIATE NegotiatePB request
0928 05:52:10.412129 (+283355us) negotiation.cc:327] Negotiation complete: Network error: Client connection negotiation failed: client connection to 0.0.0.0:41587: BlockingRecv error: recv error from unknown peer: Transport endpoint is not connected (error 107)
Metrics: {"client-negotiator.queue_time_us":28}
W20260928 05:52:10.412982 889 negotiation.cc:337] Failed RPC negotiation. Trace:
0928 05:52:10.135500 (+ 0us) reactor.cc:625] Submitting negotiation task for client connection to 0.0.0.0:41587 (local address 127.0.0.1:50098)
0928 05:52:10.135696 (+ 196us) negotiation.cc:107] Waiting for socket to connect
0928 05:52:10.135711 (+ 15us) client_negotiation.cc:174] Beginning negotiation
0928 05:52:10.135869 (+ 158us) client_negotiation.cc:252] Sending NEGOTIATE NegotiatePB request
0928 05:52:10.412711 (+276842us) negotiation.cc:327] Negotiation complete: Network error: Client connection negotiation failed: client connection to 0.0.0.0:41587: BlockingRecv error: recv error from unknown peer: Transport endpoint is not connected (error 107)
Metrics: {"client-negotiator.queue_time_us":72}
W20260928 05:52:10.414539 880 negotiation.cc:337] Failed RPC negotiation. Trace:
0928 05:52:10.133233 (+ 0us) reactor.cc:625] Submitting negotiation task for client connection to 0.0.0.0:41587 (local address 127.0.0.1:50096)
0928 05:52:10.133355 (+ 122us) negotiation.cc:107] Waiting for socket to connect
0928 05:52:10.133370 (+ 15us) client_negotiation.cc:174] Beginning negotiation
0928 05:52:10.133466 (+ 96us) client_negotiation.cc:252] Sending NEGOTIATE NegotiatePB request
0928 05:52:10.412043 (+278577us) negotiation.cc:327] Negotiation complete: Network error: Client connection negotiation failed: client connection to 0.0.0.0:41587: BlockingRecv error: recv error from unknown peer: Transport endpoint is not connected (error 107)
Metrics: {"client-negotiator.queue_time_us":28}
[ OK ] Parameters/TestRpcSocketTxRxQueue.OverCapacity/0 (1061 ms)
[----------] 1 test from Parameters/TestRpcSocketTxRxQueue (1061 ms total)
[----------] Global test environment tear-down
[==========] 21 tests from 2 test suites ran. (43767 ms total)
[ PASSED ] 20 tests.
[ FAILED ] 1 test, listed below:
[ FAILED ] Parameters/TestRpc.TestCallWithChainCertAndChainCA/SSL_TCP, where GetParam() = (true, false)
1 FAILED TEST