Diagnosed failure

Parameters/TestRpc.TestCallWithChainCertAndRootCA/SSL_TCP: /data0/somelongdirectorytoavoidrpathissues/src/kudu/src/kudu/rpc/rpc-test.cc:303: Failure
Failed
Bad status: Runtime error: could not verify certificate chain (error with cert: subject=CN = localhost, ST = sadfjas, C = AS, emailAddress = sdflkdsajf, O = lskdfjlsad, OU = sldfkja, issuer=C = AS, ST = ASDfkjdhf, L = lskdjf, O = saldfja, OU = skdjf, CN = localhost, emailAddress = sadjflkadsj): : certificate has expired
Google Test trace:
/data0/somelongdirectorytoavoidrpathissues/src/kudu/src/kudu/rpc/rpc-test.cc:300: Connecting to 0.0.0.0:33927
I20260925 19:31:10.171144   390 test_util.cc:175] -----------------------------------------------
I20260925 19:31:10.171356   390 test_util.cc:176] Had fatal failures, leaving test files at /tmp/dist-test-taskTpsJkM/test-tmp/rpc-test.1.Parameters_TestRpc.TestCallWithChainCertAndRootCA_SSL_TCP.1790364668575417-390-0

Full log

Note: This is test shard 2 of 8.
[==========] Running 21 tests from 2 test suites.
[----------] Global test environment set-up.
[----------] 1 test from TestRpc
[ RUN      ] TestRpc.TestMethodsByName
[       OK ] TestRpc.TestMethodsByName (6 ms)
[----------] 1 test from TestRpc (6 ms total)

[----------] 20 tests from Parameters/TestRpc
[ RUN      ] Parameters/TestRpc.TestAcceptorPoolStartStop/SSL_TCP
WARNING: Logging before InitGoogleLogging() is written to STDERR
I20260925 19:31:08.672832   405 acceptor_pool.cc:254] collecting diagnostics on the listening RPC socket 0.0.0.0:45721 every 8 connection(s)
W20260925 19:31:09.675437   390 thread.cc:536] Waited for 1000ms trying to join with acceptor (tid 406)
I20260925 19:31:08.674908   406 acceptor_pool.cc:254] collecting diagnostics on the listening RPC socket 0.0.0.0:45721 every 8 connection(s)
I20260925 19:31:09.841818   417 acceptor_pool.cc:254] collecting diagnostics on the listening RPC socket 0.0.0.0:43925 every 8 connection(s)
I20260925 19:31:09.843175   418 acceptor_pool.cc:254] collecting diagnostics on the listening RPC socket 0.0.0.0:43925 every 8 connection(s)
I20260925 19:31:09.867863   428 acceptor_pool.cc:254] collecting diagnostics on the listening RPC socket 0.0.0.0:40971 every 8 connection(s)
I20260925 19:31:09.869704   429 acceptor_pool.cc:254] collecting diagnostics on the listening RPC socket 0.0.0.0:40971 every 8 connection(s)
I20260925 19:31:09.914143   439 acceptor_pool.cc:254] collecting diagnostics on the listening RPC socket 0.0.0.0:34827 every 8 connection(s)
I20260925 19:31:09.914861   440 acceptor_pool.cc:254] collecting diagnostics on the listening RPC socket 0.0.0.0:34827 every 8 connection(s)
I20260925 19:31:09.946906   450 acceptor_pool.cc:254] collecting diagnostics on the listening RPC socket 0.0.0.0:37255 every 8 connection(s)
I20260925 19:31:09.947640   451 acceptor_pool.cc:254] collecting diagnostics on the listening RPC socket 0.0.0.0:37255 every 8 connection(s)
[       OK ] Parameters/TestRpc.TestAcceptorPoolStartStop/SSL_TCP (1318 ms)
[ RUN      ] Parameters/TestRpc.TestCall/SSL_TCP
I20260925 19:31:10.001199   463 acceptor_pool.cc:254] collecting diagnostics on the listening RPC socket 0.0.0.0:33847 every 8 connection(s)
I20260925 19:31:10.002947   464 acceptor_pool.cc:254] collecting diagnostics on the listening RPC socket 0.0.0.0:33847 every 8 connection(s)
I20260925 19:31:10.009140   390 rpc-test.cc:234] Connecting to 0.0.0.0:33847
[       OK ] Parameters/TestRpc.TestCall/SSL_TCP (168 ms)
[ RUN      ] Parameters/TestRpc.TestCallWithChainCertAndRootCA/SSL_TCP
I20260925 19:31:10.148695   488 acceptor_pool.cc:254] collecting diagnostics on the listening RPC socket 0.0.0.0:33927 every 8 connection(s)
I20260925 19:31:10.149430   489 acceptor_pool.cc:254] collecting diagnostics on the listening RPC socket 0.0.0.0:33927 every 8 connection(s)
/data0/somelongdirectorytoavoidrpathissues/src/kudu/src/kudu/rpc/rpc-test.cc:303: Failure
Failed
Bad status: Runtime error: could not verify certificate chain (error with cert: subject=CN = localhost, ST = sadfjas, C = AS, emailAddress = sdflkdsajf, O = lskdfjlsad, OU = sldfkja, issuer=C = AS, ST = ASDfkjdhf, L = lskdjf, O = saldfja, OU = skdjf, CN = localhost, emailAddress = sadjflkadsj): : certificate has expired
Google Test trace:
/data0/somelongdirectorytoavoidrpathissues/src/kudu/src/kudu/rpc/rpc-test.cc:300: Connecting to 0.0.0.0:33927
I20260925 19:31:10.171144   390 test_util.cc:175] -----------------------------------------------
I20260925 19:31:10.171356   390 test_util.cc:176] Had fatal failures, leaving test files at /tmp/dist-test-taskTpsJkM/test-tmp/rpc-test.1.Parameters_TestRpc.TestCallWithChainCertAndRootCA_SSL_TCP.1790364668575417-390-0
[  FAILED  ] Parameters/TestRpc.TestCallWithChainCertAndRootCA/SSL_TCP, where GetParam() = (true, false) (50 ms)
[ RUN      ] Parameters/TestRpc.TestCallWithBadPasswordProtectedKey/SSL_TCP
[       OK ] Parameters/TestRpc.TestCallWithBadPasswordProtectedKey/SSL_TCP (32 ms)
[ RUN      ] Parameters/TestRpc.TestInvalidMethodCall/SSL_TCP
I20260925 19:31:10.224150   525 acceptor_pool.cc:254] collecting diagnostics on the listening RPC socket 0.0.0.0:36885 every 8 connection(s)
I20260925 19:31:10.225011   526 acceptor_pool.cc:254] collecting diagnostics on the listening RPC socket 0.0.0.0:36885 every 8 connection(s)
I20260925 19:31:10.228909   390 rpc-test.cc:406] Connecting to 0.0.0.0:36885
[       OK ] Parameters/TestRpc.TestInvalidMethodCall/SSL_TCP (75 ms)
[ RUN      ] Parameters/TestRpc.TestHighFDs/SSL_TCP
I20260925 19:31:10.514185   550 acceptor_pool.cc:254] collecting diagnostics on the listening RPC socket 0.0.0.0:38975 every 8 connection(s)
I20260925 19:31:10.514994   551 acceptor_pool.cc:254] collecting diagnostics on the listening RPC socket 0.0.0.0:38975 every 8 connection(s)
[       OK ] Parameters/TestRpc.TestHighFDs/SSL_TCP (288 ms)
[ RUN      ] Parameters/TestRpc.TestConnectionAlwaysKeepalive/SSL_TCP
I20260925 19:31:10.583488   573 acceptor_pool.cc:254] collecting diagnostics on the listening RPC socket 0.0.0.0:36087 every 8 connection(s)
I20260925 19:31:10.584152   574 acceptor_pool.cc:254] collecting diagnostics on the listening RPC socket 0.0.0.0:36087 every 8 connection(s)
I20260925 19:31:10.587329   390 rpc-test.cc:532] Connecting to 0.0.0.0:36087
[       OK ] Parameters/TestRpc.TestConnectionAlwaysKeepalive/SSL_TCP (3050 ms)
[ RUN      ] Parameters/TestRpc.TestReopenOutboundConnections/SSL_TCP
I20260925 19:31:13.649065   596 acceptor_pool.cc:254] collecting diagnostics on the listening RPC socket 0.0.0.0:39193 every 8 connection(s)
I20260925 19:31:13.650300   597 acceptor_pool.cc:254] collecting diagnostics on the listening RPC socket 0.0.0.0:39193 every 8 connection(s)
I20260925 19:31:13.653475   390 rpc-test.cc:658] Connecting to 0.0.0.0:39193
[       OK ] Parameters/TestRpc.TestReopenOutboundConnections/SSL_TCP (437 ms)
[ RUN      ] Parameters/TestRpc.TestConnectionNetworkPlane/SSL_TCP
I20260925 19:31:14.072551   619 acceptor_pool.cc:254] collecting diagnostics on the listening RPC socket 0.0.0.0:35837 every 8 connection(s)
I20260925 19:31:14.073359   620 acceptor_pool.cc:254] collecting diagnostics on the listening RPC socket 0.0.0.0:35837 every 8 connection(s)
I20260925 19:31:14.076372   390 rpc-test.cc:772] Connecting to 0.0.0.0:35837
[       OK ] Parameters/TestRpc.TestConnectionNetworkPlane/SSL_TCP (91 ms)
[ RUN      ] Parameters/TestRpc.TestTCPKeepalive/SSL_TCP
I20260925 19:31:14.170900   644 acceptor_pool.cc:254] collecting diagnostics on the listening RPC socket 0.0.0.0:43243 every 8 connection(s)
I20260925 19:31:14.171586   645 acceptor_pool.cc:254] collecting diagnostics on the listening RPC socket 0.0.0.0:43243 every 8 connection(s)
I20260925 19:31:14.196425   648 rpc-test-base.h:222] got call: sleep_micros: 8000000 deferred: true
I20260925 19:31:22.200599   648 rpcz_store.cc:275] Call kudu.rpc.GenericCalculatorService.Sleep from 127.0.0.1:42716 (request call id 0) took 8004 ms. Trace:
I20260925 19:31:22.201031   648 rpcz_store.cc:276] 0925 19:31:14.196148 (+     0us) service_pool.cc:170] Inserting onto call queue
0925 19:31:14.196250 (+   102us) service_pool.cc:227] Handling call
0925 19:31:22.200438 (+8004188us) inbound_call.cc:173] Queueing success response
Metrics: {}
[       OK ] Parameters/TestRpc.TestTCPKeepalive/SSL_TCP (8067 ms)
[ RUN      ] Parameters/TestRpc.TestMaxSmallSidecars/SSL_TCP
I20260925 19:31:22.238314   670 acceptor_pool.cc:254] collecting diagnostics on the listening RPC socket 0.0.0.0:37191 every 8 connection(s)
I20260925 19:31:22.239108   671 acceptor_pool.cc:254] collecting diagnostics on the listening RPC socket 0.0.0.0:37191 every 8 connection(s)
[       OK ] Parameters/TestRpc.TestMaxSmallSidecars/SSL_TCP (190 ms)
[ RUN      ] Parameters/TestRpc.TestCallTimeout/SSL_TCP
I20260925 19:31:22.429148   695 acceptor_pool.cc:254] collecting diagnostics on the listening RPC socket 0.0.0.0:40977 every 8 connection(s)
I20260925 19:31:22.429942   696 acceptor_pool.cc:254] collecting diagnostics on the listening RPC socket 0.0.0.0:40977 every 8 connection(s)
I20260925 19:31:22.465103   390 rpc-test-base.h:595] status: Timed out: connection negotiation to 0.0.0.0:40977 for RPC Sleep timed out after 0.000s (ON_OUTBOUND_QUEUE), seconds elapsed: 0.00240286
I20260925 19:31:22.473724   699 rpc-test-base.h:222] got call: sleep_micros: 700000
I20260925 19:31:22.666563   390 rpc-test-base.h:595] status: Timed out: Sleep RPC to 0.0.0.0:40977 timed out after 0.200s (SENT), seconds elapsed: 0.201121
I20260925 19:31:22.668002   698 rpc-test-base.h:222] got call: sleep_micros: 2000000
W20260925 19:31:23.174350   699 rpcz_store.cc:267] Call kudu.rpc.GenericCalculatorService.Sleep from 127.0.0.1:49988 (request call id 1) took 700 ms (client timeout 200 ms). Trace:
W20260925 19:31:23.174726   699 rpcz_store.cc:269] 0925 19:31:22.473537 (+     0us) service_pool.cc:170] Inserting onto call queue
0925 19:31:22.473669 (+   132us) service_pool.cc:227] Handling call
0925 19:31:23.174287 (+700618us) inbound_call.cc:173] Queueing success response
Metrics: {}
I20260925 19:31:24.169062   390 rpc-test-base.h:595] status: Timed out: Sleep RPC to 0.0.0.0:40977 timed out after 1.500s (SENT), seconds elapsed: 1.5022
W20260925 19:31:24.668505   698 rpcz_store.cc:267] Call kudu.rpc.GenericCalculatorService.Sleep from 127.0.0.1:49988 (request call id 2) took 2000 ms (client timeout 1500 ms). Trace:
W20260925 19:31:24.668807   698 rpcz_store.cc:269] 0925 19:31:22.667736 (+     0us) service_pool.cc:170] Inserting onto call queue
0925 19:31:22.667849 (+   113us) service_pool.cc:227] Handling call
0925 19:31:24.668453 (+2000604us) inbound_call.cc:173] Queueing success response
Metrics: {}
W20260925 19:31:24.669407   692 connection.cc:441] server connection from 127.0.0.1:49988 torn down before Call kudu.rpc.GenericCalculatorService.Sleep from 127.0.0.1:49988 (request call id 2) could send its response
[       OK ] Parameters/TestRpc.TestCallTimeout/SSL_TCP (2269 ms)
[ RUN      ] Parameters/TestRpc.TestServerShutsDown/SSL_TCP
I20260925 19:31:24.676649   390 rpc-test.cc:1125] Connecting to 0.0.0.0:42429
W20260925 19:31:24.686000   712 negotiation.cc:337] Failed RPC negotiation. Trace:
0925 19:31:24.684437 (+     0us) reactor.cc:625] Submitting negotiation task for client connection to 0.0.0.0:42429 (local address 127.0.0.1:39880)
0925 19:31:24.684886 (+   449us) negotiation.cc:107] Waiting for socket to connect
0925 19:31:24.684917 (+    31us) client_negotiation.cc:174] Beginning negotiation
0925 19:31:24.685126 (+   209us) client_negotiation.cc:252] Sending NEGOTIATE NegotiatePB request
0925 19:31:24.685358 (+   232us) negotiation.cc:327] Negotiation complete: Network error: Client connection negotiation failed: client connection to 0.0.0.0:42429: BlockingWrite error: write error: Broken pipe (error 32)
Metrics: {"client-negotiator.queue_time_us":114}
[       OK ] Parameters/TestRpc.TestServerShutsDown/SSL_TCP (13 ms)
[ RUN      ] Parameters/TestRpc.TimedOutOnResponseMetric/SSL_TCP
I20260925 19:31:24.709578   729 acceptor_pool.cc:254] collecting diagnostics on the listening RPC socket 0.0.0.0:39735 every 8 connection(s)
I20260925 19:31:24.710341   730 acceptor_pool.cc:254] collecting diagnostics on the listening RPC socket 0.0.0.0:39735 every 8 connection(s)
W20260925 19:31:24.958309   733 rpcz_store.cc:267] Call kudu.rpc_test.CalculatorService.Sleep from 127.0.0.1:52804 (request call id 3) took 50 ms (client timeout 25 ms). Trace:
W20260925 19:31:24.958585   733 rpcz_store.cc:269] 0925 19:31:24.907734 (+     0us) service_pool.cc:170] Inserting onto call queue
0925 19:31:24.907856 (+   122us) service_pool.cc:227] Handling call
0925 19:31:24.958228 (+ 50372us) inbound_call.cc:173] Queueing success response
Related trace 'test_child':
Metrics: {"test_sleep_us":50000,"child_traces":[["test_child",{"related_trace_metric":1}]]}
W20260925 19:31:25.017599   733 rpcz_store.cc:267] Call kudu.rpc_test.CalculatorService.Sleep from 127.0.0.1:52804 (request call id 4) took 50 ms (client timeout 50 ms). Trace:
W20260925 19:31:25.017884   733 rpcz_store.cc:269] 0925 19:31:24.967067 (+     0us) service_pool.cc:170] Inserting onto call queue
0925 19:31:24.967194 (+   127us) service_pool.cc:227] Handling call
0925 19:31:25.017544 (+ 50350us) inbound_call.cc:173] Queueing success response
Related trace 'test_child':
Metrics: {"test_sleep_us":50000,"child_traces":[["test_child",{"related_trace_metric":1}]]}
[       OK ] Parameters/TestRpc.TimedOutOnResponseMetric/SSL_TCP (338 ms)
[ RUN      ] Parameters/TestRpc.AcceptorDispatchingTimesMetric/SSL_TCP
I20260925 19:31:25.038554   754 acceptor_pool.cc:254] collecting diagnostics on the listening RPC socket 0.0.0.0:45135 every 8 connection(s)
I20260925 19:31:25.039268   755 acceptor_pool.cc:254] collecting diagnostics on the listening RPC socket 0.0.0.0:45135 every 8 connection(s)
W20260925 19:31:25.044205   750 negotiation.cc:337] Failed RPC negotiation. Trace:
0925 19:31:25.043075 (+     0us) reactor.cc:625] Submitting negotiation task for server connection from 127.0.0.1:59244 (local address 127.0.0.1:45135)
0925 19:31:25.043511 (+   436us) server_negotiation.cc:206] Beginning negotiation
0925 19:31:25.043528 (+    17us) server_negotiation.cc:399] Waiting for connection header
0925 19:31:25.043753 (+   225us) negotiation.cc:327] Negotiation complete: Network error: Server connection negotiation failed: server connection from 127.0.0.1:59244: BlockingRecv error: recv got EOF from 127.0.0.1:59244 (error 108)
Metrics: {"server-negotiator.queue_time_us":129}
[       OK ] Parameters/TestRpc.AcceptorDispatchingTimesMetric/SSL_TCP (23 ms)
[ RUN      ] Parameters/TestRpc.TestRpcCallbackDestroysMessenger/SSL_TCP
[       OK ] Parameters/TestRpc.TestRpcCallbackDestroysMessenger/SSL_TCP (51 ms)
[ RUN      ] Parameters/TestRpc.TestApplicationFeatureFlag/SSL_TCP
I20260925 19:31:25.147723   779 acceptor_pool.cc:254] collecting diagnostics on the listening RPC socket 0.0.0.0:44499 every 8 connection(s)
I20260925 19:31:25.148471   780 acceptor_pool.cc:254] collecting diagnostics on the listening RPC socket 0.0.0.0:44499 every 8 connection(s)
W20260925 19:31:25.212666   776 messenger.cc:357] Unable to handle RPC call: Not implemented: call requires unsupported application feature flags: 99
[       OK ] Parameters/TestRpc.TestApplicationFeatureFlag/SSL_TCP (119 ms)
[ RUN      ] Parameters/TestRpc.TestCancellation/SSL_TCP
I20260925 19:31:25.244421   804 acceptor_pool.cc:254] collecting diagnostics on the listening RPC socket 0.0.0.0:35681 every 8 connection(s)
I20260925 19:31:25.245102   805 acceptor_pool.cc:254] collecting diagnostics on the listening RPC socket 0.0.0.0:35681 every 8 connection(s)
I20260925 19:31:25.248170   390 rpc-test.cc:1648] Connecting to 0.0.0.0:35681
I20260925 19:31:25.359943   390 rpc-test-base.h:595] status: Aborted: Sleep RPC to 0.0.0.0:35681 is cancelled in state READY, seconds elapsed: 0.000379937
I20260925 19:31:25.509159   390 rpc-test-base.h:595] status: Aborted: Sleep RPC to 0.0.0.0:35681 is cancelled in state SENT, seconds elapsed: 0.000985003
I20260925 19:31:25.553613   807 rpc-test-base.h:222] got call: sleep_micros: 510000
I20260925 19:31:25.678169   390 rpc-test-base.h:595] status: Aborted: Sleep RPC to 0.0.0.0:35681 is cancelled in state SENT, seconds elapsed: 0.000936066
I20260925 19:31:25.725955   806 rpc-test-base.h:222] got call: sleep_micros: 510000
I20260925 19:31:25.847452   390 rpc-test-base.h:595] status: Aborted: Sleep RPC to 0.0.0.0:35681 is cancelled in state SENT, seconds elapsed: 0.000941652
W20260925 19:31:25.887640   808 rpcz_store.cc:267] Call kudu.rpc.GenericCalculatorService.Sleep from 127.0.0.1:49512 (request call id 11) took 15 ms (client timeout 10 ms). Trace:
W20260925 19:31:25.887931   808 rpcz_store.cc:269] 0925 19:31:25.871962 (+     0us) service_pool.cc:170] Inserting onto call queue
0925 19:31:25.887347 (+ 15385us) service_pool.cc:214] Skipping call since client already timed out
0925 19:31:25.887460 (+   113us) inbound_call.cc:173] Queueing failure response
Metrics: {}
I20260925 19:31:25.888445   808 rpc-test-base.h:222] got call: sleep_micros: 1500000
W20260925 19:31:26.064420   807 rpcz_store.cc:267] Call kudu.rpc.GenericCalculatorService.Sleep from 127.0.0.1:49512 (request call id 3) took 511 ms (client timeout 10 ms). Trace:
W20260925 19:31:26.064725   807 rpcz_store.cc:269] 0925 19:31:25.553339 (+     0us) service_pool.cc:170] Inserting onto call queue
0925 19:31:25.553530 (+   191us) service_pool.cc:227] Handling call
0925 19:31:26.064369 (+510839us) inbound_call.cc:173] Queueing success response
Metrics: {}
W20260925 19:31:26.236729   806 rpcz_store.cc:267] Call kudu.rpc.GenericCalculatorService.Sleep from 127.0.0.1:49512 (request call id 7) took 511 ms (client timeout 10 ms). Trace:
W20260925 19:31:26.237030   806 rpcz_store.cc:269] 0925 19:31:25.725781 (+     0us) service_pool.cc:170] Inserting onto call queue
0925 19:31:25.725886 (+   105us) service_pool.cc:227] Handling call
0925 19:31:26.236678 (+510792us) inbound_call.cc:173] Queueing success response
Metrics: {}
I20260925 19:31:26.848901   390 rpc-test-base.h:595] status: Timed out: Sleep RPC to 0.0.0.0:35681 timed out after 1.000s (SENT), seconds elapsed: 1.00102
I20260925 19:31:26.850302   806 rpc-test-base.h:222] got call: sleep_micros: 1500000
W20260925 19:31:27.389008   808 rpcz_store.cc:267] Call kudu.rpc.GenericCalculatorService.Sleep from 127.0.0.1:49512 (request call id 12) took 1516 ms (client timeout 1000 ms). Trace:
W20260925 19:31:27.389345   808 rpcz_store.cc:269] 0925 19:31:25.872289 (+     0us) service_pool.cc:170] Inserting onto call queue
0925 19:31:25.888419 (+ 16130us) service_pool.cc:227] Handling call
0925 19:31:27.388956 (+1500537us) inbound_call.cc:173] Queueing success response
Metrics: {}
I20260925 19:31:27.850119   390 rpc-test-base.h:595] status: Timed out: Sleep RPC to 0.0.0.0:35681 timed out after 1.000s (SENT), seconds elapsed: 1.00092
W20260925 19:31:27.851639   801 messenger.cc:357] Unable to handle RPC call: Not implemented: call requires unsupported application feature flags: 99, 1
W20260925 19:31:27.853188   801 messenger.cc:357] Unable to handle RPC call: Not implemented: call requires unsupported application feature flags: 99, 1
W20260925 19:31:28.350823   806 rpcz_store.cc:267] Call kudu.rpc.GenericCalculatorService.Sleep from 127.0.0.1:49512 (request call id 13) took 1500 ms (client timeout 1000 ms). Trace:
W20260925 19:31:28.351226   806 rpcz_store.cc:269] 0925 19:31:26.850120 (+     0us) service_pool.cc:170] Inserting onto call queue
0925 19:31:26.850257 (+   137us) service_pool.cc:227] Handling call
0925 19:31:28.350766 (+1500509us) inbound_call.cc:173] Queueing success response
Metrics: {}
W20260925 19:31:28.351855   801 connection.cc:441] server connection from 127.0.0.1:49512 torn down before Call kudu.rpc.GenericCalculatorService.Sleep from 127.0.0.1:49512 (request call id 13) could send its response
[       OK ] Parameters/TestRpc.TestCancellation/SSL_TCP (3138 ms)
[ RUN      ] Parameters/TestRpc.TestCancellationMultiThreads/SSL_TCP
I20260925 19:31:28.380749   829 acceptor_pool.cc:254] collecting diagnostics on the listening RPC socket 0.0.0.0:41247 every 8 connection(s)
I20260925 19:31:28.381454   830 acceptor_pool.cc:254] collecting diagnostics on the listening RPC socket 0.0.0.0:41247 every 8 connection(s)
I20260925 19:31:28.384568   390 rpc-test.cc:1808] Connecting to 0.0.0.0:41247
I20260925 19:31:28.551486   843 test_util.cc:268] Using random seed: -1018720731
I20260925 19:31:28.552565   844 test_util.cc:268] Using random seed: -1018719649
I20260925 19:31:28.554273   845 test_util.cc:268] Using random seed: -1018717946
I20260925 19:31:28.555677   846 test_util.cc:268] Using random seed: -1018716560
I20260925 19:31:28.557566   847 test_util.cc:268] Using random seed: -1018714806
I20260925 19:31:28.558949   848 test_util.cc:268] Using random seed: -1018713423
I20260925 19:31:28.560591   849 test_util.cc:268] Using random seed: -1018711785
I20260925 19:31:28.563051   850 test_util.cc:268] Using random seed: -1018709373
I20260925 19:31:28.564715   851 test_util.cc:268] Using random seed: -1018707587
I20260925 19:31:28.566125   852 test_util.cc:268] Using random seed: -1018706210
I20260925 19:31:28.568184   853 test_util.cc:268] Using random seed: -1018704184
I20260925 19:31:28.570164   854 test_util.cc:268] Using random seed: -1018702232
I20260925 19:31:28.573200   855 test_util.cc:268] Using random seed: -1018699832
I20260925 19:31:28.575577   856 test_util.cc:268] Using random seed: -1018696769
I20260925 19:31:28.577695   857 test_util.cc:268] Using random seed: -1018695135
I20260925 19:31:28.578938   858 test_util.cc:268] Using random seed: -1018693374
I20260925 19:31:28.580857   859 test_util.cc:268] Using random seed: -1018691468
I20260925 19:31:28.582933   860 test_util.cc:268] Using random seed: -1018689446
I20260925 19:31:28.584812   861 test_util.cc:268] Using random seed: -1018687549
I20260925 19:31:28.586292   862 test_util.cc:268] Using random seed: -1018686076
I20260925 19:31:28.589331   863 test_util.cc:268] Using random seed: -1018683054
I20260925 19:31:28.590844   864 test_util.cc:268] Using random seed: -1018681519
I20260925 19:31:28.592814   865 test_util.cc:268] Using random seed: -1018679546
I20260925 19:31:28.595274   866 test_util.cc:268] Using random seed: -1018677082
I20260925 19:31:28.597184   867 test_util.cc:268] Using random seed: -1018675164
I20260925 19:31:28.599181   868 test_util.cc:268] Using random seed: -1018673199
I20260925 19:31:28.600997   869 test_util.cc:268] Using random seed: -1018671360
I20260925 19:31:28.602887   870 test_util.cc:268] Using random seed: -1018669879
I20260925 19:31:28.604398   871 test_util.cc:268] Using random seed: -1018667983
I20260925 19:31:28.606371   872 test_util.cc:268] Using random seed: -1018666032
[       OK ] Parameters/TestRpc.TestCancellationMultiThreads/SSL_TCP (17689 ms)
[ RUN      ] Parameters/TestRpc.TestCallId/SSL_TCP
I20260925 19:31:46.074745   886 acceptor_pool.cc:254] collecting diagnostics on the listening RPC socket 0.0.0.0:45267 every 8 connection(s)
I20260925 19:31:46.075519   887 acceptor_pool.cc:254] collecting diagnostics on the listening RPC socket 0.0.0.0:45267 every 8 connection(s)
[       OK ] Parameters/TestRpc.TestCallId/SSL_TCP (91 ms)
[----------] 20 tests from Parameters/TestRpc (37507 ms total)

[----------] Global test environment tear-down
[==========] 21 tests from 2 test suites ran. (37514 ms total)
[  PASSED  ] 20 tests.
[  FAILED  ] 1 test, listed below:
[  FAILED  ] Parameters/TestRpc.TestCallWithChainCertAndRootCA/SSL_TCP, where GetParam() = (true, false)

 1 FAILED TEST