Diagnosed failure

Parameters/TestRpc.TestCallWithChainCertAndChainCA/SSL_UnixSocket: /data0/somelongdirectorytoavoidrpathissues/src/kudu/src/kudu/rpc/rpc-test.cc:270: Failure
Failed
Bad status: Runtime error: could not verify certificate chain (error with cert: subject=CN = localhost, ST = sadfjas, C = AS, emailAddress = sdflkdsajf, O = lskdfjlsad, OU = sldfkja, issuer=C = AS, ST = ASDfkjdhf, L = lskdjf, O = saldfja, OU = skdjf, CN = localhost, emailAddress = sadjflkadsj): : certificate has expired
Google Test trace:
/data0/somelongdirectorytoavoidrpathissues/src/kudu/src/kudu/rpc/rpc-test.cc:267: Connecting to unix:/tmp/dist-test-taskGfgiJO/test-tmp/rpc-test-f93cdfc301204f90a2eb92372a30f2ed.sock
I20260926 07:26:59.428649  1169 test_util.cc:175] -----------------------------------------------
I20260926 07:26:59.428714  1169 test_util.cc:176] Had fatal failures, leaving test files at /tmp/dist-test-taskGfgiJO/test-tmp/rpc-test.6.Parameters_TestRpc.TestCallWithChainCertAndChainCA_SSL_UnixSocket.1790407619358015-1169-0

Full log

Note: This is test shard 7 of 8.
[==========] Running 21 tests from 2 test suites.
[----------] Global test environment set-up.
[----------] 20 tests from Parameters/TestRpc
[ RUN      ] Parameters/TestRpc.TestMessengerCreateDestroy/SSL_UnixSocket
WARNING: Logging before InitGoogleLogging() is written to STDERR
I20260926 07:26:59.392561  1169 rpc-test.cc:169] started messenger TestCreateDestroy
[       OK ] Parameters/TestRpc.TestMessengerCreateDestroy/SSL_UnixSocket (29 ms)
[ RUN      ] Parameters/TestRpc.TestNegotiationDeadlock/SSL_UnixSocket
I20260926 07:26:59.404825  1189 acceptor_pool.cc:254] collecting diagnostics on the listening RPC socket unix:/tmp/dist-test-taskGfgiJO/test-tmp/rpc-test-f73f2d91d0524f7e8e27dcfb317752d1.sock every 8 connection(s)
I20260926 07:26:59.404842  1190 acceptor_pool.cc:254] collecting diagnostics on the listening RPC socket unix:/tmp/dist-test-taskGfgiJO/test-tmp/rpc-test-f73f2d91d0524f7e8e27dcfb317752d1.sock every 8 connection(s)
[       OK ] Parameters/TestRpc.TestNegotiationDeadlock/SSL_UnixSocket (22 ms)
[ RUN      ] Parameters/TestRpc.TestCallWithChainCertAndChainCA/SSL_UnixSocket
I20260926 07:26:59.423152  1205 acceptor_pool.cc:254] collecting diagnostics on the listening RPC socket unix:/tmp/dist-test-taskGfgiJO/test-tmp/rpc-test-f93cdfc301204f90a2eb92372a30f2ed.sock every 8 connection(s)
I20260926 07:26:59.423202  1206 acceptor_pool.cc:254] collecting diagnostics on the listening RPC socket unix:/tmp/dist-test-taskGfgiJO/test-tmp/rpc-test-f93cdfc301204f90a2eb92372a30f2ed.sock every 8 connection(s)
/data0/somelongdirectorytoavoidrpathissues/src/kudu/src/kudu/rpc/rpc-test.cc:270: Failure
Failed
Bad status: Runtime error: could not verify certificate chain (error with cert: subject=CN = localhost, ST = sadfjas, C = AS, emailAddress = sdflkdsajf, O = lskdfjlsad, OU = sldfkja, issuer=C = AS, ST = ASDfkjdhf, L = lskdjf, O = saldfja, OU = skdjf, CN = localhost, emailAddress = sadjflkadsj): : certificate has expired
Google Test trace:
/data0/somelongdirectorytoavoidrpathissues/src/kudu/src/kudu/rpc/rpc-test.cc:267: Connecting to unix:/tmp/dist-test-taskGfgiJO/test-tmp/rpc-test-f93cdfc301204f90a2eb92372a30f2ed.sock
I20260926 07:26:59.428649  1169 test_util.cc:175] -----------------------------------------------
I20260926 07:26:59.428714  1169 test_util.cc:176] Had fatal failures, leaving test files at /tmp/dist-test-taskGfgiJO/test-tmp/rpc-test.6.Parameters_TestRpc.TestCallWithChainCertAndChainCA_SSL_UnixSocket.1790407619358015-1169-0
[  FAILED  ] Parameters/TestRpc.TestCallWithChainCertAndChainCA/SSL_UnixSocket, where GetParam() = (true, true) (11 ms)
[ RUN      ] Parameters/TestRpc.TestCallWithPasswordProtectedKey/SSL_UnixSocket
I20260926 07:26:59.438002  1231 acceptor_pool.cc:254] collecting diagnostics on the listening RPC socket unix:/tmp/dist-test-taskGfgiJO/test-tmp/rpc-test-b8310260761f42c28e491477a82ef3a0.sock every 8 connection(s)
I20260926 07:26:59.438047  1230 acceptor_pool.cc:254] collecting diagnostics on the listening RPC socket unix:/tmp/dist-test-taskGfgiJO/test-tmp/rpc-test-b8310260761f42c28e491477a82ef3a0.sock every 8 connection(s)
W20260926 07:26:59.452440  1227 connection.cc:196] Error closing socket: Network error: TlsSocket::Close: Broken pipe
[       OK ] Parameters/TestRpc.TestCallWithPasswordProtectedKey/SSL_UnixSocket (25 ms)
[ RUN      ] Parameters/TestRpc.TestCallToBadServer/SSL_UnixSocket
I20260926 07:26:59.463399  1169 rpc-test.cc:394] Status: Network error: Client connection negotiation failed: client connection to 0.0.0.0:0: connect: Connection refused (error 111)
I20260926 07:26:59.464108  1169 rpc-test.cc:394] Status: Network error: Client connection negotiation failed: client connection to 0.0.0.0:0: connect: Connection refused (error 111)
I20260926 07:26:59.464749  1169 rpc-test.cc:394] Status: Network error: Client connection negotiation failed: client connection to 0.0.0.0:0: connect: Connection refused (error 111)
I20260926 07:26:59.465265  1169 rpc-test.cc:394] Status: Network error: Client connection negotiation failed: client connection to 0.0.0.0:0: connect: Connection refused (error 111)
I20260926 07:26:59.465816  1169 rpc-test.cc:394] Status: Network error: Client connection negotiation failed: client connection to 0.0.0.0:0: connect: Connection refused (error 111)
[       OK ] Parameters/TestRpc.TestCallToBadServer/SSL_UnixSocket (13 ms)
[ RUN      ] Parameters/TestRpc.TestWrongService/SSL_UnixSocket
I20260926 07:26:59.488085  1265 acceptor_pool.cc:254] collecting diagnostics on the listening RPC socket unix:/tmp/dist-test-taskGfgiJO/test-tmp/rpc-test-70ab5c4510444138b85a2b668cabcaeb.sock every 8 connection(s)
I20260926 07:26:59.488116  1266 acceptor_pool.cc:254] collecting diagnostics on the listening RPC socket unix:/tmp/dist-test-taskGfgiJO/test-tmp/rpc-test-70ab5c4510444138b85a2b668cabcaeb.sock every 8 connection(s)
I20260926 07:26:59.521343  1262 messenger.cc:345] service WrongServiceName not registered on TestServer
[       OK ] Parameters/TestRpc.TestWrongService/SSL_UnixSocket (56 ms)
[ RUN      ] Parameters/TestRpc.TestConnectionKeepalive/SSL_UnixSocket
I20260926 07:26:59.546249  1288 acceptor_pool.cc:254] collecting diagnostics on the listening RPC socket unix:/tmp/dist-test-taskGfgiJO/test-tmp/rpc-test-ae0ad7db59c64edf896544a616ed7d0e.sock every 8 connection(s)
I20260926 07:26:59.546249  1289 acceptor_pool.cc:254] collecting diagnostics on the listening RPC socket unix:/tmp/dist-test-taskGfgiJO/test-tmp/rpc-test-ae0ad7db59c64edf896544a616ed7d0e.sock every 8 connection(s)
I20260926 07:26:59.546548  1169 rpc-test.cc:488] Connecting to unix:/tmp/dist-test-taskGfgiJO/test-tmp/rpc-test-ae0ad7db59c64edf896544a616ed7d0e.sock
W20260926 07:27:00.025559  1301 connection.cc:196] Error closing socket: Network error: TlsSocket::Close: Broken pipe
[       OK ] Parameters/TestRpc.TestConnectionKeepalive/SSL_UnixSocket (1050 ms)
[ RUN      ] Parameters/TestRpc.TestClientConnectionMetrics/SSL_UnixSocket
I20260926 07:27:00.603107  1313 acceptor_pool.cc:254] collecting diagnostics on the listening RPC socket unix:/tmp/dist-test-taskGfgiJO/test-tmp/rpc-test-c0e980d0b63741dead606c66eb9732d7.sock every 8 connection(s)
I20260926 07:27:00.603193  1314 acceptor_pool.cc:254] collecting diagnostics on the listening RPC socket unix:/tmp/dist-test-taskGfgiJO/test-tmp/rpc-test-c0e980d0b63741dead606c66eb9732d7.sock every 8 connection(s)
I20260926 07:27:00.603490  1169 rpc-test.cc:569] Connecting to unix:/tmp/dist-test-taskGfgiJO/test-tmp/rpc-test-c0e980d0b63741dead606c66eb9732d7.sock
W20260926 07:27:12.098003  1310 connection.cc:196] Error closing socket: Network error: TlsSocket::Close: Broken pipe
[       OK ] Parameters/TestRpc.TestClientConnectionMetrics/SSL_UnixSocket (11525 ms)
[ RUN      ] Parameters/TestRpc.TestCredentialsPolicy/SSL_UnixSocket
I20260926 07:27:12.112843  1336 acceptor_pool.cc:254] collecting diagnostics on the listening RPC socket unix:/tmp/dist-test-taskGfgiJO/test-tmp/rpc-test-064b50e9f4c04892969f2e2abce252bd.sock every 8 connection(s)
I20260926 07:27:12.112980  1337 acceptor_pool.cc:254] collecting diagnostics on the listening RPC socket unix:/tmp/dist-test-taskGfgiJO/test-tmp/rpc-test-064b50e9f4c04892969f2e2abce252bd.sock every 8 connection(s)
I20260926 07:27:12.113248  1169 rpc-test.cc:700] Connecting to unix:/tmp/dist-test-taskGfgiJO/test-tmp/rpc-test-064b50e9f4c04892969f2e2abce252bd.sock
W20260926 07:27:12.148527  1335 connection.cc:196] Error closing socket: Network error: TlsSocket::Close: Broken pipe
W20260926 07:27:12.153913  1335 connection.cc:196] Error closing socket: Network error: TlsSocket::Close: Broken pipe
[       OK ] Parameters/TestRpc.TestCredentialsPolicy/SSL_UnixSocket (55 ms)
[ RUN      ] Parameters/TestRpc.TestCallLongerThanKeepalive/SSL_UnixSocket
I20260926 07:27:12.169118  1361 acceptor_pool.cc:254] collecting diagnostics on the listening RPC socket unix:/tmp/dist-test-taskGfgiJO/test-tmp/rpc-test-7e9b3b21f4b74740a0351c13cb5e71b3.sock every 8 connection(s)
I20260926 07:27:12.169142  1362 acceptor_pool.cc:254] collecting diagnostics on the listening RPC socket unix:/tmp/dist-test-taskGfgiJO/test-tmp/rpc-test-7e9b3b21f4b74740a0351c13cb5e71b3.sock every 8 connection(s)
I20260926 07:27:12.188688  1365 rpc-test-base.h:222] got call: sleep_micros: 3000000 deferred: true
I20260926 07:27:15.189576  1365 rpcz_store.cc:275] Call kudu.rpc.GenericCalculatorService.Sleep from unix:<unnamed> (request call id 0) took 3001 ms. Trace:
I20260926 07:27:15.189705  1365 rpcz_store.cc:276] 0926 07:27:12.188582 (+     0us) service_pool.cc:170] Inserting onto call queue
0926 07:27:12.188643 (+    61us) service_pool.cc:227] Handling call
0926 07:27:15.189554 (+3000911us) inbound_call.cc:173] Queueing success response
Metrics: {}
W20260926 07:27:15.191313  1358 connection.cc:196] Error closing socket: Network error: TlsSocket::Close: Broken pipe
[       OK ] Parameters/TestRpc.TestCallLongerThanKeepalive/SSL_UnixSocket (3038 ms)
[ RUN      ] Parameters/TestRpc.TestRpcSidecar/SSL_UnixSocket
I20260926 07:27:15.203694  1386 acceptor_pool.cc:254] collecting diagnostics on the listening RPC socket unix:/tmp/dist-test-taskGfgiJO/test-tmp/rpc-test-92242fcbfde44a4e9671e24ce3a06cb0.sock every 8 connection(s)
I20260926 07:27:15.203913  1387 acceptor_pool.cc:254] collecting diagnostics on the listening RPC socket unix:/tmp/dist-test-taskGfgiJO/test-tmp/rpc-test-92242fcbfde44a4e9671e24ce3a06cb0.sock every 8 connection(s)
W20260926 07:27:15.273310  1383 connection.cc:196] Error closing socket: Network error: TlsSocket::Close: Broken pipe
[       OK ] Parameters/TestRpc.TestRpcSidecar/SSL_UnixSocket (81 ms)
[ RUN      ] Parameters/TestRpc.TestRpcSidecarLimits/SSL_UnixSocket
I20260926 07:27:17.068025  1411 acceptor_pool.cc:254] collecting diagnostics on the listening RPC socket unix:/tmp/dist-test-taskGfgiJO/test-tmp/rpc-test-c3b79f7b059b468d8d2b273e8d00b4db.sock every 8 connection(s)
I20260926 07:27:17.068027  1412 acceptor_pool.cc:254] collecting diagnostics on the listening RPC socket unix:/tmp/dist-test-taskGfgiJO/test-tmp/rpc-test-c3b79f7b059b468d8d2b273e8d00b4db.sock every 8 connection(s)
W20260926 07:27:17.094441  1169 serialization.cc:72] Serialized kudu.rpc_test.PushStringsRequestPB (2147483654 bytes) is larger than the maximum configured RPC message size (52428800 bytes). Sending anyway, but peer may reject the data.
W20260926 07:27:17.098748  1408 connection.cc:535] server connection from unix:<unnamed> recv error: Network error: RPC frame had a length of 2147483714, but we only support messages up to 52428800 bytes long.
W20260926 07:27:17.098814  1408 connection.cc:158] shutting down server connection from unix:<unnamed> with pending inbound data: 4/2147483714 bytes received; last active 0 ns ago: status Network error: RPC frame had a length of 2147483714, but we only support messages up to 52428800 bytes long.
W20260926 07:27:17.099056  1424 connection.cc:196] Error closing socket: Network error: TlsSocket::Close: Broken pipe
I20260926 07:27:17.116037  1436 acceptor_pool.cc:254] collecting diagnostics on the listening RPC socket unix:/tmp/dist-test-taskGfgiJO/test-tmp/rpc-test-c3b79f7b059b468d8d2b273e8d00b4db.sock every 8 connection(s)
I20260926 07:27:17.116086  1437 acceptor_pool.cc:254] collecting diagnostics on the listening RPC socket unix:/tmp/dist-test-taskGfgiJO/test-tmp/rpc-test-c3b79f7b059b468d8d2b273e8d00b4db.sock every 8 connection(s)
W20260926 07:27:22.328222  1433 connection.cc:577] server connection from unix:<unnamed>: received bad data: 'Corruption: Invalid packet: message had a length of 2147483710, but we only support messages up to 2147483647 bytes
'
W20260926 07:27:22.328567  1449 connection.cc:196] Error closing socket: Network error: TlsSocket::Close: Broken pipe
[       OK ] Parameters/TestRpc.TestRpcSidecarLimits/SSL_UnixSocket (7056 ms)
[ RUN      ] Parameters/TestRpc.TestCallTimeoutDoesntAffectNegotiation/SSL_UnixSocket
I20260926 07:27:22.353108  1461 acceptor_pool.cc:254] collecting diagnostics on the listening RPC socket unix:/tmp/dist-test-taskGfgiJO/test-tmp/rpc-test-294ce3ccae8a4d1f9cef82f63802b3cb.sock every 8 connection(s)
I20260926 07:27:22.353155  1462 acceptor_pool.cc:254] collecting diagnostics on the listening RPC socket unix:/tmp/dist-test-taskGfgiJO/test-tmp/rpc-test-294ce3ccae8a4d1f9cef82f63802b3cb.sock every 8 connection(s)
W20260926 07:27:22.361771  1457 negotiation.cc:266] Injecting 500ms delay in negotiation
I20260926 07:27:22.412276  1169 rpc-test-base.h:595] status: Timed out: connection negotiation to unix:/tmp/dist-test-taskGfgiJO/test-tmp/rpc-test-294ce3ccae8a4d1f9cef82f63802b3cb.sock for RPC Sleep timed out after 0.050s (ON_OUTBOUND_QUEUE), seconds elapsed: 0.0509869
W20260926 07:27:22.867555  1458 connection.cc:196] Error closing socket: Network error: TlsSocket::Close: Broken pipe
[       OK ] Parameters/TestRpc.TestCallTimeoutDoesntAffectNegotiation/SSL_UnixSocket (537 ms)
[ RUN      ] Parameters/TestRpc.TestRpcHandlerLatencyMetric/SSL_UnixSocket
I20260926 07:27:22.889165  1487 acceptor_pool.cc:254] collecting diagnostics on the listening RPC socket unix:/tmp/dist-test-taskGfgiJO/test-tmp/rpc-test-501cf55f35d9423e819a959ea7a2f7b0.sock every 8 connection(s)
I20260926 07:27:22.889189  1486 acceptor_pool.cc:254] collecting diagnostics on the listening RPC socket unix:/tmp/dist-test-taskGfgiJO/test-tmp/rpc-test-501cf55f35d9423e819a959ea7a2f7b0.sock every 8 connection(s)
I20260926 07:27:22.926118  1169 rpc-test.cc:1236] Sleep() min lat: 20419
I20260926 07:27:22.926192  1169 rpc-test.cc:1237] Sleep() mean lat: 20419
I20260926 07:27:22.926221  1169 rpc-test.cc:1238] Sleep() max lat: 20419
I20260926 07:27:22.926235  1169 rpc-test.cc:1239] Sleep() #calls: 1
W20260926 07:27:22.926983  1483 connection.cc:196] Error closing socket: Network error: TlsSocket::Close: Broken pipe
[       OK ] Parameters/TestRpc.TestRpcHandlerLatencyMetric/SSL_UnixSocket (60 ms)
[ RUN      ] Parameters/TestRpc.TimedOutOnResponseMetricServiceQueue/SSL_UnixSocket
I20260926 07:27:22.948364  1512 acceptor_pool.cc:254] collecting diagnostics on the listening RPC socket unix:/tmp/dist-test-taskGfgiJO/test-tmp/rpc-test-f49604c06657466ea71fb02a8ec92dc5.sock every 8 connection(s)
I20260926 07:27:22.948375  1513 acceptor_pool.cc:254] collecting diagnostics on the listening RPC socket unix:/tmp/dist-test-taskGfgiJO/test-tmp/rpc-test-f49604c06657466ea71fb02a8ec92dc5.sock every 8 connection(s)
W20260926 07:27:23.000743  1514 rpcz_store.cc:267] Call kudu.rpc_test.CalculatorService.Sleep from unix:<unnamed> (request call id 2) took 20 ms (client timeout 20 ms). Trace:
W20260926 07:27:23.000874  1514 rpcz_store.cc:269] 0926 07:27:22.980254 (+     0us) service_pool.cc:170] Inserting onto call queue
0926 07:27:23.000674 (+ 20420us) service_pool.cc:214] Skipping call since client already timed out
0926 07:27:23.000703 (+    29us) inbound_call.cc:173] Queueing failure response
Metrics: {}
W20260926 07:27:23.002017  1509 connection.cc:196] Error closing socket: Network error: TlsSocket::Close: Broken pipe
[       OK ] Parameters/TestRpc.TimedOutOnResponseMetricServiceQueue/SSL_UnixSocket (74 ms)
[ RUN      ] Parameters/TestRpc.RpcPendingConnectionsMetric/SSL_UnixSocket
I20260926 07:27:23.005904  1535 acceptor_pool.cc:254] collecting diagnostics on the listening RPC socket 0.0.0.0:38547 every 8 connection(s)
I20260926 07:27:23.005959  1536 acceptor_pool.cc:254] collecting diagnostics on the listening RPC socket 0.0.0.0:38547 every 8 connection(s)
W20260926 07:27:23.015561  1531 negotiation.cc:337] Failed RPC negotiation. Trace:
0926 07:27:23.014913 (+     0us) reactor.cc:625] Submitting negotiation task for server connection from 127.0.0.1:42462 (local address 127.0.0.1:38547)
0926 07:27:23.015060 (+   147us) server_negotiation.cc:206] Beginning negotiation
0926 07:27:23.015065 (+     5us) server_negotiation.cc:399] Waiting for connection header
0926 07:27:23.015220 (+   155us) negotiation.cc:327] Negotiation complete: Network error: Server connection negotiation failed: server connection from 127.0.0.1:42462: BlockingRecv error: recv got EOF from 127.0.0.1:42462 (error 108)
Metrics: {"server-negotiator.queue_time_us":34}
[       OK ] Parameters/TestRpc.RpcPendingConnectionsMetric/SSL_UnixSocket (23 ms)
[ RUN      ] Parameters/TestRpc.TestRpcContextClientDeadline/SSL_UnixSocket
I20260926 07:27:23.037305  1551 acceptor_pool.cc:254] collecting diagnostics on the listening RPC socket unix:/tmp/dist-test-taskGfgiJO/test-tmp/rpc-test-01b116685d05453bb0b6020db4ae0318.sock every 8 connection(s)
I20260926 07:27:23.037326  1552 acceptor_pool.cc:254] collecting diagnostics on the listening RPC socket unix:/tmp/dist-test-taskGfgiJO/test-tmp/rpc-test-01b116685d05453bb0b6020db4ae0318.sock every 8 connection(s)
W20260926 07:27:23.091138  1548 connection.cc:196] Error closing socket: Network error: TlsSocket::Close: Broken pipe
[       OK ] Parameters/TestRpc.TestRpcContextClientDeadline/SSL_UnixSocket (65 ms)
[ RUN      ] Parameters/TestRpc.TestApplicationFeatureFlagUnsupportedServer/SSL_UnixSocket
I20260926 07:27:23.100013  1576 acceptor_pool.cc:254] collecting diagnostics on the listening RPC socket unix:/tmp/dist-test-taskGfgiJO/test-tmp/rpc-test-b421fb830d3649efb71156affaca7094.sock every 8 connection(s)
I20260926 07:27:23.100054  1577 acceptor_pool.cc:254] collecting diagnostics on the listening RPC socket unix:/tmp/dist-test-taskGfgiJO/test-tmp/rpc-test-b421fb830d3649efb71156affaca7094.sock every 8 connection(s)
[       OK ] Parameters/TestRpc.TestApplicationFeatureFlagUnsupportedServer/SSL_UnixSocket (31 ms)
[ RUN      ] Parameters/TestRpc.TestCancellationAsync/SSL_UnixSocket
I20260926 07:27:23.132726  1601 acceptor_pool.cc:254] collecting diagnostics on the listening RPC socket unix:/tmp/dist-test-taskGfgiJO/test-tmp/rpc-test-e09811d7d8764593a6b048c5124cf6a8.sock every 8 connection(s)
I20260926 07:27:23.132776  1602 acceptor_pool.cc:254] collecting diagnostics on the listening RPC socket unix:/tmp/dist-test-taskGfgiJO/test-tmp/rpc-test-e09811d7d8764593a6b048c5124cf6a8.sock every 8 connection(s)
I20260926 07:27:23.133112  1169 rpc-test.cc:1716] Connecting to unix:/tmp/dist-test-taskGfgiJO/test-tmp/rpc-test-e09811d7d8764593a6b048c5124cf6a8.sock
I20260926 07:27:23.147790  1169 test_util.cc:268] Using random seed: -1013797365
I20260926 07:27:23.173187  1605 rpc-test-base.h:240] got call: sleep_micros: 500 pattern: 4294967295 num_repetitions: 2097152 sidecar_idx: 0
I20260926 07:27:23.190987  1604 rpc-test-base.h:240] got call: sleep_micros: 500 pattern: 4294967295 num_repetitions: 2097152 sidecar_idx: 0
I20260926 07:27:23.208843  1605 rpc-test-base.h:240] got call: sleep_micros: 500 pattern: 4294967295 num_repetitions: 2097152 sidecar_idx: 0
I20260926 07:27:23.226205  1604 rpc-test-base.h:240] got call: sleep_micros: 500 pattern: 4294967295 num_repetitions: 2097152 sidecar_idx: 0
I20260926 07:27:23.245293  1605 rpc-test-base.h:240] got call: sleep_micros: 500 pattern: 4294967295 num_repetitions: 2097152 sidecar_idx: 0
I20260926 07:27:23.263770  1604 rpc-test-base.h:240] got call: sleep_micros: 500 pattern: 4294967295 num_repetitions: 2097152 sidecar_idx: 0
I20260926 07:27:23.281925  1605 rpc-test-base.h:240] got call: sleep_micros: 500 pattern: 4294967295 num_repetitions: 2097152 sidecar_idx: 0
W20260926 07:27:23.283811  1598 connection.cc:196] Error closing socket: Network error: TlsSocket::Close: Broken pipe
W20260926 07:27:23.302766  1598 connection.cc:441] server connection from unix:<unnamed> torn down before Call kudu.rpc.GenericCalculatorService.SleepWithSidecar from unix:<unnamed> (request call id 9) could send its response
[       OK ] Parameters/TestRpc.TestCancellationAsync/SSL_UnixSocket (180 ms)
[ RUN      ] Parameters/TestRpc.TestPerformanceBySocketType/SSL_UnixSocket
I20260926 07:27:23.319916  1626 acceptor_pool.cc:254] collecting diagnostics on the listening RPC socket unix:/tmp/dist-test-taskGfgiJO/test-tmp/rpc-test-d8c992590c6048a799b711d29237db63.sock every 8 connection(s)
I20260926 07:27:23.319959  1627 acceptor_pool.cc:254] collecting diagnostics on the listening RPC socket unix:/tmp/dist-test-taskGfgiJO/test-tmp/rpc-test-d8c992590c6048a799b711d29237db63.sock every 8 connection(s)
I20260926 07:27:23.320302  1169 rpc-test.cc:1846] Connecting to unix:/tmp/dist-test-taskGfgiJO/test-tmp/rpc-test-d8c992590c6048a799b711d29237db63.sock
I20260926 07:27:25.163185  1169 rpc-test.cc:1859] Sending 1024MB via ssl-enabled unix socket: real 1.830s	user 2.280s	sys 0.979s
I20260926 07:27:26.914551  1169 rpc-test.cc:1859] Sending 1024MB via ssl-enabled unix socket: real 1.751s	user 2.190s	sys 0.949s
I20260926 07:27:28.748131  1169 rpc-test.cc:1859] Sending 1024MB via ssl-enabled unix socket: real 1.833s	user 2.156s	sys 1.118s
I20260926 07:27:30.591293  1169 rpc-test.cc:1859] Sending 1024MB via ssl-enabled unix socket: real 1.843s	user 2.211s	sys 1.083s
I20260926 07:27:32.438714  1169 rpc-test.cc:1859] Sending 1024MB via ssl-enabled unix socket: real 1.847s	user 2.322s	sys 0.977s
W20260926 07:27:32.439982  1623 connection.cc:196] Error closing socket: Network error: TlsSocket::Close: Broken pipe
[       OK ] Parameters/TestRpc.TestPerformanceBySocketType/SSL_UnixSocket (9136 ms)
[----------] 20 tests from Parameters/TestRpc (33076 ms total)

[----------] 1 test from Parameters/TestRpcSocketTxRxQueue
[ RUN      ] Parameters/TestRpcSocketTxRxQueue.AcceptorRxQueueSizeMetric/0
I20260926 07:27:32.449226  1651 acceptor_pool.cc:254] collecting diagnostics on the listening RPC socket 0.0.0.0:35433 every 1 connection(s)
I20260926 07:27:32.449242  1652 acceptor_pool.cc:254] collecting diagnostics on the listening RPC socket 0.0.0.0:35433 every 1 connection(s)
W20260926 07:27:32.450243  1647 negotiation.cc:337] Failed RPC negotiation. Trace:
0926 07:27:32.449967 (+     0us) reactor.cc:625] Submitting negotiation task for server connection from 127.0.0.1:37530 (local address 127.0.0.1:35433)
0926 07:27:32.450090 (+   123us) server_negotiation.cc:206] Beginning negotiation
0926 07:27:32.450093 (+     3us) server_negotiation.cc:399] Waiting for connection header
0926 07:27:32.450174 (+    81us) negotiation.cc:327] Negotiation complete: Network error: Server connection negotiation failed: server connection from 127.0.0.1:37530: BlockingRecv error: recv got EOF from 127.0.0.1:37530 (error 108)
Metrics: {"server-negotiator.queue_time_us":45}
[       OK ] Parameters/TestRpcSocketTxRxQueue.AcceptorRxQueueSizeMetric/0 (11 ms)
[----------] 1 test from Parameters/TestRpcSocketTxRxQueue (11 ms total)

[----------] Global test environment tear-down
[==========] 21 tests from 2 test suites ran. (33088 ms total)
[  PASSED  ] 20 tests.
[  FAILED  ] 1 test, listed below:
[  FAILED  ] Parameters/TestRpc.TestCallWithChainCertAndChainCA/SSL_UnixSocket, where GetParam() = (true, true)

 1 FAILED TEST