Diagnosed failure

Parameters/TestRpc.TestCallWithChainCertAndChainCA/SSL_TCP: /data0/somelongdirectorytoavoidrpathissues/src/kudu/src/kudu/rpc/rpc-test.cc:270: Failure
Failed
Bad status: Runtime error: could not verify certificate chain (error with cert: subject=CN = localhost, ST = sadfjas, C = AS, emailAddress = sdflkdsajf, O = lskdfjlsad, OU = sldfkja, issuer=C = AS, ST = ASDfkjdhf, L = lskdjf, O = saldfja, OU = skdjf, CN = localhost, emailAddress = sadjflkadsj): : certificate has expired
Google Test trace:
/data0/somelongdirectorytoavoidrpathissues/src/kudu/src/kudu/rpc/rpc-test.cc:267: Connecting to 0.0.0.0:33053
I20260926 16:12:57.298143  4936 test_util.cc:175] -----------------------------------------------
I20260926 16:12:57.298349  4936 test_util.cc:176] Had fatal failures, leaving test files at /tmp/dist-test-task2TKYbc/test-tmp/rpc-test.5.Parameters_TestRpc.TestCallWithChainCertAndChainCA_SSL_TCP.1790439175765750-4936-0

Full log

Note: This is test shard 6 of 8.
[==========] Running 21 tests from 2 test suites.
[----------] Global test environment set-up.
[----------] 20 tests from Parameters/TestRpc
[ RUN      ] Parameters/TestRpc.TestMessengerCreateDestroy/SSL_TCP
WARNING: Logging before InitGoogleLogging() is written to STDERR
I20260926 16:12:55.875994  4936 rpc-test.cc:169] started messenger TestCreateDestroy
[       OK ] Parameters/TestRpc.TestMessengerCreateDestroy/SSL_TCP (1312 ms)
[ RUN      ] Parameters/TestRpc.TestNegotiationDeadlock/SSL_TCP
I20260926 16:12:57.174152  4958 acceptor_pool.cc:254] collecting diagnostics on the listening RPC socket 0.0.0.0:34201 every 8 connection(s)
I20260926 16:12:57.175949  4959 acceptor_pool.cc:254] collecting diagnostics on the listening RPC socket 0.0.0.0:34201 every 8 connection(s)
[       OK ] Parameters/TestRpc.TestNegotiationDeadlock/SSL_TCP (96 ms)
[ RUN      ] Parameters/TestRpc.TestCallWithChainCertAndChainCA/SSL_TCP
I20260926 16:12:57.265094  4974 acceptor_pool.cc:254] collecting diagnostics on the listening RPC socket 0.0.0.0:33053 every 8 connection(s)
I20260926 16:12:57.267386  4975 acceptor_pool.cc:254] collecting diagnostics on the listening RPC socket 0.0.0.0:33053 every 8 connection(s)
/data0/somelongdirectorytoavoidrpathissues/src/kudu/src/kudu/rpc/rpc-test.cc:270: Failure
Failed
Bad status: Runtime error: could not verify certificate chain (error with cert: subject=CN = localhost, ST = sadfjas, C = AS, emailAddress = sdflkdsajf, O = lskdfjlsad, OU = sldfkja, issuer=C = AS, ST = ASDfkjdhf, L = lskdjf, O = saldfja, OU = skdjf, CN = localhost, emailAddress = sadjflkadsj): : certificate has expired
Google Test trace:
/data0/somelongdirectorytoavoidrpathissues/src/kudu/src/kudu/rpc/rpc-test.cc:267: Connecting to 0.0.0.0:33053
I20260926 16:12:57.298143  4936 test_util.cc:175] -----------------------------------------------
I20260926 16:12:57.298349  4936 test_util.cc:176] Had fatal failures, leaving test files at /tmp/dist-test-task2TKYbc/test-tmp/rpc-test.5.Parameters_TestRpc.TestCallWithChainCertAndChainCA_SSL_TCP.1790439175765750-4936-0
[  FAILED  ] Parameters/TestRpc.TestCallWithChainCertAndChainCA/SSL_TCP, where GetParam() = (true, false) (61 ms)
[ RUN      ] Parameters/TestRpc.TestCallWithPasswordProtectedKey/SSL_TCP
I20260926 16:12:57.320552  4999 acceptor_pool.cc:254] collecting diagnostics on the listening RPC socket 0.0.0.0:41953 every 8 connection(s)
I20260926 16:12:57.321511  5000 acceptor_pool.cc:254] collecting diagnostics on the listening RPC socket 0.0.0.0:41953 every 8 connection(s)
[       OK ] Parameters/TestRpc.TestCallWithPasswordProtectedKey/SSL_TCP (79 ms)
[ RUN      ] Parameters/TestRpc.TestCallToBadServer/SSL_TCP
I20260926 16:12:57.414937  4936 rpc-test.cc:394] Status: Network error: Client connection negotiation failed: client connection to 0.0.0.0:0: connect: Connection refused (error 111)
I20260926 16:12:57.416426  4936 rpc-test.cc:394] Status: Network error: Client connection negotiation failed: client connection to 0.0.0.0:0: connect: Connection refused (error 111)
I20260926 16:12:57.417833  4936 rpc-test.cc:394] Status: Network error: Client connection negotiation failed: client connection to 0.0.0.0:0: connect: Connection refused (error 111)
I20260926 16:12:57.419234  4936 rpc-test.cc:394] Status: Network error: Client connection negotiation failed: client connection to 0.0.0.0:0: connect: Connection refused (error 111)
I20260926 16:12:57.420971  4936 rpc-test.cc:394] Status: Network error: Client connection negotiation failed: client connection to 0.0.0.0:0: connect: Connection refused (error 111)
[       OK ] Parameters/TestRpc.TestCallToBadServer/SSL_TCP (46 ms)
[ RUN      ] Parameters/TestRpc.TestWrongService/SSL_TCP
I20260926 16:12:57.450907  5034 acceptor_pool.cc:254] collecting diagnostics on the listening RPC socket 0.0.0.0:33751 every 8 connection(s)
I20260926 16:12:57.451725  5035 acceptor_pool.cc:254] collecting diagnostics on the listening RPC socket 0.0.0.0:33751 every 8 connection(s)
I20260926 16:12:57.495054  5033 messenger.cc:345] service WrongServiceName not registered on TestServer
[       OK ] Parameters/TestRpc.TestWrongService/SSL_TCP (79 ms)
[ RUN      ] Parameters/TestRpc.TestConnectionKeepalive/SSL_TCP
I20260926 16:12:57.545576  5057 acceptor_pool.cc:254] collecting diagnostics on the listening RPC socket 0.0.0.0:46257 every 8 connection(s)
I20260926 16:12:57.546409  5058 acceptor_pool.cc:254] collecting diagnostics on the listening RPC socket 0.0.0.0:46257 every 8 connection(s)
I20260926 16:12:57.550514  4936 rpc-test.cc:488] Connecting to 0.0.0.0:46257
[       OK ] Parameters/TestRpc.TestConnectionKeepalive/SSL_TCP (1101 ms)
[ RUN      ] Parameters/TestRpc.TestClientConnectionMetrics/SSL_TCP
I20260926 16:12:58.625958  5082 acceptor_pool.cc:254] collecting diagnostics on the listening RPC socket 0.0.0.0:37775 every 8 connection(s)
I20260926 16:12:58.626488  5083 acceptor_pool.cc:254] collecting diagnostics on the listening RPC socket 0.0.0.0:37775 every 8 connection(s)
I20260926 16:12:58.630645  4936 rpc-test.cc:569] Connecting to 0.0.0.0:37775
[       OK ] Parameters/TestRpc.TestClientConnectionMetrics/SSL_TCP (130315 ms)
[ RUN      ] Parameters/TestRpc.TestCredentialsPolicy/SSL_TCP
I20260926 16:15:08.946805  5118 acceptor_pool.cc:254] collecting diagnostics on the listening RPC socket 0.0.0.0:45673 every 8 connection(s)
I20260926 16:15:08.947700  5119 acceptor_pool.cc:254] collecting diagnostics on the listening RPC socket 0.0.0.0:45673 every 8 connection(s)
I20260926 16:15:08.951129  4936 rpc-test.cc:700] Connecting to 0.0.0.0:45673
[       OK ] Parameters/TestRpc.TestCredentialsPolicy/SSL_TCP (92 ms)
[ RUN      ] Parameters/TestRpc.TestCallLongerThanKeepalive/SSL_TCP
I20260926 16:15:09.035619  5143 acceptor_pool.cc:254] collecting diagnostics on the listening RPC socket 0.0.0.0:38695 every 8 connection(s)
I20260926 16:15:09.036394  5144 acceptor_pool.cc:254] collecting diagnostics on the listening RPC socket 0.0.0.0:38695 every 8 connection(s)
I20260926 16:15:09.065773  5147 rpc-test-base.h:222] got call: sleep_micros: 3000000 deferred: true
I20260926 16:15:12.070322  5147 rpcz_store.cc:275] Call kudu.rpc.GenericCalculatorService.Sleep from 127.0.0.1:42278 (request call id 0) took 3004 ms. Trace:
I20260926 16:15:12.070700  5147 rpcz_store.cc:276] 0926 16:15:09.065456 (+     0us) service_pool.cc:170] Inserting onto call queue
0926 16:15:09.065611 (+   155us) service_pool.cc:227] Handling call
0926 16:15:12.070258 (+3004647us) inbound_call.cc:173] Queueing success response
Metrics: {}
[       OK ] Parameters/TestRpc.TestCallLongerThanKeepalive/SSL_TCP (3065 ms)
[ RUN      ] Parameters/TestRpc.TestRpcSidecar/SSL_TCP
I20260926 16:15:12.110666  5168 acceptor_pool.cc:254] collecting diagnostics on the listening RPC socket 0.0.0.0:35813 every 8 connection(s)
I20260926 16:15:12.111367  5169 acceptor_pool.cc:254] collecting diagnostics on the listening RPC socket 0.0.0.0:35813 every 8 connection(s)
[       OK ] Parameters/TestRpc.TestRpcSidecar/SSL_TCP (548 ms)
[ RUN      ] Parameters/TestRpc.TestRpcSidecarLimits/SSL_TCP
I20260926 16:15:30.068519  5195 acceptor_pool.cc:254] collecting diagnostics on the listening RPC socket 0.0.0.0:39715 every 8 connection(s)
I20260926 16:15:30.069458  5196 acceptor_pool.cc:254] collecting diagnostics on the listening RPC socket 0.0.0.0:39715 every 8 connection(s)
W20260926 16:15:30.085909  4936 serialization.cc:72] Serialized kudu.rpc_test.PushStringsRequestPB (2147483654 bytes) is larger than the maximum configured RPC message size (52428800 bytes). Sending anyway, but peer may reject the data.
W20260926 16:15:30.097750  5194 connection.cc:535] server connection from 127.0.0.1:34216 recv error: Network error: RPC frame had a length of 2147483714, but we only support messages up to 52428800 bytes long.
W20260926 16:15:30.098069  5194 connection.cc:158] shutting down server connection from 127.0.0.1:34216 with pending inbound data: 4/2147483714 bytes received; last active 0 ns ago: status Network error: RPC frame had a length of 2147483714, but we only support messages up to 52428800 bytes long.
W20260926 16:15:30.099105  5208 connection.cc:698] client connection to 0.0.0.0:39715 send error: Network error: failed to write to TLS socket: Connection reset by peer
W20260926 16:15:30.099740  5208 connection.cc:196] Error closing socket: Network error: TlsSocket::Close: Success
[       OK ] Parameters/TestRpc.TestRpcSidecarLimits/SSL_TCP (18144 ms)
[ RUN      ] Parameters/TestRpc.TestCallTimeoutDoesntAffectNegotiation/SSL_TCP
I20260926 16:15:30.806155  5220 acceptor_pool.cc:254] collecting diagnostics on the listening RPC socket 0.0.0.0:36789 every 8 connection(s)
I20260926 16:15:30.806921  5221 acceptor_pool.cc:254] collecting diagnostics on the listening RPC socket 0.0.0.0:36789 every 8 connection(s)
W20260926 16:15:30.841331  5216 negotiation.cc:266] Injecting 500ms delay in negotiation
I20260926 16:15:30.890900  4936 rpc-test-base.h:595] status: Timed out: connection negotiation to 0.0.0.0:36789 for RPC Sleep timed out after 0.050s (ON_OUTBOUND_QUEUE), seconds elapsed: 0.0507491
[       OK ] Parameters/TestRpc.TestCallTimeoutDoesntAffectNegotiation/SSL_TCP (592 ms)
[ RUN      ] Parameters/TestRpc.TestRpcHandlerLatencyMetric/SSL_TCP
I20260926 16:15:31.417615  5245 acceptor_pool.cc:254] collecting diagnostics on the listening RPC socket 0.0.0.0:46465 every 8 connection(s)
I20260926 16:15:31.418429  5246 acceptor_pool.cc:254] collecting diagnostics on the listening RPC socket 0.0.0.0:46465 every 8 connection(s)
I20260926 16:15:31.475642  4936 rpc-test.cc:1236] Sleep() min lat: 21740
I20260926 16:15:31.475900  4936 rpc-test.cc:1237] Sleep() mean lat: 21740
I20260926 16:15:31.476119  4936 rpc-test.cc:1238] Sleep() max lat: 21740
I20260926 16:15:31.476311  4936 rpc-test.cc:1239] Sleep() #calls: 1
[       OK ] Parameters/TestRpc.TestRpcHandlerLatencyMetric/SSL_TCP (117 ms)
[ RUN      ] Parameters/TestRpc.TimedOutOnResponseMetricServiceQueue/SSL_TCP
I20260926 16:15:31.501467  5271 acceptor_pool.cc:254] collecting diagnostics on the listening RPC socket 0.0.0.0:38815 every 8 connection(s)
I20260926 16:15:31.502256  5272 acceptor_pool.cc:254] collecting diagnostics on the listening RPC socket 0.0.0.0:38815 every 8 connection(s)
W20260926 16:15:31.579734  5273 rpcz_store.cc:267] Call kudu.rpc_test.CalculatorService.Sleep from 127.0.0.1:32920 (request call id 2) took 20 ms (client timeout 20 ms). Trace:
W20260926 16:15:31.580070  5273 rpcz_store.cc:269] 0926 16:15:31.559181 (+     0us) service_pool.cc:170] Inserting onto call queue
0926 16:15:31.579593 (+ 20412us) service_pool.cc:214] Skipping call since client already timed out
0926 16:15:31.579679 (+    86us) inbound_call.cc:173] Queueing failure response
Metrics: {}
[       OK ] Parameters/TestRpc.TimedOutOnResponseMetricServiceQueue/SSL_TCP (102 ms)
[ RUN      ] Parameters/TestRpc.RpcPendingConnectionsMetric/SSL_TCP
I20260926 16:15:31.598094  5294 acceptor_pool.cc:254] collecting diagnostics on the listening RPC socket 0.0.0.0:40817 every 8 connection(s)
I20260926 16:15:31.598870  5295 acceptor_pool.cc:254] collecting diagnostics on the listening RPC socket 0.0.0.0:40817 every 8 connection(s)
W20260926 16:15:31.604264  5290 negotiation.cc:337] Failed RPC negotiation. Trace:
0926 16:15:31.602868 (+     0us) reactor.cc:625] Submitting negotiation task for server connection from 127.0.0.1:35786 (local address 127.0.0.1:40817)
0926 16:15:31.603332 (+   464us) server_negotiation.cc:206] Beginning negotiation
0926 16:15:31.603354 (+    22us) server_negotiation.cc:399] Waiting for connection header
0926 16:15:31.603711 (+   357us) negotiation.cc:327] Negotiation complete: Network error: Server connection negotiation failed: server connection from 127.0.0.1:35786: BlockingRecv error: recv got EOF from 127.0.0.1:35786 (error 108)
Metrics: {"server-negotiator.queue_time_us":114}
[       OK ] Parameters/TestRpc.RpcPendingConnectionsMetric/SSL_TCP (30 ms)
[ RUN      ] Parameters/TestRpc.TestRpcContextClientDeadline/SSL_TCP
I20260926 16:15:31.647159  5310 acceptor_pool.cc:254] collecting diagnostics on the listening RPC socket 0.0.0.0:41893 every 8 connection(s)
I20260926 16:15:31.647940  5311 acceptor_pool.cc:254] collecting diagnostics on the listening RPC socket 0.0.0.0:41893 every 8 connection(s)
[       OK ] Parameters/TestRpc.TestRpcContextClientDeadline/SSL_TCP (96 ms)
[ RUN      ] Parameters/TestRpc.TestApplicationFeatureFlagUnsupportedServer/SSL_TCP
I20260926 16:15:31.738796  5335 acceptor_pool.cc:254] collecting diagnostics on the listening RPC socket 0.0.0.0:37271 every 8 connection(s)
I20260926 16:15:31.739604  5336 acceptor_pool.cc:254] collecting diagnostics on the listening RPC socket 0.0.0.0:37271 every 8 connection(s)
[       OK ] Parameters/TestRpc.TestApplicationFeatureFlagUnsupportedServer/SSL_TCP (69 ms)
[ RUN      ] Parameters/TestRpc.TestCancellationAsync/SSL_TCP
I20260926 16:15:31.822495  5360 acceptor_pool.cc:254] collecting diagnostics on the listening RPC socket 0.0.0.0:46137 every 8 connection(s)
I20260926 16:15:31.823276  5361 acceptor_pool.cc:254] collecting diagnostics on the listening RPC socket 0.0.0.0:46137 every 8 connection(s)
I20260926 16:15:31.826506  4936 rpc-test.cc:1716] Connecting to 0.0.0.0:46137
I20260926 16:15:31.843353  4936 test_util.cc:268] Using random seed: 610127107
I20260926 16:15:32.088236  5364 rpc-test-base.h:240] got call: sleep_micros: 500 pattern: 4294967295 num_repetitions: 2097152 sidecar_idx: 0
I20260926 16:15:32.258397  5363 rpc-test-base.h:240] got call: sleep_micros: 500 pattern: 4294967295 num_repetitions: 2097152 sidecar_idx: 0
I20260926 16:15:32.461759  5364 rpc-test-base.h:240] got call: sleep_micros: 500 pattern: 4294967295 num_repetitions: 2097152 sidecar_idx: 0
I20260926 16:15:32.642764  5363 rpc-test-base.h:240] got call: sleep_micros: 500 pattern: 4294967295 num_repetitions: 2097152 sidecar_idx: 0
W20260926 16:15:32.747677  5373 outbound_call.cc:322] RPC callback for RPC call kudu.rpc.GenericCalculatorService.SleepWithSidecar -> {remote=0.0.0.0:46137 (localhost), user_credentials={real_user=slave}} blocked reactor thread for 45224us
I20260926 16:15:32.846527  5364 rpc-test-base.h:240] got call: sleep_micros: 500 pattern: 4294967295 num_repetitions: 2097152 sidecar_idx: 0
I20260926 16:15:33.031499  5363 rpc-test-base.h:240] got call: sleep_micros: 500 pattern: 4294967295 num_repetitions: 2097152 sidecar_idx: 0
I20260926 16:15:33.216744  5364 rpc-test-base.h:240] got call: sleep_micros: 500 pattern: 4294967295 num_repetitions: 2097152 sidecar_idx: 0
I20260926 16:15:33.408703  5364 rpc-test-base.h:240] got call: sleep_micros: 500 pattern: 4294967295 num_repetitions: 2097152 sidecar_idx: 0
W20260926 16:15:33.574352  5357 connection.cc:196] Error closing socket: Network error: TlsSocket::Close: Broken pipe
W20260926 16:15:33.579455  5357 connection.cc:441] server connection from 127.0.0.1:53198 torn down before Call kudu.rpc.GenericCalculatorService.SleepWithSidecar from 127.0.0.1:53198 (request call id 8) could send its response
[       OK ] Parameters/TestRpc.TestCancellationAsync/SSL_TCP (1804 ms)
[ RUN      ] Parameters/TestRpc.TestPerformanceBySocketType/SSL_TCP
I20260926 16:15:33.679322  5385 acceptor_pool.cc:254] collecting diagnostics on the listening RPC socket 0.0.0.0:40525 every 8 connection(s)
I20260926 16:15:33.680040  5386 acceptor_pool.cc:254] collecting diagnostics on the listening RPC socket 0.0.0.0:40525 every 8 connection(s)
I20260926 16:15:33.683113  4936 rpc-test.cc:1846] Connecting to 0.0.0.0:40525
I20260926 16:15:53.436004  4936 rpc-test.cc:1859] Sending 1024MB via ssl-enabled tcp socket: real 19.729s	user 16.763s	sys 11.372s
I20260926 16:16:13.098874  4936 rpc-test.cc:1859] Sending 1024MB via ssl-enabled tcp socket: real 19.662s	user 16.846s	sys 11.020s
I20260926 16:16:32.735672  4936 rpc-test.cc:1859] Sending 1024MB via ssl-enabled tcp socket: real 19.636s	user 16.988s	sys 11.024s
I20260926 16:16:52.422343  4936 rpc-test.cc:1859] Sending 1024MB via ssl-enabled tcp socket: real 19.686s	user 16.943s	sys 11.117s
I20260926 16:17:12.100841  4936 rpc-test.cc:1859] Sending 1024MB via ssl-enabled tcp socket: real 19.678s	user 16.976s	sys 11.053s
[       OK ] Parameters/TestRpc.TestPerformanceBySocketType/SSL_TCP (98531 ms)
[----------] 20 tests from Parameters/TestRpc (256293 ms total)

[----------] 1 test from Parameters/TestRpcSocketTxRxQueue
[ RUN      ] Parameters/TestRpcSocketTxRxQueue.OverCapacity/0
W20260926 16:17:12.571009  5412 negotiation.cc:337] Failed RPC negotiation. Trace:
0926 16:17:12.135877 (+     0us) reactor.cc:625] Submitting negotiation task for client connection to 0.0.0.0:41077 (local address 127.0.0.1:57078)
0926 16:17:12.136571 (+   694us) negotiation.cc:107] Waiting for socket to connect
0926 16:17:12.136622 (+    51us) client_negotiation.cc:174] Beginning negotiation
0926 16:17:12.137148 (+   526us) client_negotiation.cc:252] Sending NEGOTIATE NegotiatePB request
0926 16:17:12.569849 (+432701us) negotiation.cc:327] Negotiation complete: Network error: Client connection negotiation failed: client connection to 0.0.0.0:41077: BlockingRecv error: recv error from unknown peer: Transport endpoint is not connected (error 107)
Metrics: {"client-negotiator.queue_time_us":115}
W20260926 16:17:12.571111  5430 negotiation.cc:337] Failed RPC negotiation. Trace:
0926 16:17:12.150607 (+     0us) reactor.cc:625] Submitting negotiation task for client connection to 0.0.0.0:41077 (local address 127.0.0.1:57106)
0926 16:17:12.151212 (+   605us) negotiation.cc:107] Waiting for socket to connect
0926 16:17:12.151242 (+    30us) client_negotiation.cc:174] Beginning negotiation
0926 16:17:12.151569 (+   327us) client_negotiation.cc:252] Sending NEGOTIATE NegotiatePB request
0926 16:17:12.569969 (+418400us) negotiation.cc:327] Negotiation complete: Network error: Client connection negotiation failed: client connection to 0.0.0.0:41077: BlockingRecv error: recv error from unknown peer: Transport endpoint is not connected (error 107)
Metrics: {"client-negotiator.queue_time_us":178}
W20260926 16:17:12.571120  5439 negotiation.cc:337] Failed RPC negotiation. Trace:
0926 16:17:12.163693 (+     0us) reactor.cc:625] Submitting negotiation task for client connection to 0.0.0.0:41077 (local address 127.0.0.1:57114)
0926 16:17:12.164275 (+   582us) negotiation.cc:107] Waiting for socket to connect
0926 16:17:12.164305 (+    30us) client_negotiation.cc:174] Beginning negotiation
0926 16:17:12.164502 (+   197us) client_negotiation.cc:252] Sending NEGOTIATE NegotiatePB request
0926 16:17:12.569928 (+405426us) negotiation.cc:327] Negotiation complete: Network error: Client connection negotiation failed: client connection to 0.0.0.0:41077: BlockingRecv error: recv error from unknown peer: Transport endpoint is not connected (error 107)
Metrics: {"client-negotiator.queue_time_us":168}
W20260926 16:17:12.574097  5457 negotiation.cc:337] Failed RPC negotiation. Trace:
0926 16:17:12.189948 (+     0us) reactor.cc:625] Submitting negotiation task for client connection to 0.0.0.0:41077 (local address 127.0.0.1:57134)
0926 16:17:12.190579 (+   631us) negotiation.cc:107] Waiting for socket to connect
0926 16:17:12.190610 (+    31us) client_negotiation.cc:174] Beginning negotiation
0926 16:17:12.190800 (+   190us) client_negotiation.cc:252] Sending NEGOTIATE NegotiatePB request
0926 16:17:12.572886 (+382086us) negotiation.cc:327] Negotiation complete: Network error: Client connection negotiation failed: client connection to 0.0.0.0:41077: BlockingRecv error: recv error from unknown peer: Transport endpoint is not connected (error 107)
Metrics: {"client-negotiator.queue_time_us":155}
W20260926 16:17:12.574349  5421 negotiation.cc:337] Failed RPC negotiation. Trace:
0926 16:17:12.142781 (+     0us) reactor.cc:625] Submitting negotiation task for client connection to 0.0.0.0:41077 (local address 127.0.0.1:57092)
0926 16:17:12.143372 (+   591us) negotiation.cc:107] Waiting for socket to connect
0926 16:17:12.143460 (+    88us) client_negotiation.cc:174] Beginning negotiation
0926 16:17:12.143661 (+   201us) client_negotiation.cc:252] Sending NEGOTIATE NegotiatePB request
0926 16:17:12.569885 (+426224us) negotiation.cc:327] Negotiation complete: Network error: Client connection negotiation failed: client connection to 0.0.0.0:41077: BlockingRecv error: recv error from unknown peer: Transport endpoint is not connected (error 107)
Metrics: {"client-negotiator.queue_time_us":172}
W20260926 16:17:12.574357  5448 negotiation.cc:337] Failed RPC negotiation. Trace:
0926 16:17:12.176325 (+     0us) reactor.cc:625] Submitting negotiation task for client connection to 0.0.0.0:41077 (local address 127.0.0.1:57130)
0926 16:17:12.176919 (+   594us) negotiation.cc:107] Waiting for socket to connect
0926 16:17:12.176950 (+    31us) client_negotiation.cc:174] Beginning negotiation
0926 16:17:12.177132 (+   182us) client_negotiation.cc:252] Sending NEGOTIATE NegotiatePB request
0926 16:17:12.573092 (+395960us) negotiation.cc:327] Negotiation complete: Network error: Client connection negotiation failed: client connection to 0.0.0.0:41077: BlockingRecv error: recv error from unknown peer: Transport endpoint is not connected (error 107)
Metrics: {"client-negotiator.queue_time_us":151}
[       OK ] Parameters/TestRpcSocketTxRxQueue.OverCapacity/0 (1247 ms)
[----------] 1 test from Parameters/TestRpcSocketTxRxQueue (1247 ms total)

[----------] Global test environment tear-down
[==========] 21 tests from 2 test suites ran. (257542 ms total)
[  PASSED  ] 20 tests.
[  FAILED  ] 1 test, listed below:
[  FAILED  ] Parameters/TestRpc.TestCallWithChainCertAndChainCA/SSL_TCP, where GetParam() = (true, false)

 1 FAILED TEST