Diagnosed failure
Parameters/TestRpc.TestCallWithChainCertAndChainCA/SSL_UnixSocket: /data0/somelongdirectorytoavoidrpathissues/src/kudu/src/kudu/rpc/rpc-test.cc:270: Failure
Failed
Bad status: Runtime error: could not verify certificate chain (error with cert: subject=CN = localhost, ST = sadfjas, C = AS, emailAddress = sdflkdsajf, O = lskdfjlsad, OU = sldfkja, issuer=C = AS, ST = ASDfkjdhf, L = lskdjf, O = saldfja, OU = skdjf, CN = localhost, emailAddress = sadjflkadsj): : certificate has expired
Google Test trace:
/data0/somelongdirectorytoavoidrpathissues/src/kudu/src/kudu/rpc/rpc-test.cc:267: Connecting to unix:/tmp/dist-test-taskMPjqUk/test-tmp/rpc-test-c53594bccf1b42b286fc3ce20cb538e8.sock
I20260925 10:08:27.646896 2349 test_util.cc:175] -----------------------------------------------
I20260925 10:08:27.647084 2349 test_util.cc:176] Had fatal failures, leaving test files at /tmp/dist-test-taskMPjqUk/test-tmp/rpc-test.6.Parameters_TestRpc.TestCallWithChainCertAndChainCA_SSL_UnixSocket.1790330906117408-2349-0
Full log
Note: This is test shard 7 of 8.
[==========] Running 21 tests from 2 test suites.
[----------] Global test environment set-up.
[----------] 20 tests from Parameters/TestRpc
[ RUN ] Parameters/TestRpc.TestMessengerCreateDestroy/SSL_UnixSocket
WARNING: Logging before InitGoogleLogging() is written to STDERR
I20260925 10:08:26.226922 2349 rpc-test.cc:169] started messenger TestCreateDestroy
[ OK ] Parameters/TestRpc.TestMessengerCreateDestroy/SSL_UnixSocket (1315 ms)
[ RUN ] Parameters/TestRpc.TestNegotiationDeadlock/SSL_UnixSocket
I20260925 10:08:27.517611 2371 acceptor_pool.cc:254] collecting diagnostics on the listening RPC socket unix:/tmp/dist-test-taskMPjqUk/test-tmp/rpc-test-a8ab06191dba4a878de00b5d9bcb94b3.sock every 8 connection(s)
I20260925 10:08:27.520978 2372 acceptor_pool.cc:254] collecting diagnostics on the listening RPC socket unix:/tmp/dist-test-taskMPjqUk/test-tmp/rpc-test-a8ab06191dba4a878de00b5d9bcb94b3.sock every 8 connection(s)
[ OK ] Parameters/TestRpc.TestNegotiationDeadlock/SSL_UnixSocket (91 ms)
[ RUN ] Parameters/TestRpc.TestCallWithChainCertAndChainCA/SSL_UnixSocket
I20260925 10:08:27.609740 2387 acceptor_pool.cc:254] collecting diagnostics on the listening RPC socket unix:/tmp/dist-test-taskMPjqUk/test-tmp/rpc-test-c53594bccf1b42b286fc3ce20cb538e8.sock every 8 connection(s)
I20260925 10:08:27.611986 2388 acceptor_pool.cc:254] collecting diagnostics on the listening RPC socket unix:/tmp/dist-test-taskMPjqUk/test-tmp/rpc-test-c53594bccf1b42b286fc3ce20cb538e8.sock every 8 connection(s)
/data0/somelongdirectorytoavoidrpathissues/src/kudu/src/kudu/rpc/rpc-test.cc:270: Failure
Failed
Bad status: Runtime error: could not verify certificate chain (error with cert: subject=CN = localhost, ST = sadfjas, C = AS, emailAddress = sdflkdsajf, O = lskdfjlsad, OU = sldfkja, issuer=C = AS, ST = ASDfkjdhf, L = lskdjf, O = saldfja, OU = skdjf, CN = localhost, emailAddress = sadjflkadsj): : certificate has expired
Google Test trace:
/data0/somelongdirectorytoavoidrpathissues/src/kudu/src/kudu/rpc/rpc-test.cc:267: Connecting to unix:/tmp/dist-test-taskMPjqUk/test-tmp/rpc-test-c53594bccf1b42b286fc3ce20cb538e8.sock
I20260925 10:08:27.646896 2349 test_util.cc:175] -----------------------------------------------
I20260925 10:08:27.647084 2349 test_util.cc:176] Had fatal failures, leaving test files at /tmp/dist-test-taskMPjqUk/test-tmp/rpc-test.6.Parameters_TestRpc.TestCallWithChainCertAndChainCA_SSL_UnixSocket.1790330906117408-2349-0
[ FAILED ] Parameters/TestRpc.TestCallWithChainCertAndChainCA/SSL_UnixSocket, where GetParam() = (true, true) (64 ms)
[ RUN ] Parameters/TestRpc.TestCallWithPasswordProtectedKey/SSL_UnixSocket
I20260925 10:08:27.677781 2412 acceptor_pool.cc:254] collecting diagnostics on the listening RPC socket unix:/tmp/dist-test-taskMPjqUk/test-tmp/rpc-test-49e3218fa37f4a87bd4d86468801bfb5.sock every 8 connection(s)
I20260925 10:08:27.678579 2413 acceptor_pool.cc:254] collecting diagnostics on the listening RPC socket unix:/tmp/dist-test-taskMPjqUk/test-tmp/rpc-test-49e3218fa37f4a87bd4d86468801bfb5.sock every 8 connection(s)
W20260925 10:08:27.732753 2409 connection.cc:196] Error closing socket: Network error: TlsSocket::Close: Broken pipe
[ OK ] Parameters/TestRpc.TestCallWithPasswordProtectedKey/SSL_UnixSocket (92 ms)
[ RUN ] Parameters/TestRpc.TestCallToBadServer/SSL_UnixSocket
I20260925 10:08:27.761466 2349 rpc-test.cc:394] Status: Network error: Client connection negotiation failed: client connection to 0.0.0.0:0: connect: Connection refused (error 111)
I20260925 10:08:27.763042 2349 rpc-test.cc:394] Status: Network error: Client connection negotiation failed: client connection to 0.0.0.0:0: connect: Connection refused (error 111)
I20260925 10:08:27.764411 2349 rpc-test.cc:394] Status: Network error: Client connection negotiation failed: client connection to 0.0.0.0:0: connect: Connection refused (error 111)
I20260925 10:08:27.765782 2349 rpc-test.cc:394] Status: Network error: Client connection negotiation failed: client connection to 0.0.0.0:0: connect: Connection refused (error 111)
I20260925 10:08:27.767089 2349 rpc-test.cc:394] Status: Network error: Client connection negotiation failed: client connection to 0.0.0.0:0: connect: Connection refused (error 111)
[ OK ] Parameters/TestRpc.TestCallToBadServer/SSL_UnixSocket (31 ms)
[ RUN ] Parameters/TestRpc.TestWrongService/SSL_UnixSocket
I20260925 10:08:27.808897 2447 acceptor_pool.cc:254] collecting diagnostics on the listening RPC socket unix:/tmp/dist-test-taskMPjqUk/test-tmp/rpc-test-79ed01644dc94799929c2722eda2a249.sock every 8 connection(s)
I20260925 10:08:27.809867 2448 acceptor_pool.cc:254] collecting diagnostics on the listening RPC socket unix:/tmp/dist-test-taskMPjqUk/test-tmp/rpc-test-79ed01644dc94799929c2722eda2a249.sock every 8 connection(s)
I20260925 10:08:27.862123 2444 messenger.cc:345] service WrongServiceName not registered on TestServer
W20260925 10:08:27.865125 2444 connection.cc:196] Error closing socket: Network error: TlsSocket::Close: Broken pipe
[ OK ] Parameters/TestRpc.TestWrongService/SSL_UnixSocket (100 ms)
[ RUN ] Parameters/TestRpc.TestConnectionKeepalive/SSL_UnixSocket
I20260925 10:08:27.895280 2470 acceptor_pool.cc:254] collecting diagnostics on the listening RPC socket unix:/tmp/dist-test-taskMPjqUk/test-tmp/rpc-test-d61c4a9b5f04451b862b18bcf6d30e15.sock every 8 connection(s)
I20260925 10:08:27.896174 2471 acceptor_pool.cc:254] collecting diagnostics on the listening RPC socket unix:/tmp/dist-test-taskMPjqUk/test-tmp/rpc-test-d61c4a9b5f04451b862b18bcf6d30e15.sock every 8 connection(s)
I20260925 10:08:27.900583 2349 rpc-test.cc:488] Connecting to unix:/tmp/dist-test-taskMPjqUk/test-tmp/rpc-test-d61c4a9b5f04451b862b18bcf6d30e15.sock
W20260925 10:08:28.375190 2483 connection.cc:196] Error closing socket: Network error: TlsSocket::Close: Broken pipe
[ OK ] Parameters/TestRpc.TestConnectionKeepalive/SSL_UnixSocket (1080 ms)
[ RUN ] Parameters/TestRpc.TestClientConnectionMetrics/SSL_UnixSocket
I20260925 10:08:28.985176 2495 acceptor_pool.cc:254] collecting diagnostics on the listening RPC socket unix:/tmp/dist-test-taskMPjqUk/test-tmp/rpc-test-bced673023fc4de685ebdf33758508fc.sock every 8 connection(s)
I20260925 10:08:28.985952 2496 acceptor_pool.cc:254] collecting diagnostics on the listening RPC socket unix:/tmp/dist-test-taskMPjqUk/test-tmp/rpc-test-bced673023fc4de685ebdf33758508fc.sock every 8 connection(s)
I20260925 10:08:28.989326 2349 rpc-test.cc:569] Connecting to unix:/tmp/dist-test-taskMPjqUk/test-tmp/rpc-test-bced673023fc4de685ebdf33758508fc.sock
W20260925 10:10:56.665603 2492 connection.cc:196] Error closing socket: Network error: TlsSocket::Close: Broken pipe
[ OK ] Parameters/TestRpc.TestClientConnectionMetrics/SSL_UnixSocket (147722 ms)
[ RUN ] Parameters/TestRpc.TestCredentialsPolicy/SSL_UnixSocket
I20260925 10:10:56.703459 2533 acceptor_pool.cc:254] collecting diagnostics on the listening RPC socket unix:/tmp/dist-test-taskMPjqUk/test-tmp/rpc-test-cf5e3568ceb741ec944da333d046243c.sock every 8 connection(s)
I20260925 10:10:56.704248 2534 acceptor_pool.cc:254] collecting diagnostics on the listening RPC socket unix:/tmp/dist-test-taskMPjqUk/test-tmp/rpc-test-cf5e3568ceb741ec944da333d046243c.sock every 8 connection(s)
I20260925 10:10:56.707726 2349 rpc-test.cc:700] Connecting to unix:/tmp/dist-test-taskMPjqUk/test-tmp/rpc-test-cf5e3568ceb741ec944da333d046243c.sock
W20260925 10:10:56.743005 2532 connection.cc:196] Error closing socket: Network error: TlsSocket::Close: Broken pipe
[ OK ] Parameters/TestRpc.TestCredentialsPolicy/SSL_UnixSocket (91 ms)
[ RUN ] Parameters/TestRpc.TestCallLongerThanKeepalive/SSL_UnixSocket
I20260925 10:10:56.786473 2558 acceptor_pool.cc:254] collecting diagnostics on the listening RPC socket unix:/tmp/dist-test-taskMPjqUk/test-tmp/rpc-test-2642d22ee8ec4726b92d5a6170bd417b.sock every 8 connection(s)
I20260925 10:10:56.787422 2559 acceptor_pool.cc:254] collecting diagnostics on the listening RPC socket unix:/tmp/dist-test-taskMPjqUk/test-tmp/rpc-test-2642d22ee8ec4726b92d5a6170bd417b.sock every 8 connection(s)
I20260925 10:10:56.815830 2562 rpc-test-base.h:222] got call: sleep_micros: 3000000 deferred: true
I20260925 10:10:59.820809 2562 rpcz_store.cc:275] Call kudu.rpc.GenericCalculatorService.Sleep from unix:<unnamed> (request call id 0) took 3005 ms. Trace:
I20260925 10:10:59.821167 2562 rpcz_store.cc:276] 0925 10:10:56.815622 (+ 0us) service_pool.cc:170] Inserting onto call queue
0925 10:10:56.815767 (+ 145us) service_pool.cc:227] Handling call
0925 10:10:59.820755 (+3004988us) inbound_call.cc:173] Queueing success response
Metrics: {}
W20260925 10:10:59.826359 2555 connection.cc:196] Error closing socket: Network error: TlsSocket::Close: Broken pipe
[ OK ] Parameters/TestRpc.TestCallLongerThanKeepalive/SSL_UnixSocket (3065 ms)
[ RUN ] Parameters/TestRpc.TestRpcSidecar/SSL_UnixSocket
I20260925 10:10:59.863096 2583 acceptor_pool.cc:254] collecting diagnostics on the listening RPC socket unix:/tmp/dist-test-taskMPjqUk/test-tmp/rpc-test-6b402bf7997d4500b77e36dc6a6578df.sock every 8 connection(s)
I20260925 10:10:59.863852 2584 acceptor_pool.cc:254] collecting diagnostics on the listening RPC socket unix:/tmp/dist-test-taskMPjqUk/test-tmp/rpc-test-6b402bf7997d4500b77e36dc6a6578df.sock every 8 connection(s)
W20260925 10:11:00.425925 2580 connection.cc:196] Error closing socket: Network error: TlsSocket::Close: Broken pipe
[ OK ] Parameters/TestRpc.TestRpcSidecar/SSL_UnixSocket (599 ms)
[ RUN ] Parameters/TestRpc.TestRpcSidecarLimits/SSL_UnixSocket
I20260925 10:11:19.347074 2610 acceptor_pool.cc:254] collecting diagnostics on the listening RPC socket unix:/tmp/dist-test-taskMPjqUk/test-tmp/rpc-test-3a540fc0070942d0899a34d5c6de8970.sock every 8 connection(s)
I20260925 10:11:19.347836 2611 acceptor_pool.cc:254] collecting diagnostics on the listening RPC socket unix:/tmp/dist-test-taskMPjqUk/test-tmp/rpc-test-3a540fc0070942d0899a34d5c6de8970.sock every 8 connection(s)
W20260925 10:11:19.368266 2349 serialization.cc:72] Serialized kudu.rpc_test.PushStringsRequestPB (2147483654 bytes) is larger than the maximum configured RPC message size (52428800 bytes). Sending anyway, but peer may reject the data.
W20260925 10:11:19.382056 2607 connection.cc:535] server connection from unix:<unnamed> recv error: Network error: RPC frame had a length of 2147483714, but we only support messages up to 52428800 bytes long.
W20260925 10:11:19.382565 2607 connection.cc:158] shutting down server connection from unix:<unnamed> with pending inbound data: 4/2147483714 bytes received; last active 0 ns ago: status Network error: RPC frame had a length of 2147483714, but we only support messages up to 52428800 bytes long.
W20260925 10:11:19.383821 2623 connection.cc:698] client connection to unix:/tmp/dist-test-taskMPjqUk/test-tmp/rpc-test-3a540fc0070942d0899a34d5c6de8970.sock send error: Network error: failed to write to TLS socket: Broken pipe
W20260925 10:11:19.384581 2623 connection.cc:196] Error closing socket: Network error: TlsSocket::Close: Success
[ OK ] Parameters/TestRpc.TestRpcSidecarLimits/SSL_UnixSocket (19646 ms)
[ RUN ] Parameters/TestRpc.TestCallTimeoutDoesntAffectNegotiation/SSL_UnixSocket
I20260925 10:11:20.146863 2635 acceptor_pool.cc:254] collecting diagnostics on the listening RPC socket unix:/tmp/dist-test-taskMPjqUk/test-tmp/rpc-test-a2e75748fb4f4286b4c1b8814ddfe98b.sock every 8 connection(s)
I20260925 10:11:20.147639 2636 acceptor_pool.cc:254] collecting diagnostics on the listening RPC socket unix:/tmp/dist-test-taskMPjqUk/test-tmp/rpc-test-a2e75748fb4f4286b4c1b8814ddfe98b.sock every 8 connection(s)
W20260925 10:11:20.167181 2631 negotiation.cc:266] Injecting 500ms delay in negotiation
I20260925 10:11:20.217518 2349 rpc-test-base.h:595] status: Timed out: connection negotiation to unix:/tmp/dist-test-taskMPjqUk/test-tmp/rpc-test-a2e75748fb4f4286b4c1b8814ddfe98b.sock for RPC Sleep timed out after 0.050s (ON_OUTBOUND_QUEUE), seconds elapsed: 0.051485
W20260925 10:11:20.681739 2632 connection.cc:196] Error closing socket: Network error: TlsSocket::Close: Broken pipe
[ OK ] Parameters/TestRpc.TestCallTimeoutDoesntAffectNegotiation/SSL_UnixSocket (608 ms)
[ RUN ] Parameters/TestRpc.TestRpcHandlerLatencyMetric/SSL_UnixSocket
I20260925 10:11:20.720786 2660 acceptor_pool.cc:254] collecting diagnostics on the listening RPC socket unix:/tmp/dist-test-taskMPjqUk/test-tmp/rpc-test-007aa64abf8d406fb07dd7b6f503e41e.sock every 8 connection(s)
I20260925 10:11:20.721575 2661 acceptor_pool.cc:254] collecting diagnostics on the listening RPC socket unix:/tmp/dist-test-taskMPjqUk/test-tmp/rpc-test-007aa64abf8d406fb07dd7b6f503e41e.sock every 8 connection(s)
I20260925 10:11:20.778801 2349 rpc-test.cc:1236] Sleep() min lat: 21690
I20260925 10:11:20.779098 2349 rpc-test.cc:1237] Sleep() mean lat: 21690
I20260925 10:11:20.779233 2349 rpc-test.cc:1238] Sleep() max lat: 21690
I20260925 10:11:20.779342 2349 rpc-test.cc:1239] Sleep() #calls: 1
[ OK ] Parameters/TestRpc.TestRpcHandlerLatencyMetric/SSL_UnixSocket (100 ms)
[ RUN ] Parameters/TestRpc.TimedOutOnResponseMetricServiceQueue/SSL_UnixSocket
I20260925 10:11:20.811036 2686 acceptor_pool.cc:254] collecting diagnostics on the listening RPC socket unix:/tmp/dist-test-taskMPjqUk/test-tmp/rpc-test-9a37af1e017e4adfa3968cc5219b7f99.sock every 8 connection(s)
I20260925 10:11:20.811787 2687 acceptor_pool.cc:254] collecting diagnostics on the listening RPC socket unix:/tmp/dist-test-taskMPjqUk/test-tmp/rpc-test-9a37af1e017e4adfa3968cc5219b7f99.sock every 8 connection(s)
W20260925 10:11:20.888140 2688 rpcz_store.cc:267] Call kudu.rpc_test.CalculatorService.Sleep from unix:<unnamed> (request call id 2) took 20 ms (client timeout 20 ms). Trace:
W20260925 10:11:20.888556 2688 rpcz_store.cc:269] 0925 10:11:20.867562 (+ 0us) service_pool.cc:170] Inserting onto call queue
0925 10:11:20.887999 (+ 20437us) service_pool.cc:214] Skipping call since client already timed out
0925 10:11:20.888093 (+ 94us) inbound_call.cc:173] Queueing failure response
Metrics: {}
[ OK ] Parameters/TestRpc.TimedOutOnResponseMetricServiceQueue/SSL_UnixSocket (108 ms)
[ RUN ] Parameters/TestRpc.RpcPendingConnectionsMetric/SSL_UnixSocket
I20260925 10:11:20.906934 2709 acceptor_pool.cc:254] collecting diagnostics on the listening RPC socket 0.0.0.0:35379 every 8 connection(s)
I20260925 10:11:20.907704 2710 acceptor_pool.cc:254] collecting diagnostics on the listening RPC socket 0.0.0.0:35379 every 8 connection(s)
W20260925 10:11:20.913203 2705 negotiation.cc:337] Failed RPC negotiation. Trace:
0925 10:11:20.911655 (+ 0us) reactor.cc:625] Submitting negotiation task for server connection from 127.0.0.1:44638 (local address 127.0.0.1:35379)
0925 10:11:20.912167 (+ 512us) server_negotiation.cc:206] Beginning negotiation
0925 10:11:20.912188 (+ 21us) server_negotiation.cc:399] Waiting for connection header
0925 10:11:20.912578 (+ 390us) negotiation.cc:327] Negotiation complete: Network error: Server connection negotiation failed: server connection from 127.0.0.1:44638: BlockingRecv error: recv got EOF from 127.0.0.1:44638 (error 108)
Metrics: {"server-negotiator.queue_time_us":119}
[ OK ] Parameters/TestRpc.RpcPendingConnectionsMetric/SSL_UnixSocket (32 ms)
[ RUN ] Parameters/TestRpc.TestRpcContextClientDeadline/SSL_UnixSocket
I20260925 10:11:20.951490 2725 acceptor_pool.cc:254] collecting diagnostics on the listening RPC socket unix:/tmp/dist-test-taskMPjqUk/test-tmp/rpc-test-6a513140301049908b99e715d6e89aae.sock every 8 connection(s)
I20260925 10:11:20.952461 2726 acceptor_pool.cc:254] collecting diagnostics on the listening RPC socket unix:/tmp/dist-test-taskMPjqUk/test-tmp/rpc-test-6a513140301049908b99e715d6e89aae.sock every 8 connection(s)
[ OK ] Parameters/TestRpc.TestRpcContextClientDeadline/SSL_UnixSocket (105 ms)
[ RUN ] Parameters/TestRpc.TestApplicationFeatureFlagUnsupportedServer/SSL_UnixSocket
I20260925 10:11:21.051541 2750 acceptor_pool.cc:254] collecting diagnostics on the listening RPC socket unix:/tmp/dist-test-taskMPjqUk/test-tmp/rpc-test-eeee2adbe915470e818a36c1fa616d02.sock every 8 connection(s)
I20260925 10:11:21.052412 2751 acceptor_pool.cc:254] collecting diagnostics on the listening RPC socket unix:/tmp/dist-test-taskMPjqUk/test-tmp/rpc-test-eeee2adbe915470e818a36c1fa616d02.sock every 8 connection(s)
W20260925 10:11:21.101614 2747 connection.cc:196] Error closing socket: Network error: TlsSocket::Close: Broken pipe
[ OK ] Parameters/TestRpc.TestApplicationFeatureFlagUnsupportedServer/SSL_UnixSocket (71 ms)
[ RUN ] Parameters/TestRpc.TestCancellationAsync/SSL_UnixSocket
I20260925 10:11:21.125490 2775 acceptor_pool.cc:254] collecting diagnostics on the listening RPC socket unix:/tmp/dist-test-taskMPjqUk/test-tmp/rpc-test-5b5c4b1f751640839227f7355d0866b8.sock every 8 connection(s)
I20260925 10:11:21.126222 2776 acceptor_pool.cc:254] collecting diagnostics on the listening RPC socket unix:/tmp/dist-test-taskMPjqUk/test-tmp/rpc-test-5b5c4b1f751640839227f7355d0866b8.sock every 8 connection(s)
I20260925 10:11:21.129804 2349 rpc-test.cc:1716] Connecting to unix:/tmp/dist-test-taskMPjqUk/test-tmp/rpc-test-5b5c4b1f751640839227f7355d0866b8.sock
I20260925 10:11:21.147957 2349 test_util.cc:268] Using random seed: -266385902
I20260925 10:11:21.381771 2779 rpc-test-base.h:240] got call: sleep_micros: 500 pattern: 4294967295 num_repetitions: 2097152 sidecar_idx: 0
I20260925 10:11:21.617738 2779 rpc-test-base.h:240] got call: sleep_micros: 500 pattern: 4294967295 num_repetitions: 2097152 sidecar_idx: 0
I20260925 10:11:21.838769 2779 rpc-test-base.h:240] got call: sleep_micros: 500 pattern: 4294967295 num_repetitions: 2097152 sidecar_idx: 0
I20260925 10:11:22.067198 2779 rpc-test-base.h:240] got call: sleep_micros: 500 pattern: 4294967295 num_repetitions: 2097152 sidecar_idx: 0
I20260925 10:11:22.277113 2778 rpc-test-base.h:240] got call: sleep_micros: 500 pattern: 4294967295 num_repetitions: 2097152 sidecar_idx: 0
I20260925 10:11:22.507393 2778 rpc-test-base.h:240] got call: sleep_micros: 500 pattern: 4294967295 num_repetitions: 2097152 sidecar_idx: 0
I20260925 10:11:22.732512 2778 rpc-test-base.h:240] got call: sleep_micros: 500 pattern: 4294967295 num_repetitions: 2097152 sidecar_idx: 0
I20260925 10:11:22.936285 2779 rpc-test-base.h:240] got call: sleep_micros: 500 pattern: 4294967295 num_repetitions: 2097152 sidecar_idx: 0
I20260925 10:11:23.197808 2779 rpc-test-base.h:240] got call: sleep_micros: 500 pattern: 4294967295 num_repetitions: 2097152 sidecar_idx: 0
W20260925 10:11:23.220216 2772 connection.cc:196] Error closing socket: Network error: TlsSocket::Close: Broken pipe
W20260925 10:11:23.351256 2772 connection.cc:441] server connection from unix:<unnamed> torn down before Call kudu.rpc.GenericCalculatorService.SleepWithSidecar from unix:<unnamed> (request call id 9) could send its response
[ OK ] Parameters/TestRpc.TestCancellationAsync/SSL_UnixSocket (2255 ms)
[ RUN ] Parameters/TestRpc.TestPerformanceBySocketType/SSL_UnixSocket
I20260925 10:11:23.469008 2800 acceptor_pool.cc:254] collecting diagnostics on the listening RPC socket unix:/tmp/dist-test-taskMPjqUk/test-tmp/rpc-test-3f9f71369a304b48a3cb14493a54bb87.sock every 8 connection(s)
I20260925 10:11:23.469748 2801 acceptor_pool.cc:254] collecting diagnostics on the listening RPC socket unix:/tmp/dist-test-taskMPjqUk/test-tmp/rpc-test-3f9f71369a304b48a3cb14493a54bb87.sock every 8 connection(s)
I20260925 10:11:23.473426 2349 rpc-test.cc:1846] Connecting to unix:/tmp/dist-test-taskMPjqUk/test-tmp/rpc-test-3f9f71369a304b48a3cb14493a54bb87.sock
I20260925 10:11:46.662587 2349 rpc-test.cc:1859] Sending 1024MB via ssl-enabled unix socket: real 23.170s user 20.651s sys 14.522s
I20260925 10:12:09.933570 2349 rpc-test.cc:1859] Sending 1024MB via ssl-enabled unix socket: real 23.270s user 21.267s sys 14.159s
I20260925 10:12:33.081986 2349 rpc-test.cc:1859] Sending 1024MB via ssl-enabled unix socket: real 23.148s user 21.020s sys 14.302s
I20260925 10:12:56.339046 2349 rpc-test.cc:1859] Sending 1024MB via ssl-enabled unix socket: real 23.257s user 21.098s sys 14.193s
I20260925 10:13:19.423998 2349 rpc-test.cc:1859] Sending 1024MB via ssl-enabled unix socket: real 23.084s user 20.735s sys 14.204s
W20260925 10:13:19.433409 2797 connection.cc:196] Error closing socket: Network error: TlsSocket::Close: Broken pipe
[ OK ] Parameters/TestRpc.TestPerformanceBySocketType/SSL_UnixSocket (116087 ms)
[----------] 20 tests from Parameters/TestRpc (293275 ms total)
[----------] 1 test from Parameters/TestRpcSocketTxRxQueue
[ RUN ] Parameters/TestRpcSocketTxRxQueue.AcceptorRxQueueSizeMetric/0
I20260925 10:13:19.472956 2837 acceptor_pool.cc:254] collecting diagnostics on the listening RPC socket 0.0.0.0:37329 every 1 connection(s)
I20260925 10:13:19.473856 2838 acceptor_pool.cc:254] collecting diagnostics on the listening RPC socket 0.0.0.0:37329 every 1 connection(s)
W20260925 10:13:19.480073 2833 negotiation.cc:337] Failed RPC negotiation. Trace:
0925 10:13:19.478092 (+ 0us) reactor.cc:625] Submitting negotiation task for server connection from 127.0.0.1:41942 (local address 127.0.0.1:37329)
0925 10:13:19.478632 (+ 540us) server_negotiation.cc:206] Beginning negotiation
0925 10:13:19.478660 (+ 28us) server_negotiation.cc:399] Waiting for connection header
0925 10:13:19.478964 (+ 304us) negotiation.cc:327] Negotiation complete: Network error: Server connection negotiation failed: server connection from 127.0.0.1:41942: BlockingRecv error: recv got EOF from 127.0.0.1:41942 (error 108)
Metrics: {"server-negotiator.queue_time_us":147}
[ OK ] Parameters/TestRpcSocketTxRxQueue.AcceptorRxQueueSizeMetric/0 (38 ms)
[----------] 1 test from Parameters/TestRpcSocketTxRxQueue (38 ms total)
[----------] Global test environment tear-down
[==========] 21 tests from 2 test suites ran. (293315 ms total)
[ PASSED ] 20 tests.
[ FAILED ] 1 test, listed below:
[ FAILED ] Parameters/TestRpc.TestCallWithChainCertAndChainCA/SSL_UnixSocket, where GetParam() = (true, true)
1 FAILED TEST